lucene-dev mailing list archives

Site index · List index
Message view « Date » · « Thread »
Top « Date » · « Thread »
From Dawid Weiss <dawid.we...@gmail.com>
Subject Re: [JENKINS] Lucene-Solr-NightlyTests-7.7 - Build # 18 - Still Unstable
Date Thu, 23 May 2019 10:29:02 GMT
Hmm... this looks serious, no?
D.

On Thu, May 23, 2019 at 2:27 AM Apache Jenkins Server
<jenkins@builds.apache.org> wrote:
>
> Build: https://builds.apache.org/job/Lucene-Solr-NightlyTests-7.7/18/
>
> 1 tests failed.
> FAILED:  org.apache.lucene.index.TestConcurrentMergeScheduler.testFlushExceptions
>
> Error Message:
>
>
> Stack Trace:
> java.lang.AssertionError
>         at __randomizedtesting.SeedInfo.seed([730AC7E1D88016C6:C760943BD16080F2]:0)
>         at org.junit.Assert.fail(Assert.java:86)
>         at org.junit.Assert.assertTrue(Assert.java:41)
>         at org.junit.Assert.assertTrue(Assert.java:52)
>         at org.apache.lucene.index.TestConcurrentMergeScheduler.testFlushExceptions(TestConcurrentMergeScheduler.java:128)
>         at sun.reflect.NativeMethodAccessorImpl.invoke0(Native Method)
>         at sun.reflect.NativeMethodAccessorImpl.invoke(NativeMethodAccessorImpl.java:62)
>         at sun.reflect.DelegatingMethodAccessorImpl.invoke(DelegatingMethodAccessorImpl.java:43)
>         at java.lang.reflect.Method.invoke(Method.java:498)
>         at com.carrotsearch.randomizedtesting.RandomizedRunner.invoke(RandomizedRunner.java:1750)
>         at com.carrotsearch.randomizedtesting.RandomizedRunner$8.evaluate(RandomizedRunner.java:938)
>         at com.carrotsearch.randomizedtesting.RandomizedRunner$9.evaluate(RandomizedRunner.java:974)
>         at com.carrotsearch.randomizedtesting.RandomizedRunner$10.evaluate(RandomizedRunner.java:988)
>         at org.apache.lucene.util.TestRuleSetupTeardownChained$1.evaluate(TestRuleSetupTeardownChained.java:49)
>         at org.apache.lucene.util.AbstractBeforeAfterRule$1.evaluate(AbstractBeforeAfterRule.java:45)
>         at org.apache.lucene.util.TestRuleThreadAndTestName$1.evaluate(TestRuleThreadAndTestName.java:48)
>         at org.apache.lucene.util.TestRuleIgnoreAfterMaxFailures$1.evaluate(TestRuleIgnoreAfterMaxFailures.java:64)
>         at org.apache.lucene.util.TestRuleMarkFailure$1.evaluate(TestRuleMarkFailure.java:47)
>         at com.carrotsearch.randomizedtesting.rules.StatementAdapter.evaluate(StatementAdapter.java:36)
>         at com.carrotsearch.randomizedtesting.ThreadLeakControl$StatementRunner.run(ThreadLeakControl.java:368)
>         at com.carrotsearch.randomizedtesting.ThreadLeakControl.forkTimeoutingTask(ThreadLeakControl.java:817)
>         at com.carrotsearch.randomizedtesting.ThreadLeakControl$3.evaluate(ThreadLeakControl.java:468)
>         at com.carrotsearch.randomizedtesting.RandomizedRunner.runSingleTest(RandomizedRunner.java:947)
>         at com.carrotsearch.randomizedtesting.RandomizedRunner$5.evaluate(RandomizedRunner.java:832)
>         at com.carrotsearch.randomizedtesting.RandomizedRunner$6.evaluate(RandomizedRunner.java:883)
>         at com.carrotsearch.randomizedtesting.RandomizedRunner$7.evaluate(RandomizedRunner.java:894)
>         at org.apache.lucene.util.AbstractBeforeAfterRule$1.evaluate(AbstractBeforeAfterRule.java:45)
>         at com.carrotsearch.randomizedtesting.rules.StatementAdapter.evaluate(StatementAdapter.java:36)
>         at org.apache.lucene.util.TestRuleStoreClassName$1.evaluate(TestRuleStoreClassName.java:41)
>         at com.carrotsearch.randomizedtesting.rules.NoShadowingOrOverridesOnMethodsRule$1.evaluate(NoShadowingOrOverridesOnMethodsRule.java:40)
>         at com.carrotsearch.randomizedtesting.rules.NoShadowingOrOverridesOnMethodsRule$1.evaluate(NoShadowingOrOverridesOnMethodsRule.java:40)
>         at com.carrotsearch.randomizedtesting.rules.StatementAdapter.evaluate(StatementAdapter.java:36)
>         at com.carrotsearch.randomizedtesting.rules.StatementAdapter.evaluate(StatementAdapter.java:36)
>         at com.carrotsearch.randomizedtesting.rules.StatementAdapter.evaluate(StatementAdapter.java:36)
>         at org.apache.lucene.util.TestRuleAssertionsRequired$1.evaluate(TestRuleAssertionsRequired.java:53)
>         at org.apache.lucene.util.TestRuleMarkFailure$1.evaluate(TestRuleMarkFailure.java:47)
>         at org.apache.lucene.util.TestRuleIgnoreAfterMaxFailures$1.evaluate(TestRuleIgnoreAfterMaxFailures.java:64)
>         at org.apache.lucene.util.TestRuleIgnoreTestSuites$1.evaluate(TestRuleIgnoreTestSuites.java:54)
>         at com.carrotsearch.randomizedtesting.rules.StatementAdapter.evaluate(StatementAdapter.java:36)
>         at com.carrotsearch.randomizedtesting.ThreadLeakControl$StatementRunner.run(ThreadLeakControl.java:368)
>         at java.lang.Thread.run(Thread.java:748)
>
>
>
>
> Build Log:
> [...truncated 991 lines...]
>    [junit4] Suite: org.apache.lucene.index.TestConcurrentMergeScheduler
>    [junit4]   2> NOTE: download the large Jenkins line-docs file by running 'ant get-jenkins-line-docs'
in the lucene directory.
>    [junit4]   2> NOTE: reproduce with: ant test  -Dtestcase=TestConcurrentMergeScheduler
-Dtests.method=testFlushExceptions -Dtests.seed=730AC7E1D88016C6 -Dtests.multiplier=2 -Dtests.nightly=true
-Dtests.slow=true -Dtests.linedocsfile=/home/jenkins/jenkins-slave/workspace/Lucene-Solr-NightlyTests-7.7/test-data/enwiki.random.lines.txt
-Dtests.locale=hr -Dtests.timezone=Asia/Pyongyang -Dtests.asserts=true -Dtests.file.encoding=ISO-8859-1
>    [junit4] FAILURE 0.10s J0 | TestConcurrentMergeScheduler.testFlushExceptions <<<
>    [junit4]    > Throwable #1: java.lang.AssertionError
>    [junit4]    >        at __randomizedtesting.SeedInfo.seed([730AC7E1D88016C6:C760943BD16080F2]:0)
>    [junit4]    >        at org.apache.lucene.index.TestConcurrentMergeScheduler.testFlushExceptions(TestConcurrentMergeScheduler.java:128)
>    [junit4]    >        at java.lang.Thread.run(Thread.java:748)
>    [junit4]   2> NOTE: leaving temporary files on disk at: /x1/jenkins/jenkins-slave/workspace/Lucene-Solr-NightlyTests-7.7/checkout/lucene/build/core/test/J0/temp/lucene.index.TestConcurrentMergeScheduler_730AC7E1D88016C6-001
>    [junit4]   2> NOTE: test params are: codec=Asserting(Lucene70): {field=PostingsFormat(name=Memory),
id=PostingsFormat(name=LuceneFixedGap), content=Lucene50(blocksize=128)}, docValues:{}, maxPointsInLeafNode=1671,
maxMBSortInHeap=6.217899396932761, sim=RandomSimilarity(queryNorm=false): {content=IB LL-DZ(0.3)},
locale=hr, timezone=Asia/Pyongyang
>    [junit4]   2> NOTE: Linux 4.4.0-137-generic amd64/Oracle Corporation 1.8.0_191
(64-bit)/cpus=4,threads=1,free=92748976,total=534773760
>    [junit4]   2> NOTE: All tests run in this JVM: [TestExceedMaxTermLength, TestDocumentsWriterStallControl,
TestDirectory, TestPersistentSnapshotDeletionPolicy, TestNumericDocValuesUpdates, Test4GBStoredFields,
TestRegexpRandom, TestLongRangeFieldQueries, TestToken, TestMergedIterator, TestSimilarityProvider,
TestMixedCodecs, TestTimSorterWorstCase, TestBinaryDocValuesUpdates, TestConcurrentMergeScheduler]
>    [junit4] Completed [193/488 (1!)] on J0 in 22.42s, 16 tests, 1 failure <<<
FAILURES!
>
> [...truncated 64016 lines...]
> [asciidoctor:convert] asciidoctor: ERROR: about-this-guide.adoc: line 1: invalid part,
must have at least one section (e.g., chapter, appendix, etc.)
> [asciidoctor:convert] asciidoctor: ERROR: solr-glossary.adoc: line 1: invalid part, must
have at least one section (e.g., chapter, appendix, etc.)
>      [java] Processed 2465 links (2015 relative) to 3226 anchors in 246 files
>      [echo] Validated Links & Anchors via: /x1/jenkins/jenkins-slave/workspace/Lucene-Solr-NightlyTests-7.7/checkout/solr/build/solr-ref-guide/bare-bones-html/
>
> -documentation-lint:
>     [jtidy] Checking for broken html (such as invalid tags)...
>    [delete] Deleting directory /x1/jenkins/jenkins-slave/workspace/Lucene-Solr-NightlyTests-7.7/checkout/lucene/build/jtidy_tmp
>      [echo] Checking for broken links...
>      [exec]
>      [exec] Crawl/parse...
>      [exec]
>      [exec] Verify...
>      [echo] Checking for malformed docs...
>
> jar-checksums:
>
> resolve:
>
> ivy-availability-check:
> [loadresource] Do not set property disallowed.ivy.jars.list as its length is 0.
>
> -ivy-fail-disallowed-ivy-version:
>
> ivy-fail:
>
> ivy-configure:
> [ivy:configure] :: loading settings :: file = /x1/jenkins/jenkins-slave/workspace/Lucene-Solr-NightlyTests-7.7/checkout/lucene/top-level-ivy-settings.xml
>
> resolve:
>
> ivy-availability-check:
> [loadresource] Do not set property disallowed.ivy.jars.list as its length is 0.
>
> -ivy-fail-disallowed-ivy-version:
>
> ivy-fail:
>
> ivy-configure:
> [ivy:configure] :: loading settings :: file = /x1/jenkins/jenkins-slave/workspace/Lucene-Solr-NightlyTests-7.7/checkout/lucene/top-level-ivy-settings.xml
>
> resolve:
>
> resolve:
>
> ivy-availability-check:
> [loadresource] Do not set property disallowed.ivy.jars.list as its length is 0.
>
> -ivy-fail-disallowed-ivy-version:
>
> ivy-fail:
>
> ivy-configure:
> [ivy:configure] :: loading settings :: file = /x1/jenkins/jenkins-slave/workspace/Lucene-Solr-NightlyTests-7.7/checkout/lucene/top-level-ivy-settings.xml
>
> resolve:
>
> ivy-availability-check:
> [loadresource] Do not set property disallowed.ivy.jars.list as its length is 0.
>
> -ivy-fail-disallowed-ivy-version:
>
> ivy-fail:
>
> ivy-configure:
> [ivy:configure] :: loading settings :: file = /x1/jenkins/jenkins-slave/workspace/Lucene-Solr-NightlyTests-7.7/checkout/lucene/top-level-ivy-settings.xml
>
> resolve:
>
> ivy-availability-check:
> [loadresource] Do not set property disallowed.ivy.jars.list as its length is 0.
>
> -ivy-fail-disallowed-ivy-version:
>
> ivy-fail:
>
> ivy-configure:
> [ivy:configure] :: loading settings :: file = /x1/jenkins/jenkins-slave/workspace/Lucene-Solr-NightlyTests-7.7/checkout/lucene/top-level-ivy-settings.xml
>
> resolve:
>
> ivy-availability-check:
> [loadresource] Do not set property disallowed.ivy.jars.list as its length is 0.
>
> -ivy-fail-disallowed-ivy-version:
>
> ivy-fail:
>
> ivy-configure:
> [ivy:configure] :: loading settings :: file = /x1/jenkins/jenkins-slave/workspace/Lucene-Solr-NightlyTests-7.7/checkout/lucene/top-level-ivy-settings.xml
>
> resolve:
>
> ivy-availability-check:
> [loadresource] Do not set property disallowed.ivy.jars.list as its length is 0.
>
> -ivy-fail-disallowed-ivy-version:
>
> ivy-fail:
>
> ivy-configure:
> [ivy:configure] :: loading settings :: file = /x1/jenkins/jenkins-slave/workspace/Lucene-Solr-NightlyTests-7.7/checkout/lucene/top-level-ivy-settings.xml
>
> resolve:
>
> ivy-availability-check:
> [loadresource] Do not set property disallowed.ivy.jars.list as its length is 0.
>
> -ivy-fail-disallowed-ivy-version:
>
> ivy-fail:
>
> ivy-configure:
> [ivy:configure] :: loading settings :: file = /x1/jenkins/jenkins-slave/workspace/Lucene-Solr-NightlyTests-7.7/checkout/lucene/top-level-ivy-settings.xml
>
> resolve:
>
> ivy-availability-check:
> [loadresource] Do not set property disallowed.ivy.jars.list as its length is 0.
>
> -ivy-fail-disallowed-ivy-version:
>
> ivy-fail:
>
> ivy-configure:
> [ivy:configure] :: loading settings :: file = /x1/jenkins/jenkins-slave/workspace/Lucene-Solr-NightlyTests-7.7/checkout/lucene/top-level-ivy-settings.xml
>
> resolve:
>
> ivy-availability-check:
> [loadresource] Do not set property disallowed.ivy.jars.list as its length is 0.
>
> -ivy-fail-disallowed-ivy-version:
>
> ivy-fail:
>
> ivy-configure:
> [ivy:configure] :: loading settings :: file = /x1/jenkins/jenkins-slave/workspace/Lucene-Solr-NightlyTests-7.7/checkout/lucene/top-level-ivy-settings.xml
>
> resolve:
>
> ivy-availability-check:
> [loadresource] Do not set property disallowed.ivy.jars.list as its length is 0.
>
> -ivy-fail-disallowed-ivy-version:
>
> ivy-fail:
>
> ivy-configure:
> [ivy:configure] :: loading settings :: file = /x1/jenkins/jenkins-slave/workspace/Lucene-Solr-NightlyTests-7.7/checkout/lucene/top-level-ivy-settings.xml
>
> resolve:
>
> ivy-availability-check:
> [loadresource] Do not set property disallowed.ivy.jars.list as its length is 0.
>
> -ivy-fail-disallowed-ivy-version:
>
> ivy-fail:
>
> ivy-configure:
> [ivy:configure] :: loading settings :: file = /x1/jenkins/jenkins-slave/workspace/Lucene-Solr-NightlyTests-7.7/checkout/lucene/top-level-ivy-settings.xml
>
> resolve:
>
> ivy-availability-check:
> [loadresource] Do not set property disallowed.ivy.jars.list as its length is 0.
>
> -ivy-fail-disallowed-ivy-version:
>
> ivy-fail:
>
> ivy-configure:
> [ivy:configure] :: loading settings :: file = /x1/jenkins/jenkins-slave/workspace/Lucene-Solr-NightlyTests-7.7/checkout/lucene/top-level-ivy-settings.xml
>
> resolve:
>
> ivy-availability-check:
> [loadresource] Do not set property disallowed.ivy.jars.list as its length is 0.
>
> -ivy-fail-disallowed-ivy-version:
>
> ivy-fail:
>
> ivy-configure:
> [ivy:configure] :: loading settings :: file = /x1/jenkins/jenkins-slave/workspace/Lucene-Solr-NightlyTests-7.7/checkout/lucene/top-level-ivy-settings.xml
>
> resolve:
>
> ivy-availability-check:
> [loadresource] Do not set property disallowed.ivy.jars.list as its length is 0.
>
> -ivy-fail-disallowed-ivy-version:
>
> ivy-fail:
>
> ivy-configure:
> [ivy:configure] :: loading settings :: file = /x1/jenkins/jenkins-slave/workspace/Lucene-Solr-NightlyTests-7.7/checkout/lucene/top-level-ivy-settings.xml
>
> resolve:
>
> ivy-availability-check:
> [loadresource] Do not set property disallowed.ivy.jars.list as its length is 0.
>
> -ivy-fail-disallowed-ivy-version:
>
> ivy-fail:
>
> ivy-configure:
> [ivy:configure] :: loading settings :: file = /x1/jenkins/jenkins-slave/workspace/Lucene-Solr-NightlyTests-7.7/checkout/lucene/top-level-ivy-settings.xml
>
> resolve:
>
> ivy-availability-check:
> [loadresource] Do not set property disallowed.ivy.jars.list as its length is 0.
>
> -ivy-fail-disallowed-ivy-version:
>
> ivy-fail:
>
> ivy-configure:
> [ivy:configure] :: loading settings :: file = /x1/jenkins/jenkins-slave/workspace/Lucene-Solr-NightlyTests-7.7/checkout/lucene/top-level-ivy-settings.xml
>
> resolve:
>
> ivy-availability-check:
> [loadresource] Do not set property disallowed.ivy.jars.list as its length is 0.
>
> -ivy-fail-disallowed-ivy-version:
>
> ivy-fail:
>
> ivy-configure:
> [ivy:configure] :: loading settings :: file = /x1/jenkins/jenkins-slave/workspace/Lucene-Solr-NightlyTests-7.7/checkout/lucene/top-level-ivy-settings.xml
>
> resolve:
>
> ivy-availability-check:
> [loadresource] Do not set property disallowed.ivy.jars.list as its length is 0.
>
> -ivy-fail-disallowed-ivy-version:
>
> ivy-fail:
>
> ivy-configure:
> [ivy:configure] :: loading settings :: file = /x1/jenkins/jenkins-slave/workspace/Lucene-Solr-NightlyTests-7.7/checkout/lucene/top-level-ivy-settings.xml
>
> resolve:
>
> ivy-availability-check:
> [loadresource] Do not set property disallowed.ivy.jars.list as its length is 0.
>
> -ivy-fail-disallowed-ivy-version:
>
> ivy-fail:
>
> ivy-configure:
> [ivy:configure] :: loading settings :: file = /x1/jenkins/jenkins-slave/workspace/Lucene-Solr-NightlyTests-7.7/checkout/lucene/top-level-ivy-settings.xml
>
> resolve:
>
> ivy-availability-check:
> [loadresource] Do not set property disallowed.ivy.jars.list as its length is 0.
>
> -ivy-fail-disallowed-ivy-version:
>
> ivy-fail:
>
> ivy-configure:
> [ivy:configure] :: loading settings :: file = /x1/jenkins/jenkins-slave/workspace/Lucene-Solr-NightlyTests-7.7/checkout/lucene/top-level-ivy-settings.xml
>
> resolve:
>
> ivy-availability-check:
> [loadresource] Do not set property disallowed.ivy.jars.list as its length is 0.
>
> -ivy-fail-disallowed-ivy-version:
>
> ivy-fail:
>
> ivy-configure:
> [ivy:configure] :: loading settings :: file = /x1/jenkins/jenkins-slave/workspace/Lucene-Solr-NightlyTests-7.7/checkout/lucene/top-level-ivy-settings.xml
>
> resolve:
>
> ivy-availability-check:
> [loadresource] Do not set property disallowed.ivy.jars.list as its length is 0.
>
> -ivy-fail-disallowed-ivy-version:
>
> ivy-fail:
>
> ivy-configure:
> [ivy:configure] :: loading settings :: file = /x1/jenkins/jenkins-slave/workspace/Lucene-Solr-NightlyTests-7.7/checkout/lucene/top-level-ivy-settings.xml
>
> resolve:
>
> ivy-availability-check:
> [loadresource] Do not set property disallowed.ivy.jars.list as its length is 0.
>
> -ivy-fail-disallowed-ivy-version:
>
> ivy-fail:
>
> ivy-configure:
> [ivy:configure] :: loading settings :: file = /x1/jenkins/jenkins-slave/workspace/Lucene-Solr-NightlyTests-7.7/checkout/lucene/top-level-ivy-settings.xml
>
> resolve:
>
> ivy-availability-check:
> [loadresource] Do not set property disallowed.ivy.jars.list as its length is 0.
>
> -ivy-fail-disallowed-ivy-version:
>
> ivy-fail:
>
> ivy-configure:
> [ivy:configure] :: loading settings :: file = /x1/jenkins/jenkins-slave/workspace/Lucene-Solr-NightlyTests-7.7/checkout/lucene/top-level-ivy-settings.xml
>
> resolve:
>
> ivy-availability-check:
> [loadresource] Do not set property disallowed.ivy.jars.list as its length is 0.
>
> -ivy-fail-disallowed-ivy-version:
>
> ivy-fail:
>
> ivy-configure:
> [ivy:configure] :: loading settings :: file = /x1/jenkins/jenkins-slave/workspace/Lucene-Solr-NightlyTests-7.7/checkout/lucene/top-level-ivy-settings.xml
>
> common.resolve:
>
> resolve:
>
> ivy-availability-check:
> [loadresource] Do not set property disallowed.ivy.jars.list as its length is 0.
>
> -ivy-fail-disallowed-ivy-version:
>
> ivy-fail:
>
> ivy-configure:
> [ivy:configure] :: loading settings :: file = /x1/jenkins/jenkins-slave/workspace/Lucene-Solr-NightlyTests-7.7/checkout/lucene/top-level-ivy-settings.xml
>
> resolve:
>
> ivy-availability-check:
> [loadresource] Do not set property disallowed.ivy.jars.list as its length is 0.
>
> -ivy-fail-disallowed-ivy-version:
>
> ivy-fail:
>
> ivy-configure:
> [ivy:configure] :: loading settings :: file = /x1/jenkins/jenkins-slave/workspace/Lucene-Solr-NightlyTests-7.7/checkout/lucene/top-level-ivy-settings.xml
>
> resolve:
>
> ivy-availability-check:
> [loadresource] Do not set property disallowed.ivy.jars.list as its length is 0.
>
> -ivy-fail-disallowed-ivy-version:
>
> ivy-fail:
>
> ivy-configure:
> [ivy:configure] :: loading settings :: file = /x1/jenkins/jenkins-slave/workspace/Lucene-Solr-NightlyTests-7.7/checkout/lucene/top-level-ivy-settings.xml
>
> resolve:
>
> ivy-availability-check:
> [loadresource] Do not set property disallowed.ivy.jars.list as its length is 0.
>
> -ivy-fail-disallowed-ivy-version:
>
> ivy-fail:
>
> ivy-configure:
> [ivy:configure] :: loading settings :: file = /x1/jenkins/jenkins-slave/workspace/Lucene-Solr-NightlyTests-7.7/checkout/lucene/top-level-ivy-settings.xml
>
> resolve:
>
> ivy-availability-check:
> [loadresource] Do not set property disallowed.ivy.jars.list as its length is 0.
>
> -ivy-fail-disallowed-ivy-version:
>
> ivy-fail:
>
> ivy-configure:
> [ivy:configure] :: loading settings :: file = /x1/jenkins/jenkins-slave/workspace/Lucene-Solr-NightlyTests-7.7/checkout/lucene/top-level-ivy-settings.xml
>
> resolve:
>
> jar-checksums:
>     [mkdir] Created dir: /x1/jenkins/jenkins-slave/workspace/Lucene-Solr-NightlyTests-7.7/checkout/lucene/null1636655966
>      [copy] Copying 36 files to /x1/jenkins/jenkins-slave/workspace/Lucene-Solr-NightlyTests-7.7/checkout/lucene/null1636655966
>    [delete] Deleting directory /x1/jenkins/jenkins-slave/workspace/Lucene-Solr-NightlyTests-7.7/checkout/lucene/null1636655966
>
> resolve-example:
>
> ivy-availability-check:
> [loadresource] Do not set property disallowed.ivy.jars.list as its length is 0.
>
> -ivy-fail-disallowed-ivy-version:
>
> ivy-fail:
>
> ivy-configure:
> [ivy:configure] :: loading settings :: file = /x1/jenkins/jenkins-slave/workspace/Lucene-Solr-NightlyTests-7.7/checkout/lucene/top-level-ivy-settings.xml
>
> resolve:
>
> resolve-server:
>
> ivy-availability-check:
> [loadresource] Do not set property disallowed.ivy.jars.list as its length is 0.
>
> -ivy-fail-disallowed-ivy-version:
>
> ivy-fail:
>
> ivy-fail:
>
> ivy-configure:
> [ivy:configure] :: loading settings :: file = /x1/jenkins/jenkins-slave/workspace/Lucene-Solr-NightlyTests-7.7/checkout/lucene/top-level-ivy-settings.xml
>
> resolve:
>
> resolve:
>
> ivy-availability-check:
> [loadresource] Do not set property disallowed.ivy.jars.list as its length is 0.
>
> -ivy-fail-disallowed-ivy-version:
>
> ivy-fail:
>
> ivy-fail:
>
> ivy-configure:
> [ivy:configure] :: loading settings :: file = /x1/jenkins/jenkins-slave/workspace/Lucene-Solr-NightlyTests-7.7/checkout/lucene/top-level-ivy-settings.xml
>
> resolve:
>
> ivy-availability-check:
> [loadresource] Do not set property disallowed.ivy.jars.list as its length is 0.
>
> -ivy-fail-disallowed-ivy-version:
>
> ivy-fail:
>
> ivy-fail:
>
> ivy-configure:
> [ivy:configure] :: loading settings :: file = /x1/jenkins/jenkins-slave/workspace/Lucene-Solr-NightlyTests-7.7/checkout/lucene/top-level-ivy-settings.xml
>
> resolve:
>
> ivy-availability-check:
> [loadresource] Do not set property disallowed.ivy.jars.list as its length is 0.
>
> -ivy-fail-disallowed-ivy-version:
>
> ivy-fail:
>
> ivy-configure:
> [ivy:configure] :: loading settings :: file = /x1/jenkins/jenkins-slave/workspace/Lucene-Solr-NightlyTests-7.7/checkout/lucene/top-level-ivy-settings.xml
>
> resolve:
>
> ivy-availability-check:
> [loadresource] Do not set property disallowed.ivy.jars.list as its length is 0.
>
> -ivy-fail-disallowed-ivy-version:
>
> ivy-fail:
>
> ivy-fail:
>
> ivy-configure:
> [ivy:configure] :: loading settings :: file = /x1/jenkins/jenkins-slave/workspace/Lucene-Solr-NightlyTests-7.7/checkout/lucene/top-level-ivy-settings.xml
>
> resolve:
>
> ivy-availability-check:
> [loadresource] Do not set property disallowed.ivy.jars.list as its length is 0.
>
> -ivy-fail-disallowed-ivy-version:
>
> ivy-fail:
>
> ivy-configure:
> [ivy:configure] :: loading settings :: file = /x1/jenkins/jenkins-slave/workspace/Lucene-Solr-NightlyTests-7.7/checkout/lucene/top-level-ivy-settings.xml
>
> resolve:
>
> ivy-availability-check:
> [loadresource] Do not set property disallowed.ivy.jars.list as its length is 0.
>
> -ivy-fail-disallowed-ivy-version:
>
> ivy-fail:
>
> ivy-fail:
>
> ivy-configure:
> [ivy:configure] :: loading settings :: file = /x1/jenkins/jenkins-slave/workspace/Lucene-Solr-NightlyTests-7.7/checkout/lucene/top-level-ivy-settings.xml
>
> resolve:
>
> ivy-availability-check:
> [loadresource] Do not set property disallowed.ivy.jars.list as its length is 0.
>
> -ivy-fail-disallowed-ivy-version:
>
> ivy-fail:
>
> ivy-fail:
>
> ivy-configure:
> [ivy:configure] :: loading settings :: file = /x1/jenkins/jenkins-slave/workspace/Lucene-Solr-NightlyTests-7.7/checkout/lucene/top-level-ivy-settings.xml
>
> resolve:
>
> ivy-availability-check:
> [loadresource] Do not set property disallowed.ivy.jars.list as its length is 0.
>
> -ivy-fail-disallowed-ivy-version:
>
> ivy-fail:
>
> ivy-fail:
>
> ivy-configure:
> [ivy:configure] :: loading settings :: file = /x1/jenkins/jenkins-slave/workspace/Lucene-Solr-NightlyTests-7.7/checkout/lucene/top-level-ivy-settings.xml
>
> resolve:
>
> ivy-availability-check:
> [loadresource] Do not set property disallowed.ivy.jars.list as its length is 0.
>
> -ivy-fail-disallowed-ivy-version:
>
> ivy-fail:
>
> ivy-fail:
>
> ivy-configure:
> [ivy:configure] :: loading settings :: file = /x1/jenkins/jenkins-slave/workspace/Lucene-Solr-NightlyTests-7.7/checkout/lucene/top-level-ivy-settings.xml
>
> resolve:
>
> ivy-availability-check:
> [loadresource] Do not set property disallowed.ivy.jars.list as its length is 0.
>
> -ivy-fail-disallowed-ivy-version:
>
> ivy-fail:
>
> ivy-fail:
>
> ivy-configure:
> [ivy:configure] :: loading settings :: file = /x1/jenkins/jenkins-slave/workspace/Lucene-Solr-NightlyTests-7.7/checkout/lucene/top-level-ivy-settings.xml
>
> resolve:
>
> ivy-availability-check:
> [loadresource] Do not set property disallowed.ivy.jars.list as its length is 0.
>
> -ivy-fail-disallowed-ivy-version:
>
> ivy-fail:
>
> ivy-fail:
>
> ivy-configure:
> [ivy:configure] :: loading settings :: file = /x1/jenkins/jenkins-slave/workspace/Lucene-Solr-NightlyTests-7.7/checkout/lucene/top-level-ivy-settings.xml
>
> resolve:
>
> ivy-availability-check:
> [loadresource] Do not set property disallowed.ivy.jars.list as its length is 0.
>
> -ivy-fail-disallowed-ivy-version:
>
> ivy-fail:
>
> ivy-fail:
>
> ivy-configure:
> [ivy:configure] :: loading settings :: file = /x1/jenkins/jenkins-slave/workspace/Lucene-Solr-NightlyTests-7.7/checkout/lucene/top-level-ivy-settings.xml
>
> resolve:
>
> ivy-availability-check:
> [loadresource] Do not set property disallowed.ivy.jars.list as its length is 0.
>
> -ivy-fail-disallowed-ivy-version:
>
> ivy-fail:
>
> ivy-fail:
>
> ivy-configure:
> [ivy:configure] :: loading settings :: file = /x1/jenkins/jenkins-slave/workspace/Lucene-Solr-NightlyTests-7.7/checkout/lucene/top-level-ivy-settings.xml
>
> resolve:
>
> ivy-availability-check:
> [loadresource] Do not set property disallowed.ivy.jars.list as its length is 0.
>
> -ivy-fail-disallowed-ivy-version:
>
> ivy-fail:
>
> ivy-fail:
>
> ivy-configure:
> [ivy:configure] :: loading settings :: file = /x1/jenkins/jenkins-slave/workspace/Lucene-Solr-NightlyTests-7.7/checkout/lucene/top-level-ivy-settings.xml
>
> resolve:
>
> ivy-availability-check:
> [loadresource] Do not set property disallowed.ivy.jars.list as its length is 0.
>
> -ivy-fail-disallowed-ivy-version:
>
> ivy-fail:
>
> ivy-fail:
>
> ivy-configure:
> [ivy:configure] :: loading settings :: file = /x1/jenkins/jenkins-slave/workspace/Lucene-Solr-NightlyTests-7.7/checkout/lucene/top-level-ivy-settings.xml
>
> resolve:
>
> jar-checksums:
>     [mkdir] Created dir: /x1/jenkins/jenkins-slave/workspace/Lucene-Solr-NightlyTests-7.7/checkout/solr/null1210438799
>      [copy] Copying 242 files to /x1/jenkins/jenkins-slave/workspace/Lucene-Solr-NightlyTests-7.7/checkout/solr/null1210438799
>    [delete] Deleting directory /x1/jenkins/jenkins-slave/workspace/Lucene-Solr-NightlyTests-7.7/checkout/solr/null1210438799
>
> check-working-copy:
> [ivy:cachepath] :: resolving dependencies :: org.eclipse.jgit#org.eclipse.jgit-caller;working
> [ivy:cachepath]         confs: [default]
> [ivy:cachepath]         found org.eclipse.jgit#org.eclipse.jgit;4.6.0.201612231935-r
in public
> [ivy:cachepath]         found com.jcraft#jsch;0.1.53 in public
> [ivy:cachepath]         found com.googlecode.javaewah#JavaEWAH;1.1.6 in public
> [ivy:cachepath]         found org.apache.httpcomponents#httpclient;4.3.6 in public
> [ivy:cachepath]         found org.apache.httpcomponents#httpcore;4.3.3 in public
> [ivy:cachepath]         found commons-logging#commons-logging;1.1.3 in public
> [ivy:cachepath]         found commons-codec#commons-codec;1.6 in public
> [ivy:cachepath]         found org.slf4j#slf4j-api;1.7.2 in public
> [ivy:cachepath] :: resolution report :: resolve 53ms :: artifacts dl 8ms
>         ---------------------------------------------------------------------
>         |                  |            modules            ||   artifacts   |
>         |       conf       | number| search|dwnlded|evicted|| number|dwnlded|
>         ---------------------------------------------------------------------
>         |      default     |   8   |   0   |   0   |   0   ||   8   |   0   |
>         ---------------------------------------------------------------------
> [wc-checker] Initializing working copy...
> [wc-checker] SLF4J: Failed to load class "org.slf4j.impl.StaticLoggerBinder".
> [wc-checker] SLF4J: Defaulting to no-operation (NOP) logger implementation
> [wc-checker] SLF4J: See http://www.slf4j.org/codes.html#StaticLoggerBinder for further
details.
> [wc-checker] Checking working copy status...
>
> -jenkins-base:
>
> BUILD SUCCESSFUL
> Total time: 261 minutes 19 seconds
> Archiving artifacts
> java.lang.InterruptedException: no matches found within 10000
>         at hudson.FilePath$ValidateAntFileMask.hasMatch(FilePath.java:2847)
>         at hudson.FilePath$ValidateAntFileMask.invoke(FilePath.java:2726)
>         at hudson.FilePath$ValidateAntFileMask.invoke(FilePath.java:2707)
>         at hudson.FilePath$FileCallableWrapper.call(FilePath.java:3086)
> Also:   hudson.remoting.Channel$CallSiteStackTrace: Remote call to lucene
>                 at hudson.remoting.Channel.attachCallSiteStackTrace(Channel.java:1741)
>                 at hudson.remoting.UserRequest$ExceptionResponse.retrieve(UserRequest.java:357)
>                 at hudson.remoting.Channel.call(Channel.java:955)
>                 at hudson.FilePath.act(FilePath.java:1072)
>                 at hudson.FilePath.act(FilePath.java:1061)
>                 at hudson.FilePath.validateAntFileMask(FilePath.java:2705)
>                 at hudson.tasks.ArtifactArchiver.perform(ArtifactArchiver.java:243)
>                 at hudson.tasks.BuildStepCompatibilityLayer.perform(BuildStepCompatibilityLayer.java:81)
>                 at hudson.tasks.BuildStepMonitor$1.perform(BuildStepMonitor.java:20)
>                 at hudson.model.AbstractBuild$AbstractBuildExecution.perform(AbstractBuild.java:744)
>                 at hudson.model.AbstractBuild$AbstractBuildExecution.performAllBuildSteps(AbstractBuild.java:690)
>                 at hudson.model.Build$BuildExecution.post2(Build.java:186)
>                 at hudson.model.AbstractBuild$AbstractBuildExecution.post(AbstractBuild.java:635)
>                 at hudson.model.Run.execute(Run.java:1835)
>                 at hudson.model.FreeStyleBuild.run(FreeStyleBuild.java:43)
>                 at hudson.model.ResourceController.execute(ResourceController.java:97)
>                 at hudson.model.Executor.run(Executor.java:429)
> Caused: hudson.FilePath$TunneledInterruptedException
>         at hudson.FilePath$FileCallableWrapper.call(FilePath.java:3088)
>         at hudson.remoting.UserRequest.perform(UserRequest.java:212)
>         at hudson.remoting.UserRequest.perform(UserRequest.java:54)
>         at hudson.remoting.Request$2.run(Request.java:369)
>         at hudson.remoting.InterceptingExecutorService$1.call(InterceptingExecutorService.java:72)
>         at java.util.concurrent.FutureTask.run(FutureTask.java:266)
>         at java.util.concurrent.ThreadPoolExecutor.runWorker(ThreadPoolExecutor.java:1142)
>         at java.util.concurrent.ThreadPoolExecutor$Worker.run(ThreadPoolExecutor.java:617)
>         at java.lang.Thread.run(Thread.java:748)
> Caused: java.lang.InterruptedException: java.lang.InterruptedException: no matches found
within 10000
>         at hudson.FilePath.act(FilePath.java:1074)
>         at hudson.FilePath.act(FilePath.java:1061)
>         at hudson.FilePath.validateAntFileMask(FilePath.java:2705)
>         at hudson.tasks.ArtifactArchiver.perform(ArtifactArchiver.java:243)
>         at hudson.tasks.BuildStepCompatibilityLayer.perform(BuildStepCompatibilityLayer.java:81)
>         at hudson.tasks.BuildStepMonitor$1.perform(BuildStepMonitor.java:20)
>         at hudson.model.AbstractBuild$AbstractBuildExecution.perform(AbstractBuild.java:744)
>         at hudson.model.AbstractBuild$AbstractBuildExecution.performAllBuildSteps(AbstractBuild.java:690)
>         at hudson.model.Build$BuildExecution.post2(Build.java:186)
>         at hudson.model.AbstractBuild$AbstractBuildExecution.post(AbstractBuild.java:635)
>         at hudson.model.Run.execute(Run.java:1835)
>         at hudson.model.FreeStyleBuild.run(FreeStyleBuild.java:43)
>         at hudson.model.ResourceController.execute(ResourceController.java:97)
>         at hudson.model.Executor.run(Executor.java:429)
> No artifacts found that match the file pattern "**/*.events,heapdumps/**,**/hs_err_pid*".
Configuration error?
> Recording test results
> Build step 'Publish JUnit test result report' changed build result to UNSTABLE
> Email was triggered for: Unstable (Test Failures)
> Sending email for trigger: Unstable (Test Failures)
>
> ---------------------------------------------------------------------
> To unsubscribe, e-mail: dev-unsubscribe@lucene.apache.org
> For additional commands, e-mail: dev-help@lucene.apache.org

---------------------------------------------------------------------
To unsubscribe, e-mail: dev-unsubscribe@lucene.apache.org
For additional commands, e-mail: dev-help@lucene.apache.org


Mime
View raw message