lucene-dev mailing list archives

Site index · List index
Message view « Date » · « Thread »
Top « Date » · « Thread »
From Policeman Jenkins Server <jenk...@thetaphi.de>
Subject [JENKINS-EA] Lucene-Solr-master-Linux (64bit/jdk-13-ea+shipilev-fastdebug) - Build # 24432 - Still Unstable!
Date Mon, 22 Jul 2019 16:57:19 GMT
Build: https://jenkins.thetaphi.de/job/Lucene-Solr-master-Linux/24432/
Java: 64bit/jdk-13-ea+shipilev-fastdebug -XX:+UseCompressedOops -XX:+UseConcMarkSweepGC

1 tests failed.
FAILED:  org.apache.solr.cloud.MetricsHistoryWithAuthIntegrationTest.testValuesAreCollected

Error Message:
Expected memory.heap.used > 0 in history

Stack Trace:
java.lang.AssertionError: Expected memory.heap.used > 0 in history
	at __randomizedtesting.SeedInfo.seed([95057ED33567B7F4:BDF823B4E48328B1]:0)
	at org.junit.Assert.fail(Assert.java:88)
	at org.junit.Assert.assertTrue(Assert.java:41)
	at org.apache.solr.cloud.MetricsHistoryWithAuthIntegrationTest.testValuesAreCollected(MetricsHistoryWithAuthIntegrationTest.java:91)
	at java.base/jdk.internal.reflect.NativeMethodAccessorImpl.invoke0(Native Method)
	at java.base/jdk.internal.reflect.NativeMethodAccessorImpl.invoke(NativeMethodAccessorImpl.java:62)
	at java.base/jdk.internal.reflect.DelegatingMethodAccessorImpl.invoke(DelegatingMethodAccessorImpl.java:43)
	at java.base/java.lang.reflect.Method.invoke(Method.java:567)
	at com.carrotsearch.randomizedtesting.RandomizedRunner.invoke(RandomizedRunner.java:1750)
	at com.carrotsearch.randomizedtesting.RandomizedRunner$8.evaluate(RandomizedRunner.java:938)
	at com.carrotsearch.randomizedtesting.RandomizedRunner$9.evaluate(RandomizedRunner.java:974)
	at com.carrotsearch.randomizedtesting.RandomizedRunner$10.evaluate(RandomizedRunner.java:988)
	at com.carrotsearch.randomizedtesting.rules.SystemPropertiesRestoreRule$1.evaluate(SystemPropertiesRestoreRule.java:57)
	at org.apache.lucene.util.TestRuleSetupTeardownChained$1.evaluate(TestRuleSetupTeardownChained.java:49)
	at org.apache.lucene.util.AbstractBeforeAfterRule$1.evaluate(AbstractBeforeAfterRule.java:45)
	at org.apache.lucene.util.TestRuleThreadAndTestName$1.evaluate(TestRuleThreadAndTestName.java:48)
	at org.apache.lucene.util.TestRuleIgnoreAfterMaxFailures$1.evaluate(TestRuleIgnoreAfterMaxFailures.java:64)
	at org.apache.lucene.util.TestRuleMarkFailure$1.evaluate(TestRuleMarkFailure.java:47)
	at com.carrotsearch.randomizedtesting.rules.StatementAdapter.evaluate(StatementAdapter.java:36)
	at com.carrotsearch.randomizedtesting.ThreadLeakControl$StatementRunner.run(ThreadLeakControl.java:368)
	at com.carrotsearch.randomizedtesting.ThreadLeakControl.forkTimeoutingTask(ThreadLeakControl.java:817)
	at com.carrotsearch.randomizedtesting.ThreadLeakControl$3.evaluate(ThreadLeakControl.java:468)
	at com.carrotsearch.randomizedtesting.RandomizedRunner.runSingleTest(RandomizedRunner.java:947)
	at com.carrotsearch.randomizedtesting.RandomizedRunner$5.evaluate(RandomizedRunner.java:832)
	at com.carrotsearch.randomizedtesting.RandomizedRunner$6.evaluate(RandomizedRunner.java:883)
	at com.carrotsearch.randomizedtesting.RandomizedRunner$7.evaluate(RandomizedRunner.java:894)
	at com.carrotsearch.randomizedtesting.rules.StatementAdapter.evaluate(StatementAdapter.java:36)
	at com.carrotsearch.randomizedtesting.rules.SystemPropertiesRestoreRule$1.evaluate(SystemPropertiesRestoreRule.java:57)
	at org.apache.lucene.util.AbstractBeforeAfterRule$1.evaluate(AbstractBeforeAfterRule.java:45)
	at com.carrotsearch.randomizedtesting.rules.StatementAdapter.evaluate(StatementAdapter.java:36)
	at org.apache.lucene.util.TestRuleStoreClassName$1.evaluate(TestRuleStoreClassName.java:41)
	at com.carrotsearch.randomizedtesting.rules.NoShadowingOrOverridesOnMethodsRule$1.evaluate(NoShadowingOrOverridesOnMethodsRule.java:40)
	at com.carrotsearch.randomizedtesting.rules.NoShadowingOrOverridesOnMethodsRule$1.evaluate(NoShadowingOrOverridesOnMethodsRule.java:40)
	at com.carrotsearch.randomizedtesting.rules.StatementAdapter.evaluate(StatementAdapter.java:36)
	at com.carrotsearch.randomizedtesting.rules.StatementAdapter.evaluate(StatementAdapter.java:36)
	at org.apache.lucene.util.TestRuleAssertionsRequired$1.evaluate(TestRuleAssertionsRequired.java:53)
	at org.apache.lucene.util.TestRuleMarkFailure$1.evaluate(TestRuleMarkFailure.java:47)
	at org.apache.lucene.util.TestRuleIgnoreAfterMaxFailures$1.evaluate(TestRuleIgnoreAfterMaxFailures.java:64)
	at org.apache.lucene.util.TestRuleIgnoreTestSuites$1.evaluate(TestRuleIgnoreTestSuites.java:54)
	at com.carrotsearch.randomizedtesting.rules.StatementAdapter.evaluate(StatementAdapter.java:36)
	at com.carrotsearch.randomizedtesting.ThreadLeakControl$StatementRunner.run(ThreadLeakControl.java:368)
	at java.base/java.lang.Thread.run(Thread.java:830)




Build Log:
[...truncated 2042 lines...]
   [junit4] JVM J1: stderr was not empty, see: /home/jenkins/workspace/Lucene-Solr-master-Linux/lucene/build/core/test/temp/junit4-J1-20190722_143151_7925405159521354575561.syserr
   [junit4] >>> JVM J1 emitted unexpected output (verbatim) ----
   [junit4] OpenJDK 64-Bit Server VM warning: Option UseConcMarkSweepGC was deprecated in version 9.0 and will likely be removed in a future release.
   [junit4] <<< JVM J1: EOF ----

[...truncated 5 lines...]
   [junit4] JVM J2: stderr was not empty, see: /home/jenkins/workspace/Lucene-Solr-master-Linux/lucene/build/core/test/temp/junit4-J2-20190722_143151_7797171288390175148005.syserr
   [junit4] >>> JVM J2 emitted unexpected output (verbatim) ----
   [junit4] OpenJDK 64-Bit Server VM warning: Option UseConcMarkSweepGC was deprecated in version 9.0 and will likely be removed in a future release.
   [junit4] <<< JVM J2: EOF ----

[...truncated 4 lines...]
   [junit4] JVM J0: stderr was not empty, see: /home/jenkins/workspace/Lucene-Solr-master-Linux/lucene/build/core/test/temp/junit4-J0-20190722_143151_7828655184634370596886.syserr
   [junit4] >>> JVM J0 emitted unexpected output (verbatim) ----
   [junit4] OpenJDK 64-Bit Server VM warning: Option UseConcMarkSweepGC was deprecated in version 9.0 and will likely be removed in a future release.
   [junit4] <<< JVM J0: EOF ----

[...truncated 295 lines...]
   [junit4] JVM J0: stderr was not empty, see: /home/jenkins/workspace/Lucene-Solr-master-Linux/lucene/build/test-framework/test/temp/junit4-J0-20190722_145727_97913232044022479567905.syserr
   [junit4] >>> JVM J0 emitted unexpected output (verbatim) ----
   [junit4] OpenJDK 64-Bit Server VM warning: Option UseConcMarkSweepGC was deprecated in version 9.0 and will likely be removed in a future release.
   [junit4] <<< JVM J0: EOF ----

[...truncated 9 lines...]
   [junit4] JVM J2: stderr was not empty, see: /home/jenkins/workspace/Lucene-Solr-master-Linux/lucene/build/test-framework/test/temp/junit4-J2-20190722_145727_9802408783202570541063.syserr
   [junit4] >>> JVM J2 emitted unexpected output (verbatim) ----
   [junit4] OpenJDK 64-Bit Server VM warning: Option UseConcMarkSweepGC was deprecated in version 9.0 and will likely be removed in a future release.
   [junit4] <<< JVM J2: EOF ----

[...truncated 3 lines...]
   [junit4] JVM J1: stderr was not empty, see: /home/jenkins/workspace/Lucene-Solr-master-Linux/lucene/build/test-framework/test/temp/junit4-J1-20190722_145727_98014468157962158520001.syserr
   [junit4] >>> JVM J1 emitted unexpected output (verbatim) ----
   [junit4] OpenJDK 64-Bit Server VM warning: Option UseConcMarkSweepGC was deprecated in version 9.0 and will likely be removed in a future release.
   [junit4] <<< JVM J1: EOF ----

[...truncated 1082 lines...]
   [junit4] JVM J0: stderr was not empty, see: /home/jenkins/workspace/Lucene-Solr-master-Linux/lucene/build/analysis/common/test/temp/junit4-J0-20190722_150230_1081944808822397892637.syserr
   [junit4] >>> JVM J0 emitted unexpected output (verbatim) ----
   [junit4] OpenJDK 64-Bit Server VM warning: Option UseConcMarkSweepGC was deprecated in version 9.0 and will likely be removed in a future release.
   [junit4] <<< JVM J0: EOF ----

[...truncated 3 lines...]
   [junit4] JVM J1: stderr was not empty, see: /home/jenkins/workspace/Lucene-Solr-master-Linux/lucene/build/analysis/common/test/temp/junit4-J1-20190722_150230_10817324442590353518500.syserr
   [junit4] >>> JVM J1 emitted unexpected output (verbatim) ----
   [junit4] OpenJDK 64-Bit Server VM warning: Option UseConcMarkSweepGC was deprecated in version 9.0 and will likely be removed in a future release.
   [junit4] <<< JVM J1: EOF ----

[...truncated 3 lines...]
   [junit4] JVM J2: stderr was not empty, see: /home/jenkins/workspace/Lucene-Solr-master-Linux/lucene/build/analysis/common/test/temp/junit4-J2-20190722_150230_1083662774760881194629.syserr
   [junit4] >>> JVM J2 emitted unexpected output (verbatim) ----
   [junit4] OpenJDK 64-Bit Server VM warning: Option UseConcMarkSweepGC was deprecated in version 9.0 and will likely be removed in a future release.
   [junit4] <<< JVM J2: EOF ----

[...truncated 247 lines...]
   [junit4] JVM J2: stderr was not empty, see: /home/jenkins/workspace/Lucene-Solr-master-Linux/lucene/build/analysis/icu/test/temp/junit4-J2-20190722_150713_2027768636566413517923.syserr
   [junit4] >>> JVM J2 emitted unexpected output (verbatim) ----
   [junit4] OpenJDK 64-Bit Server VM warning: Option UseConcMarkSweepGC was deprecated in version 9.0 and will likely be removed in a future release.
   [junit4] <<< JVM J2: EOF ----

   [junit4] JVM J1: stderr was not empty, see: /home/jenkins/workspace/Lucene-Solr-master-Linux/lucene/build/analysis/icu/test/temp/junit4-J1-20190722_150713_20218043044424256960398.syserr
   [junit4] >>> JVM J1 emitted unexpected output (verbatim) ----
   [junit4] OpenJDK 64-Bit Server VM warning: Option UseConcMarkSweepGC was deprecated in version 9.0 and will likely be removed in a future release.
   [junit4] <<< JVM J1: EOF ----

   [junit4] JVM J0: stderr was not empty, see: /home/jenkins/workspace/Lucene-Solr-master-Linux/lucene/build/analysis/icu/test/temp/junit4-J0-20190722_150713_202405637736251061535.syserr
   [junit4] >>> JVM J0 emitted unexpected output (verbatim) ----
   [junit4] OpenJDK 64-Bit Server VM warning: Option UseConcMarkSweepGC was deprecated in version 9.0 and will likely be removed in a future release.
   [junit4] <<< JVM J0: EOF ----

[...truncated 215 lines...]
   [junit4] JVM J2: stderr was not empty, see: /home/jenkins/workspace/Lucene-Solr-master-Linux/lucene/build/analysis/kuromoji/test/temp/junit4-J2-20190722_150752_04811815383029097020863.syserr
   [junit4] >>> JVM J2 emitted unexpected output (verbatim) ----
   [junit4] OpenJDK 64-Bit Server VM warning: Option UseConcMarkSweepGC was deprecated in version 9.0 and will likely be removed in a future release.
   [junit4] <<< JVM J2: EOF ----

[...truncated 5 lines...]
   [junit4] JVM J0: stderr was not empty, see: /home/jenkins/workspace/Lucene-Solr-master-Linux/lucene/build/analysis/kuromoji/test/temp/junit4-J0-20190722_150752_0488468112734669848791.syserr
   [junit4] >>> JVM J0 emitted unexpected output (verbatim) ----
   [junit4] OpenJDK 64-Bit Server VM warning: Option UseConcMarkSweepGC was deprecated in version 9.0 and will likely be removed in a future release.
   [junit4] <<< JVM J0: EOF ----

[...truncated 3 lines...]
   [junit4] JVM J1: stderr was not empty, see: /home/jenkins/workspace/Lucene-Solr-master-Linux/lucene/build/analysis/kuromoji/test/temp/junit4-J1-20190722_150752_0485812660054044967855.syserr
   [junit4] >>> JVM J1 emitted unexpected output (verbatim) ----
   [junit4] OpenJDK 64-Bit Server VM warning: Option UseConcMarkSweepGC was deprecated in version 9.0 and will likely be removed in a future release.
   [junit4] <<< JVM J1: EOF ----

[...truncated 160 lines...]
   [junit4] JVM J1: stderr was not empty, see: /home/jenkins/workspace/Lucene-Solr-master-Linux/lucene/build/analysis/morfologik/test/temp/junit4-J1-20190722_150900_39017607900273586701685.syserr
   [junit4] JVM J2: stderr was not empty, see: /home/jenkins/workspace/Lucene-Solr-master-Linux/lucene/build/analysis/morfologik/test/temp/junit4-J2-20190722_150900_39318270591510949516560.syserr
   [junit4] >>> JVM J2 emitted unexpected output (verbatim) ----
   [junit4] OpenJDK 64-Bit Server VM warning: Option UseConcMarkSweepGC was deprecated in version 9.0 and will likely be removed in a future release.
   [junit4] <<< JVM J2: EOF ----

[...truncated 3 lines...]
   [junit4] JVM J0: stderr was not empty, see: /home/jenkins/workspace/Lucene-Solr-master-Linux/lucene/build/analysis/morfologik/test/temp/junit4-J0-20190722_150900_38915639962138241594423.syserr
   [junit4] >>> JVM J0 emitted unexpected output (verbatim) ----
   [junit4] OpenJDK 64-Bit Server VM warning: Option UseConcMarkSweepGC was deprecated in version 9.0 and will likely be removed in a future release.
   [junit4] <<< JVM J0: EOF ----

[...truncated 212 lines...]
   [junit4] JVM J2: stderr was not empty, see: /home/jenkins/workspace/Lucene-Solr-master-Linux/lucene/build/analysis/nori/test/temp/junit4-J2-20190722_150923_91410161097366070375744.syserr
   [junit4] JVM J1: stderr was not empty, see: /home/jenkins/workspace/Lucene-Solr-master-Linux/lucene/build/analysis/nori/test/temp/junit4-J1-20190722_150923_9144562856283720280923.syserr
   [junit4] >>> JVM J2 emitted unexpected output (verbatim) ----
   [junit4] OpenJDK 64-Bit Server VM warning: Option UseConcMarkSweepGC was deprecated in version 9.0 and will likely be removed in a future release.
   [junit4] <<< JVM J2: EOF ----

[...truncated 9 lines...]
   [junit4] JVM J0: stderr was not empty, see: /home/jenkins/workspace/Lucene-Solr-master-Linux/lucene/build/analysis/nori/test/temp/junit4-J0-20190722_150923_91413430811938848439469.syserr
   [junit4] >>> JVM J0 emitted unexpected output (verbatim) ----
   [junit4] OpenJDK 64-Bit Server VM warning: Option UseConcMarkSweepGC was deprecated in version 9.0 and will likely be removed in a future release.
   [junit4] <<< JVM J0: EOF ----

[...truncated 160 lines...]
   [junit4] JVM J0: stderr was not empty, see: /home/jenkins/workspace/Lucene-Solr-master-Linux/lucene/build/analysis/opennlp/test/temp/junit4-J0-20190722_151005_01512839128654129194927.syserr
   [junit4] >>> JVM J0 emitted unexpected output (verbatim) ----
   [junit4] OpenJDK 64-Bit Server VM warning: Option UseConcMarkSweepGC was deprecated in version 9.0 and will likely be removed in a future release.
   [junit4] <<< JVM J0: EOF ----

[...truncated 6 lines...]
   [junit4] JVM J2: stderr was not empty, see: /home/jenkins/workspace/Lucene-Solr-master-Linux/lucene/build/analysis/opennlp/test/temp/junit4-J2-20190722_151005_01510909159874008082247.syserr
   [junit4] >>> JVM J2 emitted unexpected output (verbatim) ----
   [junit4] OpenJDK 64-Bit Server VM warning: Option UseConcMarkSweepGC was deprecated in version 9.0 and will likely be removed in a future release.
   [junit4] <<< JVM J2: EOF ----

   [junit4] JVM J1: stderr was not empty, see: /home/jenkins/workspace/Lucene-Solr-master-Linux/lucene/build/analysis/opennlp/test/temp/junit4-J1-20190722_151005_0157897141522258714846.syserr
   [junit4] >>> JVM J1 emitted unexpected output (verbatim) ----
   [junit4] OpenJDK 64-Bit Server VM warning: Option UseConcMarkSweepGC was deprecated in version 9.0 and will likely be removed in a future release.
   [junit4] <<< JVM J1: EOF ----

[...truncated 168 lines...]
   [junit4] JVM J2: stderr was not empty, see: /home/jenkins/workspace/Lucene-Solr-master-Linux/lucene/build/analysis/phonetic/test/temp/junit4-J2-20190722_151023_0631874467544196355966.syserr
   [junit4] >>> JVM J2 emitted unexpected output (verbatim) ----
   [junit4] OpenJDK 64-Bit Server VM warning: Option UseConcMarkSweepGC was deprecated in version 9.0 and will likely be removed in a future release.
   [junit4] <<< JVM J2: EOF ----

[...truncated 3 lines...]
   [junit4] JVM J1: stderr was not empty, see: /home/jenkins/workspace/Lucene-Solr-master-Linux/lucene/build/analysis/phonetic/test/temp/junit4-J1-20190722_151023_0633015877875793474288.syserr
   [junit4] >>> JVM J1 emitted unexpected output (verbatim) ----
   [junit4] OpenJDK 64-Bit Server VM warning: Option UseConcMarkSweepGC was deprecated in version 9.0 and will likely be removed in a future release.
   [junit4] <<< JVM J1: EOF ----

[...truncated 3 lines...]
   [junit4] JVM J0: stderr was not empty, see: /home/jenkins/workspace/Lucene-Solr-master-Linux/lucene/build/analysis/phonetic/test/temp/junit4-J0-20190722_151023_0621163834365821193372.syserr
   [junit4] >>> JVM J0 emitted unexpected output (verbatim) ----
   [junit4] OpenJDK 64-Bit Server VM warning: Option UseConcMarkSweepGC was deprecated in version 9.0 and will likely be removed in a future release.
   [junit4] <<< JVM J0: EOF ----

[...truncated 153 lines...]
   [junit4] JVM J0: stderr was not empty, see: /home/jenkins/workspace/Lucene-Solr-master-Linux/lucene/build/analysis/smartcn/test/temp/junit4-J0-20190722_151059_9114555208028786920241.syserr
   [junit4] >>> JVM J0 emitted unexpected output (verbatim) ----
   [junit4] OpenJDK 64-Bit Server VM warning: Option UseConcMarkSweepGC was deprecated in version 9.0 and will likely be removed in a future release.
   [junit4] <<< JVM J0: EOF ----

[...truncated 3 lines...]
   [junit4] JVM J1: stderr was not empty, see: /home/jenkins/workspace/Lucene-Solr-master-Linux/lucene/build/analysis/smartcn/test/temp/junit4-J1-20190722_151059_91111698352606614905012.syserr
   [junit4] >>> JVM J1 emitted unexpected output (verbatim) ----
   [junit4] OpenJDK 64-Bit Server VM warning: Option UseConcMarkSweepGC was deprecated in version 9.0 and will likely be removed in a future release.
   [junit4] <<< JVM J1: EOF ----

[...truncated 157 lines...]
   [junit4] JVM J2: stderr was not empty, see: /home/jenkins/workspace/Lucene-Solr-master-Linux/lucene/build/analysis/stempel/test/temp/junit4-J2-20190722_151126_80915238831667531620108.syserr
   [junit4] >>> JVM J2 emitted unexpected output (verbatim) ----
   [junit4] OpenJDK 64-Bit Server VM warning: Option UseConcMarkSweepGC was deprecated in version 9.0 and will likely be removed in a future release.
   [junit4] <<< JVM J2: EOF ----

   [junit4] JVM J1: stderr was not empty, see: /home/jenkins/workspace/Lucene-Solr-master-Linux/lucene/build/analysis/stempel/test/temp/junit4-J1-20190722_151126_80975172588530717971.syserr
   [junit4] >>> JVM J1 emitted unexpected output (verbatim) ----
   [junit4] OpenJDK 64-Bit Server VM warning: Option UseConcMarkSweepGC was deprecated in version 9.0 and will likely be removed in a future release.
   [junit4] <<< JVM J1: EOF ----

[...truncated 3 lines...]
   [junit4] JVM J0: stderr was not empty, see: /home/jenkins/workspace/Lucene-Solr-master-Linux/lucene/build/analysis/stempel/test/temp/junit4-J0-20190722_151126_8099235069475239437359.syserr
   [junit4] >>> JVM J0 emitted unexpected output (verbatim) ----
   [junit4] OpenJDK 64-Bit Server VM warning: Option UseConcMarkSweepGC was deprecated in version 9.0 and will likely be removed in a future release.
   [junit4] <<< JVM J0: EOF ----

[...truncated 178 lines...]
   [junit4] JVM J0: stderr was not empty, see: /home/jenkins/workspace/Lucene-Solr-master-Linux/lucene/build/backward-codecs/test/temp/junit4-J0-20190722_151147_37617713875378977971539.syserr
   [junit4] >>> JVM J0 emitted unexpected output (verbatim) ----
   [junit4] OpenJDK 64-Bit Server VM warning: Option UseConcMarkSweepGC was deprecated in version 9.0 and will likely be removed in a future release.
   [junit4] <<< JVM J0: EOF ----

[...truncated 9 lines...]
   [junit4] JVM J2: stderr was not empty, see: /home/jenkins/workspace/Lucene-Solr-master-Linux/lucene/build/backward-codecs/test/temp/junit4-J2-20190722_151147_37717988770810084755078.syserr
   [junit4] >>> JVM J2 emitted unexpected output (verbatim) ----
   [junit4] OpenJDK 64-Bit Server VM warning: Option UseConcMarkSweepGC was deprecated in version 9.0 and will likely be removed in a future release.
   [junit4] <<< JVM J2: EOF ----

[...truncated 9 lines...]
   [junit4] JVM J1: stderr was not empty, see: /home/jenkins/workspace/Lucene-Solr-master-Linux/lucene/build/backward-codecs/test/temp/junit4-J1-20190722_151147_37712648775880768601595.syserr
   [junit4] >>> JVM J1 emitted unexpected output (verbatim) ----
   [junit4] OpenJDK 64-Bit Server VM warning: Option UseConcMarkSweepGC was deprecated in version 9.0 and will likely be removed in a future release.
   [junit4] <<< JVM J1: EOF ----

[...truncated 1440 lines...]
   [junit4] JVM J0: stderr was not empty, see: /home/jenkins/workspace/Lucene-Solr-master-Linux/lucene/build/benchmark/test/temp/junit4-J0-20190722_151745_93014063189000808610397.syserr
   [junit4] >>> JVM J0 emitted unexpected output (verbatim) ----
   [junit4] OpenJDK 64-Bit Server VM warning: Option UseConcMarkSweepGC was deprecated in version 9.0 and will likely be removed in a future release.
   [junit4] <<< JVM J0: EOF ----

[...truncated 3 lines...]
   [junit4] JVM J2: stderr was not empty, see: /home/jenkins/workspace/Lucene-Solr-master-Linux/lucene/build/benchmark/test/temp/junit4-J2-20190722_151745_930184573092785213876.syserr
   [junit4] >>> JVM J2 emitted unexpected output (verbatim) ----
   [junit4] OpenJDK 64-Bit Server VM warning: Option UseConcMarkSweepGC was deprecated in version 9.0 and will likely be removed in a future release.
   [junit4] <<< JVM J2: EOF ----

[...truncated 3 lines...]
   [junit4] JVM J1: stderr was not empty, see: /home/jenkins/workspace/Lucene-Solr-master-Linux/lucene/build/benchmark/test/temp/junit4-J1-20190722_151745_9306843809175268149479.syserr
   [junit4] >>> JVM J1 emitted unexpected output (verbatim) ----
   [junit4] OpenJDK 64-Bit Server VM warning: Option UseConcMarkSweepGC was deprecated in version 9.0 and will likely be removed in a future release.
   [junit4] <<< JVM J1: EOF ----

[...truncated 238 lines...]
   [junit4] JVM J1: stderr was not empty, see: /home/jenkins/workspace/Lucene-Solr-master-Linux/lucene/build/classification/test/temp/junit4-J1-20190722_151828_7941493444851286905614.syserr
   [junit4] >>> JVM J1 emitted unexpected output (verbatim) ----
   [junit4] OpenJDK 64-Bit Server VM warning: Option UseConcMarkSweepGC was deprecated in version 9.0 and will likely be removed in a future release.
   [junit4] <<< JVM J1: EOF ----

   [junit4] JVM J0: stderr was not empty, see: /home/jenkins/workspace/Lucene-Solr-master-Linux/lucene/build/classification/test/temp/junit4-J0-20190722_151828_7941697159135042979099.syserr
   [junit4] >>> JVM J0 emitted unexpected output (verbatim) ----
   [junit4] OpenJDK 64-Bit Server VM warning: Option UseConcMarkSweepGC was deprecated in version 9.0 and will likely be removed in a future release.
   [junit4] <<< JVM J0: EOF ----

[...truncated 3 lines...]
   [junit4] JVM J2: stderr was not empty, see: /home/jenkins/workspace/Lucene-Solr-master-Linux/lucene/build/classification/test/temp/junit4-J2-20190722_151828_79416207540959870440385.syserr
   [junit4] >>> JVM J2 emitted unexpected output (verbatim) ----
   [junit4] OpenJDK 64-Bit Server VM warning: Option UseConcMarkSweepGC was deprecated in version 9.0 and will likely be removed in a future release.
   [junit4] <<< JVM J2: EOF ----

[...truncated 259 lines...]
   [junit4] JVM J0: stderr was not empty, see: /home/jenkins/workspace/Lucene-Solr-master-Linux/lucene/build/codecs/test/temp/junit4-J0-20190722_151913_9114496445379699033550.syserr
   [junit4] >>> JVM J0 emitted unexpected output (verbatim) ----
   [junit4] OpenJDK 64-Bit Server VM warning: Option UseConcMarkSweepGC was deprecated in version 9.0 and will likely be removed in a future release.
   [junit4] <<< JVM J0: EOF ----

[...truncated 3 lines...]
   [junit4] JVM J2: stderr was not empty, see: /home/jenkins/workspace/Lucene-Solr-master-Linux/lucene/build/codecs/test/temp/junit4-J2-20190722_151913_9601401450414606145120.syserr
   [junit4] >>> JVM J2 emitted unexpected output (verbatim) ----
   [junit4] OpenJDK 64-Bit Server VM warning: Option UseConcMarkSweepGC was deprecated in version 9.0 and will likely be removed in a future release.
   [junit4] <<< JVM J2: EOF ----

[...truncated 3 lines...]
   [junit4] JVM J1: stderr was not empty, see: /home/jenkins/workspace/Lucene-Solr-master-Linux/lucene/build/codecs/test/temp/junit4-J1-20190722_151913_94115043020740641114636.syserr
   [junit4] >>> JVM J1 emitted unexpected output (verbatim) ----
   [junit4] OpenJDK 64-Bit Server VM warning: Option UseConcMarkSweepGC was deprecated in version 9.0 and will likely be removed in a future release.
   [junit4] <<< JVM J1: EOF ----

[...truncated 212 lines...]
   [junit4] JVM J1: stderr was not empty, see: /home/jenkins/workspace/Lucene-Solr-master-Linux/lucene/build/demo/test/temp/junit4-J1-20190722_152533_9361357368496681131337.syserr
   [junit4] JVM J0: stderr was not empty, see: /home/jenkins/workspace/Lucene-Solr-master-Linux/lucene/build/demo/test/temp/junit4-J0-20190722_152533_9364859059252062591658.syserr
   [junit4] >>> JVM J0 emitted unexpected output (verbatim) ----
   [junit4] OpenJDK 64-Bit Server VM warning: Option UseConcMarkSweepGC was deprecated in version 9.0 and will likely be removed in a future release.
   [junit4] <<< JVM J0: EOF ----

[...truncated 3 lines...]
   [junit4] JVM J2: stderr was not empty, see: /home/jenkins/workspace/Lucene-Solr-master-Linux/lucene/build/demo/test/temp/junit4-J2-20190722_152533_93710619896491100066927.syserr
   [junit4] >>> JVM J2 emitted unexpected output (verbatim) ----
   [junit4] OpenJDK 64-Bit Server VM warning: Option UseConcMarkSweepGC was deprecated in version 9.0 and will likely be removed in a future release.
   [junit4] <<< JVM J2: EOF ----

[...truncated 170 lines...]
   [junit4] JVM J1: stderr was not empty, see: /home/jenkins/workspace/Lucene-Solr-master-Linux/lucene/build/expressions/test/temp/junit4-J1-20190722_152551_3772539872682181592841.syserr
   [junit4] >>> JVM J1 emitted unexpected output (verbatim) ----
   [junit4] OpenJDK 64-Bit Server VM warning: Option UseConcMarkSweepGC was deprecated in version 9.0 and will likely be removed in a future release.
   [junit4] <<< JVM J1: EOF ----

[...truncated 3 lines...]
   [junit4] JVM J0: stderr was not empty, see: /home/jenkins/workspace/Lucene-Solr-master-Linux/lucene/build/expressions/test/temp/junit4-J0-20190722_152551_37714792909331886970884.syserr
   [junit4] >>> JVM J0 emitted unexpected output (verbatim) ----
   [junit4] OpenJDK 64-Bit Server VM warning: Option UseConcMarkSweepGC was deprecated in version 9.0 and will likely be removed in a future release.
   [junit4] <<< JVM J0: EOF ----

[...truncated 3 lines...]
   [junit4] JVM J2: stderr was not empty, see: /home/jenkins/workspace/Lucene-Solr-master-Linux/lucene/build/expressions/test/temp/junit4-J2-20190722_152551_3771938592880834909030.syserr
   [junit4] >>> JVM J2 emitted unexpected output (verbatim) ----
   [junit4] OpenJDK 64-Bit Server VM warning: Option UseConcMarkSweepGC was deprecated in version 9.0 and will likely be removed in a future release.
   [junit4] <<< JVM J2: EOF ----

[...truncated 226 lines...]
   [junit4] JVM J0: stderr was not empty, see: /home/jenkins/workspace/Lucene-Solr-master-Linux/lucene/build/facet/test/temp/junit4-J0-20190722_152628_2194394279903695046653.syserr
   [junit4] >>> JVM J0 emitted unexpected output (verbatim) ----
   [junit4] OpenJDK 64-Bit Server VM warning: Option UseConcMarkSweepGC was deprecated in version 9.0 and will likely be removed in a future release.
   [junit4] <<< JVM J0: EOF ----

[...truncated 3 lines...]
   [junit4] JVM J1: stderr was not empty, see: /home/jenkins/workspace/Lucene-Solr-master-Linux/lucene/build/facet/test/temp/junit4-J1-20190722_152628_219378827387309236409.syserr
   [junit4] >>> JVM J1 emitted unexpected output (verbatim) ----
   [junit4] OpenJDK 64-Bit Server VM warning: Option UseConcMarkSweepGC was deprecated in version 9.0 and will likely be removed in a future release.
   [junit4] <<< JVM J1: EOF ----

[...truncated 3 lines...]
   [junit4] JVM J2: stderr was not empty, see: /home/jenkins/workspace/Lucene-Solr-master-Linux/lucene/build/facet/test/temp/junit4-J2-20190722_152628_219277204894374177106.syserr
   [junit4] >>> JVM J2 emitted unexpected output (verbatim) ----
   [junit4] OpenJDK 64-Bit Server VM warning: Option UseConcMarkSweepGC was deprecated in version 9.0 and will likely be removed in a future release.
   [junit4] <<< JVM J2: EOF ----

[...truncated 179 lines...]
   [junit4] JVM J2: stderr was not empty, see: /home/jenkins/workspace/Lucene-Solr-master-Linux/lucene/build/grouping/test/temp/junit4-J2-20190722_152812_92414342534040069285725.syserr
   [junit4] >>> JVM J2 emitted unexpected output (verbatim) ----
   [junit4] OpenJDK 64-Bit Server VM warning: Option UseConcMarkSweepGC was deprecated in version 9.0 and will likely be removed in a future release.
   [junit4] <<< JVM J2: EOF ----

[...truncated 3 lines...]
   [junit4] JVM J1: stderr was not empty, see: /home/jenkins/workspace/Lucene-Solr-master-Linux/lucene/build/grouping/test/temp/junit4-J1-20190722_152812_9246989005358974407460.syserr
   [junit4] >>> JVM J1 emitted unexpected output (verbatim) ----
   [junit4] OpenJDK 64-Bit Server VM warning: Option UseConcMarkSweepGC was deprecated in version 9.0 and will likely be removed in a future release.
   [junit4] <<< JVM J1: EOF ----

[...truncated 3 lines...]
   [junit4] JVM J0: stderr was not empty, see: /home/jenkins/workspace/Lucene-Solr-master-Linux/lucene/build/grouping/test/temp/junit4-J0-20190722_152812_92415114116256515830315.syserr
   [junit4] >>> JVM J0 emitted unexpected output (verbatim) ----
   [junit4] OpenJDK 64-Bit Server VM warning: Option UseConcMarkSweepGC was deprecated in version 9.0 and will likely be removed in a future release.
   [junit4] <<< JVM J0: EOF ----

[...truncated 246 lines...]
   [junit4] JVM J0: stderr was not empty, see: /home/jenkins/workspace/Lucene-Solr-master-Linux/lucene/build/highlighter/test/temp/junit4-J0-20190722_152845_09117644419081647979910.syserr
   [junit4] >>> JVM J0 emitted unexpected output (verbatim) ----
   [junit4] OpenJDK 64-Bit Server VM warning: Option UseConcMarkSweepGC was deprecated in version 9.0 and will likely be removed in a future release.
   [junit4] <<< JVM J0: EOF ----

   [junit4] JVM J2: stderr was not empty, see: /home/jenkins/workspace/Lucene-Solr-master-Linux/lucene/build/highlighter/test/temp/junit4-J2-20190722_152845_09113572961572825740391.syserr
   [junit4] >>> JVM J2 emitted unexpected output (verbatim) ----
   [junit4] OpenJDK 64-Bit Server VM warning: Option UseConcMarkSweepGC was deprecated in version 9.0 and will likely be removed in a future release.
   [junit4] <<< JVM J2: EOF ----

[...truncated 3 lines...]
   [junit4] JVM J1: stderr was not empty, see: /home/jenkins/workspace/Lucene-Solr-master-Linux/lucene/build/highlighter/test/temp/junit4-J1-20190722_152845_09117814638464267146262.syserr
   [junit4] >>> JVM J1 emitted unexpected output (verbatim) ----
   [junit4] OpenJDK 64-Bit Server VM warning: Option UseConcMarkSweepGC was deprecated in version 9.0 and will likely be removed in a future release.
   [junit4] <<< JVM J1: EOF ----

[...truncated 163 lines...]
   [junit4] JVM J1: stderr was not empty, see: /home/jenkins/workspace/Lucene-Solr-master-Linux/lucene/build/join/test/temp/junit4-J1-20190722_152950_82615399585605649946071.syserr
   [junit4] >>> JVM J1 emitted unexpected output (verbatim) ----
   [junit4] OpenJDK 64-Bit Server VM warning: Option UseConcMarkSweepGC was deprecated in version 9.0 and will likely be removed in a future release.
   [junit4] <<< JVM J1: EOF ----

[...truncated 6 lines...]
   [junit4] JVM J0: stderr was not empty, see: /home/jenkins/workspace/Lucene-Solr-master-Linux/lucene/build/join/test/temp/junit4-J0-20190722_152950_82614914039880970989713.syserr
   [junit4] >>> JVM J0 emitted unexpected output (verbatim) ----
   [junit4] OpenJDK 64-Bit Server VM warning: Option UseConcMarkSweepGC was deprecated in version 9.0 and will likely be removed in a future release.
   [junit4] <<< JVM J0: EOF ----

[...truncated 3 lines...]
   [junit4] JVM J2: stderr was not empty, see: /home/jenkins/workspace/Lucene-Solr-master-Linux/lucene/build/join/test/temp/junit4-J2-20190722_152950_8264046404727801861062.syserr
   [junit4] >>> JVM J2 emitted unexpected output (verbatim) ----
   [junit4] OpenJDK 64-Bit Server VM warning: Option UseConcMarkSweepGC was deprecated in version 9.0 and will likely be removed in a future release.
   [junit4] <<< JVM J2: EOF ----

[...truncated 271 lines...]
   [junit4] JVM J0: stderr was not empty, see: /home/jenkins/workspace/Lucene-Solr-master-Linux/lucene/build/luke/test/temp/junit4-J0-20190722_153121_23511823028639991048701.syserr
   [junit4] JVM J1: stderr was not empty, see: /home/jenkins/workspace/Lucene-Solr-master-Linux/lucene/build/luke/test/temp/junit4-J1-20190722_153121_2351774086526037640150.syserr
   [junit4] >>> JVM J0 emitted unexpected output (verbatim) ----
   [junit4] OpenJDK 64-Bit Server VM warning: Option UseConcMarkSweepGC was deprecated in version 9.0 and will likely be removed in a future release.
   [junit4] <<< JVM J0: EOF ----

[...truncated 6 lines...]
   [junit4] JVM J2: stderr was not empty, see: /home/jenkins/workspace/Lucene-Solr-master-Linux/lucene/build/luke/test/temp/junit4-J2-20190722_153121_23517568777600382224335.syserr
   [junit4] >>> JVM J2 emitted unexpected output (verbatim) ----
   [junit4] OpenJDK 64-Bit Server VM warning: Option UseConcMarkSweepGC was deprecated in version 9.0 and will likely be removed in a future release.
   [junit4] <<< JVM J2: EOF ----

[...truncated 149 lines...]
   [junit4] JVM J0: stderr was not empty, see: /home/jenkins/workspace/Lucene-Solr-master-Linux/lucene/build/memory/test/temp/junit4-J0-20190722_153145_33918010527667154096490.syserr
   [junit4] >>> JVM J0 emitted unexpected output (verbatim) ----
   [junit4] OpenJDK 64-Bit Server VM warning: Option UseConcMarkSweepGC was deprecated in version 9.0 and will likely be removed in a future release.
   [junit4] <<< JVM J0: EOF ----

[...truncated 3 lines...]
   [junit4] JVM J1: stderr was not empty, see: /home/jenkins/workspace/Lucene-Solr-master-Linux/lucene/build/memory/test/temp/junit4-J1-20190722_153145_3398127337907135398332.syserr
   [junit4] >>> JVM J1 emitted unexpected output (verbatim) ----
   [junit4] OpenJDK 64-Bit Server VM warning: Option UseConcMarkSweepGC was deprecated in version 9.0 and will likely be removed in a future release.
   [junit4] <<< JVM J1: EOF ----

[...truncated 185 lines...]
   [junit4] JVM J0: stderr was not empty, see: /home/jenkins/workspace/Lucene-Solr-master-Linux/lucene/build/misc/test/temp/junit4-J0-20190722_153219_0997826965332223737680.syserr
   [junit4] >>> JVM J0 emitted unexpected output (verbatim) ----
   [junit4] OpenJDK 64-Bit Server VM warning: Option UseConcMarkSweepGC was deprecated in version 9.0 and will likely be removed in a future release.
   [junit4] <<< JVM J0: EOF ----

[...truncated 6 lines...]
   [junit4] JVM J2: stderr was not empty, see: /home/jenkins/workspace/Lucene-Solr-master-Linux/lucene/build/misc/test/temp/junit4-J2-20190722_153219_09911394544658651227460.syserr
   [junit4] >>> JVM J2 emitted unexpected output (verbatim) ----
   [junit4] OpenJDK 64-Bit Server VM warning: Option UseConcMarkSweepGC was deprecated in version 9.0 and will likely be removed in a future release.
   [junit4] <<< JVM J2: EOF ----

[...truncated 3 lines...]
   [junit4] JVM J1: stderr was not empty, see: /home/jenkins/workspace/Lucene-Solr-master-Linux/lucene/build/misc/test/temp/junit4-J1-20190722_153219_09913564962216545349437.syserr
   [junit4] >>> JVM J1 emitted unexpected output (verbatim) ----
   [junit4] OpenJDK 64-Bit Server VM warning: Option UseConcMarkSweepGC was deprecated in version 9.0 and will likely be removed in a future release.
   [junit4] <<< JVM J1: EOF ----

[...truncated 251 lines...]
   [junit4] JVM J1: stderr was not empty, see: /home/jenkins/workspace/Lucene-Solr-master-Linux/lucene/build/monitor/test/temp/junit4-J1-20190722_153325_6132689460826606746259.syserr
   [junit4] >>> JVM J1 emitted unexpected output (verbatim) ----
   [junit4] OpenJDK 64-Bit Server VM warning: Option UseConcMarkSweepGC was deprecated in version 9.0 and will likely be removed in a future release.
   [junit4] <<< JVM J1: EOF ----

[...truncated 3 lines...]
   [junit4] JVM J0: stderr was not empty, see: /home/jenkins/workspace/Lucene-Solr-master-Linux/lucene/build/monitor/test/temp/junit4-J0-20190722_153325_6131985037086084588546.syserr
   [junit4] >>> JVM J0 emitted unexpected output (verbatim) ----
   [junit4] OpenJDK 64-Bit Server VM warning: Option UseConcMarkSweepGC was deprecated in version 9.0 and will likely be removed in a future release.
   [junit4] <<< JVM J0: EOF ----

[...truncated 3 lines...]
   [junit4] JVM J2: stderr was not empty, see: /home/jenkins/workspace/Lucene-Solr-master-Linux/lucene/build/monitor/test/temp/junit4-J2-20190722_153325_614870664011227553845.syserr
   [junit4] >>> JVM J2 emitted unexpected output (verbatim) ----
   [junit4] OpenJDK 64-Bit Server VM warning: Option UseConcMarkSweepGC was deprecated in version 9.0 and will likely be removed in a future release.
   [junit4] <<< JVM J2: EOF ----

[...truncated 313 lines...]
   [junit4] JVM J1: stderr was not empty, see: /home/jenkins/workspace/Lucene-Solr-master-Linux/lucene/build/queries/test/temp/junit4-J1-20190722_153400_5076866824821876277574.syserr
   [junit4] >>> JVM J1 emitted unexpected output (verbatim) ----
   [junit4] Suite: org.apache.lucene.queries.payloads.TestPayloadScoreQuery
   [junit4] Completed [24/25] on J2 in 3.04s, 7 tests
   [junit4] 
   [junit4] OpenJDK 64-Bit Server VM warning: Option UseConcMarkSweepGC was deprecated in version 9.0 and will likely be removed in a future release.
   [junit4] <<< JVM J1: EOF ----

[...truncated 3 lines...]
   [junit4] JVM J2: stderr was not empty, see: /home/jenkins/workspace/Lucene-Solr-master-Linux/lucene/build/queries/test/temp/junit4-J2-20190722_153400_5066323900043635478287.syserr
   [junit4] >>> JVM J2 emitted unexpected output (verbatim) ----
   [junit4] OpenJDK 64-Bit Server VM warning: Option UseConcMarkSweepGC was deprecated in version 9.0 and will likely be removed in a future release.
   [junit4] <<< JVM J2: EOF ----

   [junit4] JVM J0: stderr was not empty, see: /home/jenkins/workspace/Lucene-Solr-master-Linux/lucene/build/queries/test/temp/junit4-J0-20190722_153400_5069351248575403659974.syserr
   [junit4] >>> JVM J0 emitted unexpected output (verbatim) ----
   [junit4] OpenJDK 64-Bit Server VM warning: Option UseConcMarkSweepGC was deprecated in version 9.0 and will likely be removed in a future release.
   [junit4] <<< JVM J0: EOF ----

[...truncated 223 lines...]
   [junit4] JVM J2: stderr was not empty, see: /home/jenkins/workspace/Lucene-Solr-master-Linux/lucene/build/queryparser/test/temp/junit4-J2-20190722_153437_6033183779256132434325.syserr
   [junit4] >>> JVM J2 emitted unexpected output (verbatim) ----
   [junit4] OpenJDK 64-Bit Server VM warning: Option UseConcMarkSweepGC was deprecated in version 9.0 and will likely be removed in a future release.
   [junit4] <<< JVM J2: EOF ----

[...truncated 3 lines...]
   [junit4] JVM J0: stderr was not empty, see: /home/jenkins/workspace/Lucene-Solr-master-Linux/lucene/build/queryparser/test/temp/junit4-J0-20190722_153437_60316996128215410882183.syserr
   [junit4] >>> JVM J0 emitted unexpected output (verbatim) ----
   [junit4] OpenJDK 64-Bit Server VM warning: Option UseConcMarkSweepGC was deprecated in version 9.0 and will likely be removed in a future release.
   [junit4] <<< JVM J0: EOF ----

[...truncated 3 lines...]
   [junit4] JVM J1: stderr was not empty, see: /home/jenkins/workspace/Lucene-Solr-master-Linux/lucene/build/queryparser/test/temp/junit4-J1-20190722_153437_60310602800845364078377.syserr
   [junit4] >>> JVM J1 emitted unexpected output (verbatim) ----
   [junit4] OpenJDK 64-Bit Server VM warning: Option UseConcMarkSweepGC was deprecated in version 9.0 and will likely be removed in a future release.
   [junit4] <<< JVM J1: EOF ----

[...truncated 186 lines...]
   [junit4] JVM J2: stderr was not empty, see: /home/jenkins/workspace/Lucene-Solr-master-Linux/lucene/build/replicator/test/temp/junit4-J2-20190722_153512_50717359948201121884900.syserr
   [junit4] >>> JVM J2 emitted unexpected output (verbatim) ----
   [junit4] OpenJDK 64-Bit Server VM warning: Option UseConcMarkSweepGC was deprecated in version 9.0 and will likely be removed in a future release.
   [junit4] <<< JVM J2: EOF ----

[...truncated 26 lines...]
   [junit4] JVM J0: stderr was not empty, see: /home/jenkins/workspace/Lucene-Solr-master-Linux/lucene/build/replicator/test/temp/junit4-J0-20190722_153512_50710002254667923825150.syserr
   [junit4] >>> JVM J0 emitted unexpected output (verbatim) ----
   [junit4] OpenJDK 64-Bit Server VM warning: Option UseConcMarkSweepGC was deprecated in version 9.0 and will likely be removed in a future release.
   [junit4] <<< JVM J0: EOF ----

[...truncated 3 lines...]
   [junit4] JVM J1: stderr was not empty, see: /home/jenkins/workspace/Lucene-Solr-master-Linux/lucene/build/replicator/test/temp/junit4-J1-20190722_153512_5073793746781978135392.syserr
   [junit4] >>> JVM J1 emitted unexpected output (verbatim) ----
   [junit4] OpenJDK 64-Bit Server VM warning: Option UseConcMarkSweepGC was deprecated in version 9.0 and will likely be removed in a future release.
   [junit4] <<< JVM J1: EOF ----

[...truncated 275 lines...]
   [junit4] JVM J0: stderr was not empty, see: /home/jenkins/workspace/Lucene-Solr-master-Linux/lucene/build/sandbox/test/temp/junit4-J0-20190722_153551_1201481131115503246142.syserr
   [junit4] >>> JVM J0 emitted unexpected output (verbatim) ----
   [junit4] OpenJDK 64-Bit Server VM warning: Option UseConcMarkSweepGC was deprecated in version 9.0 and will likely be removed in a future release.
   [junit4] <<< JVM J0: EOF ----

[...truncated 3 lines...]
   [junit4] JVM J2: stderr was not empty, see: /home/jenkins/workspace/Lucene-Solr-master-Linux/lucene/build/sandbox/test/temp/junit4-J2-20190722_153551_12014508745248798158564.syserr
   [junit4] >>> JVM J2 emitted unexpected output (verbatim) ----
   [junit4] OpenJDK 64-Bit Server VM warning: Option UseConcMarkSweepGC was deprecated in version 9.0 and will likely be removed in a future release.
   [junit4] <<< JVM J2: EOF ----

[...truncated 3 lines...]
   [junit4] JVM J1: stderr was not empty, see: /home/jenkins/workspace/Lucene-Solr-master-Linux/lucene/build/sandbox/test/temp/junit4-J1-20190722_153551_120999565946437330059.syserr
   [junit4] >>> JVM J1 emitted unexpected output (verbatim) ----
   [junit4] OpenJDK 64-Bit Server VM warning: Option UseConcMarkSweepGC was deprecated in version 9.0 and will likely be removed in a future release.
   [junit4] <<< JVM J1: EOF ----

[...truncated 297 lines...]
   [junit4] JVM J0: stderr was not empty, see: /home/jenkins/workspace/Lucene-Solr-master-Linux/lucene/build/spatial-extras/test/temp/junit4-J0-20190722_154004_7169207846488359487413.syserr
   [junit4] >>> JVM J0 emitted unexpected output (verbatim) ----
   [junit4] OpenJDK 64-Bit Server VM warning: Option UseConcMarkSweepGC was deprecated in version 9.0 and will likely be removed in a future release.
   [junit4] <<< JVM J0: EOF ----

[...truncated 3 lines...]
   [junit4] JVM J2: stderr was not empty, see: /home/jenkins/workspace/Lucene-Solr-master-Linux/lucene/build/spatial-extras/test/temp/junit4-J2-20190722_154004_7165582230928546431208.syserr
   [junit4] >>> JVM J2 emitted unexpected output (verbatim) ----
   [junit4] OpenJDK 64-Bit Server VM warning: Option UseConcMarkSweepGC was deprecated in version 9.0 and will likely be removed in a future release.
   [junit4] <<< JVM J2: EOF ----

[...truncated 3 lines...]
   [junit4] JVM J1: stderr was not empty, see: /home/jenkins/workspace/Lucene-Solr-master-Linux/lucene/build/spatial-extras/test/temp/junit4-J1-20190722_154004_71638954743211049055.syserr
   [junit4] >>> JVM J1 emitted unexpected output (verbatim) ----
   [junit4] OpenJDK 64-Bit Server VM warning: Option UseConcMarkSweepGC was deprecated in version 9.0 and will likely be removed in a future release.
   [junit4] <<< JVM J1: EOF ----

[...truncated 148 lines...]
   [junit4] JVM J0: stderr was not empty, see: /home/jenkins/workspace/Lucene-Solr-master-Linux/lucene/build/spatial/test/temp/junit4-J0-20190722_154127_9586332768307247417664.syserr
   [junit4] >>> JVM J0 emitted unexpected output (verbatim) ----
   [junit4] OpenJDK 64-Bit Server VM warning: Option UseConcMarkSweepGC was deprecated in version 9.0 and will likely be removed in a future release.
   [junit4] <<< JVM J0: EOF ----

[...truncated 181 lines...]
   [junit4] JVM J2: stderr was not empty, see: /home/jenkins/workspace/Lucene-Solr-master-Linux/lucene/build/spatial3d/test/temp/junit4-J2-20190722_154140_45315665362469940435623.syserr
   [junit4] >>> JVM J2 emitted unexpected output (verbatim) ----
   [junit4] OpenJDK 64-Bit Server VM warning: Option UseConcMarkSweepGC was deprecated in version 9.0 and will likely be removed in a future release.
   [junit4] <<< JVM J2: EOF ----

[...truncated 3 lines...]
   [junit4] JVM J0: stderr was not empty, see: /home/jenkins/workspace/Lucene-Solr-master-Linux/lucene/build/spatial3d/test/temp/junit4-J0-20190722_154140_45310826920841151533417.syserr
   [junit4] >>> JVM J0 emitted unexpected output (verbatim) ----
   [junit4] OpenJDK 64-Bit Server VM warning: Option UseConcMarkSweepGC was deprecated in version 9.0 and will likely be removed in a future release.
   [junit4] <<< JVM J0: EOF ----

[...truncated 7 lines...]
   [junit4] JVM J1: stderr was not empty, see: /home/jenkins/workspace/Lucene-Solr-master-Linux/lucene/build/spatial3d/test/temp/junit4-J1-20190722_154140_4533905742221275538354.syserr
   [junit4] >>> JVM J1 emitted unexpected output (verbatim) ----
   [junit4] OpenJDK 64-Bit Server VM warning: Option UseConcMarkSweepGC was deprecated in version 9.0 and will likely be removed in a future release.
   [junit4] <<< JVM J1: EOF ----

[...truncated 242 lines...]
   [junit4] JVM J2: stderr was not empty, see: /home/jenkins/workspace/Lucene-Solr-master-Linux/lucene/build/suggest/test/temp/junit4-J2-20190722_154412_15115163581579043682018.syserr
   [junit4] >>> JVM J2 emitted unexpected output (verbatim) ----
   [junit4] OpenJDK 64-Bit Server VM warning: Option UseConcMarkSweepGC was deprecated in version 9.0 and will likely be removed in a future release.
   [junit4] <<< JVM J2: EOF ----

[...truncated 4 lines...]
   [junit4] JVM J1: stderr was not empty, see: /home/jenkins/workspace/Lucene-Solr-master-Linux/lucene/build/suggest/test/temp/junit4-J1-20190722_154412_1521334284033231255883.syserr
   [junit4] >>> JVM J1 emitted unexpected output (verbatim) ----
   [junit4] OpenJDK 64-Bit Server VM warning: Option UseConcMarkSweepGC was deprecated in version 9.0 and will likely be removed in a future release.
   [junit4] <<< JVM J1: EOF ----

[...truncated 12 lines...]
   [junit4] JVM J0: stderr was not empty, see: /home/jenkins/workspace/Lucene-Solr-master-Linux/lucene/build/suggest/test/temp/junit4-J0-20190722_154412_15113382360683025192202.syserr
   [junit4] >>> JVM J0 emitted unexpected output (verbatim) ----
   [junit4] OpenJDK 64-Bit Server VM warning: Option UseConcMarkSweepGC was deprecated in version 9.0 and will likely be removed in a future release.
   [junit4] <<< JVM J0: EOF ----

[...truncated 3305 lines...]
   [junit4] Suite: org.apache.solr.cloud.MetricsHistoryWithAuthIntegrationTest
   [junit4]   2> Creating dataDir: /home/jenkins/workspace/Lucene-Solr-master-Linux/solr/build/solr-core/test/J0/temp/solr.cloud.MetricsHistoryWithAuthIntegrationTest_95057ED33567B7F4-001/init-core-data-001
   [junit4]   2> 1280635 INFO  (SUITE-MetricsHistoryWithAuthIntegrationTest-seed#[95057ED33567B7F4]-worker) [     ] o.a.s.SolrTestCaseJ4 Using PointFields (NUMERIC_POINTS_SYSPROP=true) w/NUMERIC_DOCVALUES_SYSPROP=false
   [junit4]   2> 1280635 INFO  (SUITE-MetricsHistoryWithAuthIntegrationTest-seed#[95057ED33567B7F4]-worker) [     ] o.a.s.SolrTestCaseJ4 Randomized ssl (false) and clientAuth (false) via: @org.apache.solr.util.RandomizeSSL(reason="", value=0.0/0.0, ssl=0.0/0.0, clientAuth=0.0/0.0)
   [junit4]   2> 1280635 INFO  (SUITE-MetricsHistoryWithAuthIntegrationTest-seed#[95057ED33567B7F4]-worker) [     ] o.a.s.SolrTestCaseJ4 SecureRandom sanity checks: test.solr.allowed.securerandom=null & java.security.egd=file:/dev/./urandom
   [junit4]   2> 1280636 INFO  (SUITE-MetricsHistoryWithAuthIntegrationTest-seed#[95057ED33567B7F4]-worker) [     ] o.a.s.c.MiniSolrCloudCluster Starting cluster of 1 servers in /home/jenkins/workspace/Lucene-Solr-master-Linux/solr/build/solr-core/test/J0/temp/solr.cloud.MetricsHistoryWithAuthIntegrationTest_95057ED33567B7F4-001/tempDir-001
   [junit4]   2> 1280636 INFO  (SUITE-MetricsHistoryWithAuthIntegrationTest-seed#[95057ED33567B7F4]-worker) [     ] o.a.s.c.ZkTestServer STARTING ZK TEST SERVER
   [junit4]   2> 1280637 INFO  (ZkTestServer Run Thread) [     ] o.a.s.c.ZkTestServer client port:0.0.0.0/0.0.0.0:0
   [junit4]   2> 1280637 INFO  (ZkTestServer Run Thread) [     ] o.a.s.c.ZkTestServer Starting server
   [junit4]   2> 1280737 INFO  (SUITE-MetricsHistoryWithAuthIntegrationTest-seed#[95057ED33567B7F4]-worker) [     ] o.a.s.c.ZkTestServer start zk server on port:33735
   [junit4]   2> 1280737 INFO  (SUITE-MetricsHistoryWithAuthIntegrationTest-seed#[95057ED33567B7F4]-worker) [     ] o.a.s.c.ZkTestServer parse host and port list: 127.0.0.1:33735
   [junit4]   2> 1280737 INFO  (SUITE-MetricsHistoryWithAuthIntegrationTest-seed#[95057ED33567B7F4]-worker) [     ] o.a.s.c.ZkTestServer connecting to 127.0.0.1 33735
   [junit4]   2> 1280741 INFO  (SUITE-MetricsHistoryWithAuthIntegrationTest-seed#[95057ED33567B7F4]-worker) [     ] o.a.s.c.c.ConnectionManager Waiting for client to connect to ZooKeeper
   [junit4]   2> 1280750 INFO  (zkConnectionManagerCallback-4745-thread-1) [     ] o.a.s.c.c.ConnectionManager zkClient has connected
   [junit4]   2> 1280750 INFO  (SUITE-MetricsHistoryWithAuthIntegrationTest-seed#[95057ED33567B7F4]-worker) [     ] o.a.s.c.c.ConnectionManager Client is connected to ZooKeeper
   [junit4]   2> 1280759 INFO  (SUITE-MetricsHistoryWithAuthIntegrationTest-seed#[95057ED33567B7F4]-worker) [     ] o.a.s.c.c.ConnectionManager Waiting for client to connect to ZooKeeper
   [junit4]   2> 1280763 INFO  (zkConnectionManagerCallback-4747-thread-1) [     ] o.a.s.c.c.ConnectionManager zkClient has connected
   [junit4]   2> 1280763 INFO  (SUITE-MetricsHistoryWithAuthIntegrationTest-seed#[95057ED33567B7F4]-worker) [     ] o.a.s.c.c.ConnectionManager Client is connected to ZooKeeper
   [junit4]   2> 1280764 INFO  (SUITE-MetricsHistoryWithAuthIntegrationTest-seed#[95057ED33567B7F4]-worker) [     ] o.a.s.c.c.ConnectionManager Waiting for client to connect to ZooKeeper
   [junit4]   2> 1280766 INFO  (zkConnectionManagerCallback-4749-thread-1) [     ] o.a.s.c.c.ConnectionManager zkClient has connected
   [junit4]   2> 1280766 INFO  (SUITE-MetricsHistoryWithAuthIntegrationTest-seed#[95057ED33567B7F4]-worker) [     ] o.a.s.c.c.ConnectionManager Client is connected to ZooKeeper
   [junit4]   2> 1280891 WARN  (jetty-launcher-4750-thread-1) [     ] o.e.j.s.AbstractConnector Ignoring deprecated socket close linger time
   [junit4]   2> 1280891 INFO  (jetty-launcher-4750-thread-1) [     ] o.a.s.c.s.e.JettySolrRunner Start Jetty (original configured port=0)
   [junit4]   2> 1280891 INFO  (jetty-launcher-4750-thread-1) [     ] o.a.s.c.s.e.JettySolrRunner Trying to start Jetty on port 0 try number 1 ...
   [junit4]   2> 1280891 INFO  (jetty-launcher-4750-thread-1) [     ] o.e.j.s.Server jetty-9.4.19.v20190610; built: 2019-06-10T16:30:51.723Z; git: afcf563148970e98786327af5e07c261fda175d3; jvm 13-testing+0-builds.shipilev.net-openjdk-jdk13-b9-20190621-jdk-1326
   [junit4]   2> 1280892 INFO  (jetty-launcher-4750-thread-1) [     ] o.e.j.s.session DefaultSessionIdManager workerName=node0
   [junit4]   2> 1280892 INFO  (jetty-launcher-4750-thread-1) [     ] o.e.j.s.session No SessionScavenger set, using defaults
   [junit4]   2> 1280892 INFO  (jetty-launcher-4750-thread-1) [     ] o.e.j.s.session node0 Scavenging every 660000ms
   [junit4]   2> 1280892 INFO  (jetty-launcher-4750-thread-1) [     ] o.e.j.s.h.ContextHandler Started o.e.j.s.ServletContextHandler@103d4d24{/solr,null,AVAILABLE}
   [junit4]   2> 1280893 INFO  (jetty-launcher-4750-thread-1) [     ] o.e.j.s.AbstractConnector Started ServerConnector@3eb8b9c5{HTTP/1.1,[http/1.1, h2c]}{127.0.0.1:44095}
   [junit4]   2> 1280893 INFO  (jetty-launcher-4750-thread-1) [     ] o.e.j.s.Server Started @1281242ms
   [junit4]   2> 1280893 INFO  (jetty-launcher-4750-thread-1) [     ] o.a.s.c.s.e.JettySolrRunner Jetty properties: {hostContext=/solr, hostPort=44095}
   [junit4]   2> 1280893 ERROR (jetty-launcher-4750-thread-1) [     ] o.a.s.u.StartupLoggingUtils Missing Java Option solr.log.dir. Logging may be missing or incomplete.
   [junit4]   2> 1280893 INFO  (jetty-launcher-4750-thread-1) [     ] o.a.s.s.SolrDispatchFilter Using logger factory org.apache.logging.slf4j.Log4jLoggerFactory
   [junit4]   2> 1280893 INFO  (jetty-launcher-4750-thread-1) [     ] o.a.s.s.SolrDispatchFilter  ___      _       Welcome to Apache Solr? version 9.0.0
   [junit4]   2> 1280893 INFO  (jetty-launcher-4750-thread-1) [     ] o.a.s.s.SolrDispatchFilter / __| ___| |_ _   Starting in cloud mode on port null
   [junit4]   2> 1280893 INFO  (jetty-launcher-4750-thread-1) [     ] o.a.s.s.SolrDispatchFilter \__ \/ _ \ | '_|  Install dir: null
   [junit4]   2> 1280893 INFO  (jetty-launcher-4750-thread-1) [     ] o.a.s.s.SolrDispatchFilter |___/\___/_|_|    Start time: 2019-07-22T16:08:46.263994Z
   [junit4]   2> 1280895 INFO  (jetty-launcher-4750-thread-1) [     ] o.a.s.c.c.ConnectionManager Waiting for client to connect to ZooKeeper
   [junit4]   2> 1280896 INFO  (zkConnectionManagerCallback-4752-thread-1) [     ] o.a.s.c.c.ConnectionManager zkClient has connected
   [junit4]   2> 1280896 INFO  (jetty-launcher-4750-thread-1) [     ] o.a.s.c.c.ConnectionManager Client is connected to ZooKeeper
   [junit4]   2> 1280896 INFO  (jetty-launcher-4750-thread-1) [     ] o.a.s.s.SolrDispatchFilter solr.xml found in ZooKeeper. Loading...
   [junit4]   2> 1281215 INFO  (jetty-launcher-4750-thread-1) [     ] o.a.s.h.c.HttpShardHandlerFactory Host whitelist initialized: WhitelistHostChecker [whitelistHosts=null, whitelistHostCheckingEnabled=true]
   [junit4]   2> 1281216 WARN  (jetty-launcher-4750-thread-1) [     ] o.e.j.u.s.S.config Trusting all certificates configured for Client@34b9f156[provider=null,keyStore=null,trustStore=null]
   [junit4]   2> 1281216 WARN  (jetty-launcher-4750-thread-1) [     ] o.e.j.u.s.S.config No Client EndPointIdentificationAlgorithm configured for Client@34b9f156[provider=null,keyStore=null,trustStore=null]
   [junit4]   2> 1281219 WARN  (jetty-launcher-4750-thread-1) [     ] o.e.j.u.s.S.config Trusting all certificates configured for Client@22271e7d[provider=null,keyStore=null,trustStore=null]
   [junit4]   2> 1281220 WARN  (jetty-launcher-4750-thread-1) [     ] o.e.j.u.s.S.config No Client EndPointIdentificationAlgorithm configured for Client@22271e7d[provider=null,keyStore=null,trustStore=null]
   [junit4]   2> 1281221 INFO  (jetty-launcher-4750-thread-1) [     ] o.a.s.c.ZkContainer Zookeeper client=127.0.0.1:33735/solr
   [junit4]   2> 1281222 INFO  (jetty-launcher-4750-thread-1) [     ] o.a.s.c.c.ConnectionManager Waiting for client to connect to ZooKeeper
   [junit4]   2> 1281223 INFO  (zkConnectionManagerCallback-4759-thread-1) [     ] o.a.s.c.c.ConnectionManager zkClient has connected
   [junit4]   2> 1281223 INFO  (jetty-launcher-4750-thread-1) [     ] o.a.s.c.c.ConnectionManager Client is connected to ZooKeeper
   [junit4]   2> 1281326 INFO  (jetty-launcher-4750-thread-1) [n:127.0.0.1:44095_solr     ] o.a.s.c.c.ConnectionManager Waiting for client to connect to ZooKeeper
   [junit4]   2> 1281327 INFO  (zkConnectionManagerCallback-4761-thread-1) [     ] o.a.s.c.c.ConnectionManager zkClient has connected
   [junit4]   2> 1281327 INFO  (jetty-launcher-4750-thread-1) [n:127.0.0.1:44095_solr     ] o.a.s.c.c.ConnectionManager Client is connected to ZooKeeper
   [junit4]   2> 1281387 INFO  (jetty-launcher-4750-thread-1) [n:127.0.0.1:44095_solr     ] o.a.s.c.OverseerElectionContext I am going to be the leader 127.0.0.1:44095_solr
   [junit4]   2> 1281388 INFO  (jetty-launcher-4750-thread-1) [n:127.0.0.1:44095_solr     ] o.a.s.c.Overseer Overseer (id=72209997896810501-127.0.0.1:44095_solr-n_0000000000) starting
   [junit4]   2> 1281392 INFO  (jetty-launcher-4750-thread-1) [n:127.0.0.1:44095_solr     ] o.a.s.c.c.ConnectionManager Waiting for client to connect to ZooKeeper
   [junit4]   2> 1281393 INFO  (zkConnectionManagerCallback-4768-thread-1) [     ] o.a.s.c.c.ConnectionManager zkClient has connected
   [junit4]   2> 1281393 INFO  (jetty-launcher-4750-thread-1) [n:127.0.0.1:44095_solr     ] o.a.s.c.c.ConnectionManager Client is connected to ZooKeeper
   [junit4]   2> 1281394 INFO  (jetty-launcher-4750-thread-1) [n:127.0.0.1:44095_solr     ] o.a.s.c.s.i.ZkClientClusterStateProvider Cluster at 127.0.0.1:33735/solr ready
   [junit4]   2> 1281395 INFO  (OverseerStateUpdate-72209997896810501-127.0.0.1:44095_solr-n_0000000000) [n:127.0.0.1:44095_solr     ] o.a.s.c.Overseer Starting to work on the main queue : 127.0.0.1:44095_solr
   [junit4]   2> 1281395 INFO  (jetty-launcher-4750-thread-1) [n:127.0.0.1:44095_solr     ] o.a.s.c.ZkController Register node as live in ZooKeeper:/live_nodes/127.0.0.1:44095_solr
   [junit4]   2> 1281396 INFO  (zkCallback-4767-thread-1) [     ] o.a.s.c.c.ZkStateReader Updated live nodes from ZooKeeper... (0) -> (1)
   [junit4]   2> 1281396 INFO  (zkCallback-4760-thread-1) [     ] o.a.s.c.c.ZkStateReader Updated live nodes from ZooKeeper... (0) -> (1)
   [junit4]   2> 1281396 INFO  (jetty-launcher-4750-thread-1) [n:127.0.0.1:44095_solr     ] o.a.s.c.LibListener clusterprops.json changed , version -1
   [junit4]   2> 1281397 INFO  (jetty-launcher-4750-thread-1) [n:127.0.0.1:44095_solr     ] o.a.s.c.CoreContainer Initializing authorization plugin: solr.RuleBasedAuthorizationPlugin
   [junit4]   2> 1281653 INFO  (jetty-launcher-4750-thread-1) [n:127.0.0.1:44095_solr     ] o.a.s.c.CoreContainer Initializing authentication plugin: solr.BasicAuthPlugin
   [junit4]   2> 1281747 INFO  (jetty-launcher-4750-thread-1) [n:127.0.0.1:44095_solr     ] o.a.s.h.a.MetricsHistoryHandler No .system collection, keeping metrics history in memory.
   [junit4]   2> 1281786 INFO  (jetty-launcher-4750-thread-1) [n:127.0.0.1:44095_solr     ] o.a.s.m.r.SolrJmxReporter JMX monitoring for 'solr_44095.solr.node' (registry 'solr.node') enabled at server: com.sun.jmx.mbeanserver.JmxMBeanServer@4a299bbd
   [junit4]   2> 1281804 INFO  (jetty-launcher-4750-thread-1) [n:127.0.0.1:44095_solr     ] o.a.s.m.r.SolrJmxReporter JMX monitoring for 'solr_44095.solr.jvm' (registry 'solr.jvm') enabled at server: com.sun.jmx.mbeanserver.JmxMBeanServer@4a299bbd
   [junit4]   2> 1281804 INFO  (jetty-launcher-4750-thread-1) [n:127.0.0.1:44095_solr     ] o.a.s.m.r.SolrJmxReporter JMX monitoring for 'solr_44095.solr.jetty' (registry 'solr.jetty') enabled at server: com.sun.jmx.mbeanserver.JmxMBeanServer@4a299bbd
   [junit4]   2> 1281806 INFO  (jetty-launcher-4750-thread-1) [n:127.0.0.1:44095_solr     ] o.a.s.c.CorePropertiesLocator Found 0 core definitions underneath /home/jenkins/workspace/Lucene-Solr-master-Linux/solr/build/solr-core/test/J0/temp/solr.cloud.MetricsHistoryWithAuthIntegrationTest_95057ED33567B7F4-001/tempDir-001/node1/.
   [junit4]   2> 1281839 INFO  (SUITE-MetricsHistoryWithAuthIntegrationTest-seed#[95057ED33567B7F4]-worker) [     ] o.a.s.c.c.ConnectionManager Waiting for client to connect to ZooKeeper
   [junit4]   2> 1281840 INFO  (zkConnectionManagerCallback-4774-thread-1) [     ] o.a.s.c.c.ConnectionManager zkClient has connected
   [junit4]   2> 1281840 INFO  (SUITE-MetricsHistoryWithAuthIntegrationTest-seed#[95057ED33567B7F4]-worker) [     ] o.a.s.c.c.ConnectionManager Client is connected to ZooKeeper
   [junit4]   2> 1281841 INFO  (SUITE-MetricsHistoryWithAuthIntegrationTest-seed#[95057ED33567B7F4]-worker) [     ] o.a.s.c.c.ZkStateReader Updated live nodes from ZooKeeper... (0) -> (1)
   [junit4]   2> 1281842 INFO  (SUITE-MetricsHistoryWithAuthIntegrationTest-seed#[95057ED33567B7F4]-worker) [     ] o.a.s.c.s.i.ZkClientClusterStateProvider Cluster at 127.0.0.1:33735/solr ready
   [junit4]   2> 1283747 DEBUG (MetricsHistoryHandler-3658-thread-1) [     ] o.a.s.h.a.MetricsHistoryHandler -- collectMetrics
   [junit4]   2> 1283935 INFO  (qtp813646266-13609) [n:127.0.0.1:44095_solr     ] o.a.s.s.HttpSolrCall [admin] webapp=null path=/admin/info/key params={omitHeader=true&wt=json} status=0 QTime=0
   [junit4]   2> 1283936 INFO  (qtp813646266-13610) [     ] o.a.s.s.PKIAuthenticationPlugin New Key obtained from  node: 127.0.0.1:44095_solr / MIIBIjANBgkqhkiG9w0BAQEFAAOCAQ8AMIIBCgKCAQEAl+/6U7Jt1XX1+tWAzcBC1LvA5kC4L91e1lbyboc2YoB3wDrP6qrE5nqTBFXDMb/kRjxpd3z37ugFHns0cUBxWS+PQyvVdreJ77akDusRBjfqVoKbz3p5rk7U8peN1PA/1VM48Tl/jEb8izHB6RV3XQUgyWpM96lOPICpERz+kmsVXECFAvNkKk8SF5mWMrSsb321nlY5Yhaf4il6oqJSLqZn0RF1e7HG/nSa3nVx3TFqNPOhLC7WlOPSQUd5vuyEqC0BdNWU7sLUI5poMRGRGvWv8t61bFp54ySo5EXPMIXywTsE/OyV6u9mHc8KkxWQODoksUidcHnZDhLAwueNtwIDAQAB
   [junit4]   2> 1284009 INFO  (qtp813646266-13610) [n:127.0.0.1:44095_solr     ] o.a.s.s.HttpSolrCall [admin] webapp=null path=/admin/metrics params={wt=javabin&version=2&key=solr.jvm:os.processCpuLoad&key=solr.node:CONTAINER.fs.coreRoot.usableSpace&key=solr.jvm:os.systemLoadAverage&key=solr.jvm:memory.heap.used} status=0 QTime=1
   [junit4]   2> 1285106 INFO  (TEST-MetricsHistoryWithAuthIntegrationTest.testValuesAreCollected-seed#[95057ED33567B7F4]) [     ] o.a.s.SolrTestCaseJ4 ###Starting testValuesAreCollected
   [junit4]   2> 1285853 INFO  (qtp813646266-13609) [n:127.0.0.1:44095_solr     ] o.a.s.s.HttpSolrCall [admin] webapp=null path=/admin/metrics/history params={name=solr.jvm&action=get&wt=javabin&version=2} status=0 QTime=710
   [junit4]   2> 1285856 INFO  (TEST-MetricsHistoryWithAuthIntegrationTest.testValuesAreCollected-seed#[95057ED33567B7F4]) [     ] o.a.s.SolrTestCaseJ4 ###Ending testValuesAreCollected
   [junit4]   2> NOTE: reproduce with: ant test  -Dtestcase=MetricsHistoryWithAuthIntegrationTest -Dtests.method=testValuesAreCollected -Dtests.seed=95057ED33567B7F4 -Dtests.multiplier=3 -Dtests.slow=true -Dtests.locale=lu -Dtests.timezone=Africa/Malabo -Dtests.asserts=true -Dtests.file.encoding=ISO-8859-1
   [junit4] FAILURE 1.04s J0 | MetricsHistoryWithAuthIntegrationTest.testValuesAreCollected <<<
   [junit4]    > Throwable #1: java.lang.AssertionError: Expected memory.heap.used > 0 in history
   [junit4]    > 	at __randomizedtesting.SeedInfo.seed([95057ED33567B7F4:BDF823B4E48328B1]:0)
   [junit4]    > 	at org.apache.solr.cloud.MetricsHistoryWithAuthIntegrationTest.testValuesAreCollected(MetricsHistoryWithAuthIntegrationTest.java:91)
   [junit4]    > 	at java.base/jdk.internal.reflect.NativeMethodAccessorImpl.invoke0(Native Method)
   [junit4]    > 	at java.base/jdk.internal.reflect.NativeMethodAccessorImpl.invoke(NativeMethodAccessorImpl.java:62)
   [junit4]    > 	at java.base/jdk.internal.reflect.DelegatingMethodAccessorImpl.invoke(DelegatingMethodAccessorImpl.java:43)
   [junit4]    > 	at java.base/java.lang.reflect.Method.invoke(Method.java:567)
   [junit4]    > 	at java.base/java.lang.Thread.run(Thread.java:830)
   [junit4]   2> 1285988 INFO  (jetty-closer-4775-thread-1) [     ] o.a.s.c.CoreContainer Shutting down CoreContainer instance=1974006432
   [junit4]   2> 1285988 INFO  (jetty-closer-4775-thread-1) [     ] o.a.s.c.ZkController Remove node as live in ZooKeeper:/live_nodes/127.0.0.1:44095_solr
   [junit4]   2> 1285988 INFO  (jetty-closer-4775-thread-1) [     ] o.a.s.c.ZkController Publish this node as DOWN...
   [junit4]   2> 1285988 INFO  (jetty-closer-4775-thread-1) [     ] o.a.s.c.ZkController Publish node=127.0.0.1:44095_solr as DOWN
   [junit4]   2> 1285999 INFO  (jetty-closer-4775-thread-1) [     ] o.a.s.c.TransientSolrCoreCacheDefault Allocating transient cache for 2147483647 transient cores
   [junit4]   2> 1285999 DEBUG (jetty-closer-4775-thread-1) [     ] o.a.s.h.a.MetricsHistoryHandler Closing 1212391679
   [junit4]   2> 1286000 INFO  (jetty-closer-4775-thread-1) [     ] o.a.s.m.SolrMetricManager Closing metric reporters for registry=solr.node, tag=null
   [junit4]   2> 1286001 INFO  (jetty-closer-4775-thread-1) [     ] o.a.s.m.r.SolrJmxReporter Closing reporter [org.apache.solr.metrics.reporters.SolrJmxReporter@254f2585: rootName = solr_44095, domain = solr.node, service url = null, agent id = null] for registry solr.node / com.codahale.metrics.MetricRegistry@5956ee8
   [junit4]   2> 1286019 INFO  (jetty-closer-4775-thread-1) [     ] o.a.s.m.SolrMetricManager Closing metric reporters for registry=solr.jvm, tag=null
   [junit4]   2> 1286019 INFO  (jetty-closer-4775-thread-1) [     ] o.a.s.m.r.SolrJmxReporter Closing reporter [org.apache.solr.metrics.reporters.SolrJmxReporter@4e88c3ab: rootName = solr_44095, domain = solr.jvm, service url = null, agent id = null] for registry solr.jvm / com.codahale.metrics.MetricRegistry@3eabbcf7
   [junit4]   2> 1286028 INFO  (jetty-closer-4775-thread-1) [     ] o.a.s.m.SolrMetricManager Closing metric reporters for registry=solr.jetty, tag=null
   [junit4]   2> 1286028 INFO  (jetty-closer-4775-thread-1) [     ] o.a.s.m.r.SolrJmxReporter Closing reporter [org.apache.solr.metrics.reporters.SolrJmxReporter@7f6fb648: rootName = solr_44095, domain = solr.jetty, service url = null, agent id = null] for registry solr.jetty / com.codahale.metrics.MetricRegistry@49051509
   [junit4]   2> 1286028 INFO  (jetty-closer-4775-thread-1) [     ] o.a.s.m.SolrMetricManager Closing metric reporters for registry=solr.cluster, tag=null
   [junit4]   2> 1286030 INFO  (closeThreadPool-4779-thread-2) [     ] o.a.s.c.Overseer Overseer (id=72209997896810501-127.0.0.1:44095_solr-n_0000000000) closing
   [junit4]   2> 1286033 INFO  (OverseerStateUpdate-72209997896810501-127.0.0.1:44095_solr-n_0000000000) [n:127.0.0.1:44095_solr     ] o.a.s.c.Overseer Overseer Loop exiting : 127.0.0.1:44095_solr
   [junit4]   2> 1286033 INFO  (OverseerAutoScalingTriggerThread-72209997896810501-127.0.0.1:44095_solr-n_0000000000) [     ] o.a.s.c.a.OverseerTriggerThread OverseerTriggerThread woken up but we are closed, exiting.
   [junit4]   2> 1286035 INFO  (closeThreadPool-4779-thread-1) [     ] o.a.s.c.Overseer Overseer (id=72209997896810501-127.0.0.1:44095_solr-n_0000000000) closing
   [junit4]   2> 1286236 INFO  (jetty-closer-4775-thread-1) [     ] o.a.s.c.Overseer Overseer (id=72209997896810501-127.0.0.1:44095_solr-n_0000000000) closing
   [junit4]   2> 1286237 INFO  (jetty-closer-4775-thread-1) [     ] o.e.j.s.AbstractConnector Stopped ServerConnector@3eb8b9c5{HTTP/1.1,[http/1.1, h2c]}{127.0.0.1:0}
   [junit4]   2> 1286237 INFO  (jetty-closer-4775-thread-1) [     ] o.e.j.s.h.ContextHandler Stopped o.e.j.s.ServletContextHandler@103d4d24{/solr,null,UNAVAILABLE}
   [junit4]   2> 1286237 INFO  (jetty-closer-4775-thread-1) [     ] o.e.j.s.session node0 Stopped scavenging
   [junit4]   2> 1286238 INFO  (SUITE-MetricsHistoryWithAuthIntegrationTest-seed#[95057ED33567B7F4]-worker) [     ] o.a.s.c.ZkTestServer Shutting down ZkTestServer.
   [junit4]   2> 1286443 WARN  (ZkTestServer Run Thread) [     ] o.a.s.c.ZkTestServer Watch limit violations: 
   [junit4]   2> Maximum concurrent create/delete watches above limit:
   [junit4]   2> 
   [junit4]   2> 	3	/solr/aliases.json
   [junit4]   2> 	3	/solr/clusterprops.json
   [junit4]   2> 
   [junit4]   2> Maximum concurrent data watches above limit:
   [junit4]   2> 
   [junit4]   2> 	3	/solr/clusterstate.json
   [junit4]   2> 
   [junit4]   2> Maximum concurrent children watches above limit:
   [junit4]   2> 
   [junit4]   2> 	5	/solr/live_nodes
   [junit4]   2> 	3	/solr/collections
   [junit4]   2> 	2	/solr/overseer/queue
   [junit4]   2> 
   [junit4]   2> 1286444 INFO  (SUITE-MetricsHistoryWithAuthIntegrationTest-seed#[95057ED33567B7F4]-worker) [     ] o.a.s.c.ZkTestServer parse host and port list: 127.0.0.1:33735
   [junit4]   2> 1286444 INFO  (SUITE-MetricsHistoryWithAuthIntegrationTest-seed#[95057ED33567B7F4]-worker) [     ] o.a.s.c.ZkTestServer connecting to 127.0.0.1 33735
   [junit4]   2> NOTE: leaving temporary files on disk at: /home/jenkins/workspace/Lucene-Solr-master-Linux/solr/build/solr-core/test/J0/temp/solr.cloud.MetricsHistoryWithAuthIntegrationTest_95057ED33567B7F4-001
   [junit4]   2> Jul 22, 2019 4:08:51 PM com.carrotsearch.randomizedtesting.ThreadLeakControl checkThreadLeaks
   [junit4]   2> WARNING: Will linger awaiting termination of 1 leaked thread(s).
   [junit4]   2> NOTE: test params are: codec=Asserting(Lucene80): {}, docValues:{}, maxPointsInLeafNode=469, maxMBSortInHeap=7.807755424646736, sim=Asserting(org.apache.lucene.search.similarities.AssertingSimilarity@dcd80cb), locale=lu, timezone=Africa/Malabo
   [junit4]   2> NOTE: Linux 4.18.0-24-generic amd64/Aleksey Shipilev 13-testing (64-bit)/cpus=8,threads=1,free=231930480,total=518979584
   [junit4]   2> NOTE: All tests run in this JVM: [ZkNodePropsTest, LeaderVoteWaitTimeoutTest, URLClassifyProcessorTest, CdcrBootstrapTest, TestAtomicUpdateErrorCases, TestCrossCoreJoin, TestRandomCollapseQParserPlugin, SignatureUpdateProcessorFactoryTest, TestReload, TestCoreAdminApis, PrimUtilsTest, SparseHLLTest, SolrIndexConfigTest, HttpTriggerListenerTest, TestCodecSupport, JsonLoaderTest, TestWithCollection, TestCloudConsistency, DistributedDebugComponentTest, ManagedSchemaRoundRobinCloudTest, TestBM25SimilarityFactory, CdcrRequestHandlerTest, AutoAddReplicasIntegrationTest, CacheHeaderTest, WordBreakSolrSpellCheckerTest, QueryResultKeyTest, TestMultiValuedNumericRangeQuery, TestLFUCache, MultiSolrCloudTestCaseTest, NestedAtomicUpdateTest, RequestLoggingTest, TestWriterPerf, TestApiFramework, TestChildDocTransformerHierarchy, TestFieldCacheReopen, StatsComponentTest, TestAnalyzedSuggestions, CollectionTooManyReplicasTest, TestSolrCoreProperties, MoveReplicaHDFSFailoverTest, TestJettySolrRunner, AddReplicaTest, ChaosMonkeySafeLeaderWithPullReplicasTest, ZkCLITest, DataDrivenBlockJoinTest, TestHashQParserPlugin, TestQuerySenderListener, TestSchemaNameResource, FieldMutatingUpdateProcessorTest, TestDeprecatedFilters, DocValuesMultiTest, JSONWriterTest, SignificantTermsQParserPluginTest, TestSolr4Spatial, TestGraphMLResponseWriter, TestDynamicLoadingUrl, XmlInterpolationTest, CoreAdminRequestStatusTest, HdfsSyncSliceTest, RulesTest, TestFieldCacheVsDocValues, CustomHighlightComponentTest, DistributedQueryComponentCustomSortTest, TestPhraseSuggestions, TestRealTimeGet, ResponseBuilderTest, CoreAdminCreateDiscoverTest, DeleteShardTest, ClassificationUpdateProcessorTest, IndexBasedSpellCheckerTest, TimeZoneUtilsTest, TestOnReconnectListenerSupport, TestRestManager, TestAddFieldRealTimeGet, EchoParamsTest, TestImpersonationWithHadoopAuth, OpenExchangeRatesOrgProviderTest, TestCSVResponseWriter, TestSchemalessBufferedUpdates, BadCopyFieldTest, AssignTest, TestCoreContainer, TestPivotHelperCode, XsltUpdateRequestHandlerTest, TestMaxScoreQueryParser, ReindexCollectionTest, TestSolrConfigHandlerCloud, DistributedFacetPivotLargeTest, HighlighterMaxOffsetTest, TestSimDistributedQueue, OverseerStatusTest, DistributedFacetSimpleRefinementLongTailTest, BasicDistributedZk2Test, IndexSizeEstimatorTest, TestPartialUpdateDeduplication, LeaderFailoverAfterPartitionTest, SampleTest, TestExclusionRuleCollectionAccess, TestDocTermOrds, AnalysisAfterCoreReloadTest, TestRestoreCore, Tagger2Test, ConcurrentCreateRoutedAliasTest, TestSystemIdResolver, NoCacheHeaderTest, TestDistributedMissingSort, TestLegacyFieldReuse, JavabinLoaderTest, TestUnifiedSolrHighlighter, HttpPartitionOnCommitTest, SyncSliceTest, TestSimNodeLostTrigger, HLLSerializationTest, TestRTimerTree, UpdateRequestProcessorFactoryTest, WrapperMergePolicyFactoryTest, DistributedSpellCheckComponentTest, PhrasesIdentificationComponentTest, TestDistributedStatsComponentCardinality, TestStressVersions, RegexBytesRefFilterTest, DeleteLastCustomShardedReplicaTest, TriLevelCompositeIdRoutingTest, NodeMutatorTest, TestJsonRequest, TestFreeTextSuggestions, ConfigureRecoveryStrategyTest, MetricTriggerTest, TestShardHandlerFactory, MaxSizeAutoCommitTest, TestPullReplicaErrorHandling, TestSimGenericDistributedQueue, DistribDocExpirationUpdateProcessorTest, CreateCollectionCleanupTest, TestConfigSetImmutable, DimensionalRoutedAliasUpdateProcessorTest, TestComplexPhraseQParserPlugin, SegmentsInfoRequestHandlerTest, TestRebalanceLeaders, BufferStoreTest, TestNumericTokenStream, BasicFunctionalityTest, ConvertedLegacyTest, CursorPagingTest, DisMaxRequestHandlerTest, DistributedIntervalFacetingTest, MinimalSchemaTest, OutputWriterTest, SolrInfoBeanTest, SolrTestCaseJ4Test, TestDistributedSearch, PathHierarchyTokenizerFactoryTest, ProtectedTermFilterFactoryTest, TestCharFilters, TestLuceneMatchVersion, TestReversedWildcardFilterFactory, TestWordDelimiterFilterFactory, TokenizerChainTest, TestLuceneIndexBackCompat, TestEmbeddedSolrServerAdminHandler, AliasIntegrationTest, AssignBackwardCompatibilityTest, ChaosMonkeyNothingIsSafeTest, DeleteReplicaTest, LeaderElectionContextKeyTest, LeaderElectionTest, MetricsHistoryWithAuthIntegrationTest]
   [junit4] Completed [480/871 (1!)] on J0 in 7.38s, 1 test, 1 failure <<< FAILURES!

[...truncated 1277 lines...]
   [junit4] JVM J1: stderr was not empty, see: /home/jenkins/workspace/Lucene-Solr-master-Linux/solr/build/solr-core/test/temp/junit4-J1-20190722_154724_2005369375152275428008.syserr
   [junit4] >>> JVM J1 emitted unexpected output (verbatim) ----
   [junit4] OpenJDK 64-Bit Server VM warning: Option UseConcMarkSweepGC was deprecated in version 9.0 and will likely be removed in a future release.
   [junit4] <<< JVM J1: EOF ----

[...truncated 3 lines...]
   [junit4] JVM J0: stderr was not empty, see: /home/jenkins/workspace/Lucene-Solr-master-Linux/solr/build/solr-core/test/temp/junit4-J0-20190722_154724_2002859180480406716101.syserr
   [junit4] >>> JVM J0 emitted unexpected output (verbatim) ----
   [junit4] OpenJDK 64-Bit Server VM warning: Option UseConcMarkSweepGC was deprecated in version 9.0 and will likely be removed in a future release.
   [junit4] <<< JVM J0: EOF ----

[...truncated 4 lines...]
   [junit4] JVM J2: stderr was not empty, see: /home/jenkins/workspace/Lucene-Solr-master-Linux/solr/build/solr-core/test/temp/junit4-J2-20190722_154724_2005115485883843955878.syserr
   [junit4] >>> JVM J2 emitted unexpected output (verbatim) ----
   [junit4] OpenJDK 64-Bit Server VM warning: Option UseConcMarkSweepGC was deprecated in version 9.0 and will likely be removed in a future release.
   [junit4] <<< JVM J2: EOF ----

[...truncated 1078 lines...]
   [junit4] JVM J1: stderr was not empty, see: /home/jenkins/workspace/Lucene-Solr-master-Linux/solr/build/solr-solrj/test/temp/junit4-J1-20190722_163141_92415194113473218673097.syserr
   [junit4] >>> JVM J1 emitted unexpected output (verbatim) ----
   [junit4] JVM J2: stderr was not empty, see: /home/jenkins/workspace/Lucene-Solr-master-Linux/solr/build/solr-solrj/test/temp/junit4-J2-20190722_163141_92412609700452075342079.syserr
   [junit4] OpenJDK 64-Bit Server VM warning: Option UseConcMarkSweepGC was deprecated in version 9.0 and will likely be removed in a future release.
   [junit4] <<< JVM J1: EOF ----

[...truncated 3 lines...]
   [junit4] JVM J0: stderr was not empty, see: /home/jenkins/workspace/Lucene-Solr-master-Linux/solr/build/solr-solrj/test/temp/junit4-J0-20190722_163141_9245501028651783473802.syserr
   [junit4] >>> JVM J0 emitted unexpected output (verbatim) ----
   [junit4] OpenJDK 64-Bit Server VM warning: Option UseConcMarkSweepGC was deprecated in version 9.0 and will likely be removed in a future release.
   [junit4] <<< JVM J0: EOF ----

[...truncated 1481 lines...]
   [junit4] JVM J1: stderr was not empty, see: /home/jenkins/workspace/Lucene-Solr-master-Linux/solr/build/contrib/solr-analysis-extras/test/temp/junit4-J1-20190722_163759_09612691946439804724719.syserr
   [junit4] >>> JVM J1 emitted unexpected output (verbatim) ----
   [junit4] OpenJDK 64-Bit Server VM warning: Option UseConcMarkSweepGC was deprecated in version 9.0 and will likely be removed in a future release.
   [junit4] <<< JVM J1: EOF ----

   [junit4] JVM J0: stderr was not empty, see: /home/jenkins/workspace/Lucene-Solr-master-Linux/solr/build/contrib/solr-analysis-extras/test/temp/junit4-J0-20190722_163759_09613505145507364592787.syserr
   [junit4] >>> JVM J0 emitted unexpected output (verbatim) ----
   [junit4] OpenJDK 64-Bit Server VM warning: Option UseConcMarkSweepGC was deprecated in version 9.0 and will likely be removed in a future release.
   [junit4] <<< JVM J0: EOF ----

[...truncated 3 lines...]
   [junit4] JVM J2: stderr was not empty, see: /home/jenkins/workspace/Lucene-Solr-master-Linux/solr/build/contrib/solr-analysis-extras/test/temp/junit4-J2-20190722_163759_0967686315441274740389.syserr
   [junit4] >>> JVM J2 emitted unexpected output (verbatim) ----
   [junit4] OpenJDK 64-Bit Server VM warning: Option UseConcMarkSweepGC was deprecated in version 9.0 and will likely be removed in a future release.
   [junit4] <<< JVM J2: EOF ----

[...truncated 778 lines...]
   [junit4] JVM J1: stderr was not empty, see: /home/jenkins/workspace/Lucene-Solr-master-Linux/solr/build/contrib/solr-analytics/test/temp/junit4-J1-20190722_163837_93011074141255923179433.syserr
   [junit4] >>> JVM J1 emitted unexpected output (verbatim) ----
   [junit4] OpenJDK 64-Bit Server VM warning: Option UseConcMarkSweepGC was deprecated in version 9.0 and will likely be removed in a future release.
   [junit4] <<< JVM J1: EOF ----

   [junit4] JVM J0: stderr was not empty, see: /home/jenkins/workspace/Lucene-Solr-master-Linux/solr/build/contrib/solr-analytics/test/temp/junit4-J0-20190722_163837_9305971353174735648985.syserr
   [junit4] >>> JVM J0 emitted unexpected output (verbatim) ----
   [junit4] OpenJDK 64-Bit Server VM warning: Option UseConcMarkSweepGC was deprecated in version 9.0 and will likely be removed in a future release.
   [junit4] <<< JVM J0: EOF ----

[...truncated 27 lines...]
   [junit4] JVM J2: stderr was not empty, see: /home/jenkins/workspace/Lucene-Solr-master-Linux/solr/build/contrib/solr-analytics/test/temp/junit4-J2-20190722_163837_93017269442992471352641.syserr
   [junit4] >>> JVM J2 emitted unexpected output (verbatim) ----
   [junit4] OpenJDK 64-Bit Server VM warning: Option UseConcMarkSweepGC was deprecated in version 9.0 and will likely be removed in a future release.
   [junit4] <<< JVM J2: EOF ----

[...truncated 570 lines...]
   [junit4] JVM J2: stderr was not empty, see: /home/jenkins/workspace/Lucene-Solr-master-Linux/solr/build/contrib/solr-clustering/test/temp/junit4-J2-20190722_164108_7281987520025188384742.syserr
   [junit4] >>> JVM J2 emitted unexpected output (verbatim) ----
   [junit4] OpenJDK 64-Bit Server VM warning: Option UseConcMarkSweepGC was deprecated in version 9.0 and will likely be removed in a future release.
   [junit4] <<< JVM J2: EOF ----

[...truncated 3 lines...]
   [junit4] JVM J0: stderr was not empty, see: /home/jenkins/workspace/Lucene-Solr-master-Linux/solr/build/contrib/solr-clustering/test/temp/junit4-J0-20190722_164108_72810739871130987469545.syserr
   [junit4] >>> JVM J0 emitted unexpected output (verbatim) ----
   [junit4] OpenJDK 64-Bit Server VM warning: Option UseConcMarkSweepGC was deprecated in version 9.0 and will likely be removed in a future release.
   [junit4] <<< JVM J0: EOF ----

[...truncated 3 lines...]
   [junit4] JVM J1: stderr was not empty, see: /home/jenkins/workspace/Lucene-Solr-master-Linux/solr/build/contrib/solr-clustering/test/temp/junit4-J1-20190722_164108_72817827157377379993799.syserr
   [junit4] >>> JVM J1 emitted unexpected output (verbatim) ----
   [junit4] OpenJDK 64-Bit Server VM warning: Option UseConcMarkSweepGC was deprecated in version 9.0 and will likely be removed in a future release.
   [junit4] <<< JVM J1: EOF ----

[...truncated 1301 lines...]
   [junit4] JVM J0: stderr was not empty, see: /home/jenkins/workspace/Lucene-Solr-master-Linux/solr/build/contrib/solr-dataimporthandler-extras/test/temp/junit4-J0-20190722_164223_78413770907925803714336.syserr
   [junit4] >>> JVM J0 emitted unexpected output (verbatim) ----
   [junit4] OpenJDK 64-Bit Server VM warning: Option UseConcMarkSweepGC was deprecated in version 9.0 and will likely be removed in a future release.
   [junit4] <<< JVM J0: EOF ----

[...truncated 3 lines...]
   [junit4] JVM J1: stderr was not empty, see: /home/jenkins/workspace/Lucene-Solr-master-Linux/solr/build/contrib/solr-dataimporthandler-extras/test/temp/junit4-J1-20190722_164223_7848823499905305070093.syserr
   [junit4] >>> JVM J1 emitted unexpected output (verbatim) ----
   [junit4] OpenJDK 64-Bit Server VM warning: Option UseConcMarkSweepGC was deprecated in version 9.0 and will likely be removed in a future release.
   [junit4] <<< JVM J1: EOF ----

[...truncated 649 lines...]
   [junit4] JVM J0: stderr was not empty, see: /home/jenkins/workspace/Lucene-Solr-master-Linux/solr/build/contrib/solr-dataimporthandler/test/temp/junit4-J0-20190722_164306_4883603182924022593082.syserr
   [junit4] >>> JVM J0 emitted unexpected output (verbatim) ----
   [junit4] OpenJDK 64-Bit Server VM warning: Option UseConcMarkSweepGC was deprecated in version 9.0 and will likely be removed in a future release.
   [junit4] <<< JVM J0: EOF ----

   [junit4] JVM J2: stderr was not empty, see: /home/jenkins/workspace/Lucene-Solr-master-Linux/solr/build/contrib/solr-dataimporthandler/test/temp/junit4-J2-20190722_164306_4885033748615545037309.syserr
   [junit4] >>> JVM J2 emitted unexpected output (verbatim) ----
   [junit4] OpenJDK 64-Bit Server VM warning: Option UseConcMarkSweepGC was deprecated in version 9.0 and will likely be removed in a future release.
   [junit4] <<< JVM J2: EOF ----

[...truncated 18 lines...]
   [junit4] JVM J1: stderr was not empty, see: /home/jenkins/workspace/Lucene-Solr-master-Linux/solr/build/contrib/solr-dataimporthandler/test/temp/junit4-J1-20190722_164306_4881329808057249426235.syserr
   [junit4] >>> JVM J1 emitted unexpected output (verbatim) ----
   [junit4] OpenJDK 64-Bit Server VM warning: Option UseConcMarkSweepGC was deprecated in version 9.0 and will likely be removed in a future release.
   [junit4] <<< JVM J1: EOF ----

[...truncated 572 lines...]
   [junit4] JVM J1: stderr was not empty, see: /home/jenkins/workspace/Lucene-Solr-master-Linux/solr/build/contrib/solr-cell/test/temp/junit4-J1-20190722_164406_01217955021099291903585.syserr
   [junit4] >>> JVM J1 emitted unexpected output (verbatim) ----
   [junit4] OpenJDK 64-Bit Server VM warning: Option UseConcMarkSweepGC was deprecated in version 9.0 and will likely be removed in a future release.
   [junit4] <<< JVM J1: EOF ----

[...truncated 3 lines...]
   [junit4] JVM J2: stderr was not empty, see: /home/jenkins/workspace/Lucene-Solr-master-Linux/solr/build/contrib/solr-cell/test/temp/junit4-J2-20190722_164406_0128673947584506420591.syserr
   [junit4] >>> JVM J2 emitted unexpected output (verbatim) ----
   [junit4] OpenJDK 64-Bit Server VM warning: Option UseConcMarkSweepGC was deprecated in version 9.0 and will likely be removed in a future release.
   [junit4] <<< JVM J2: EOF ----

[...truncated 3 lines...]
   [junit4] JVM J0: stderr was not empty, see: /home/jenkins/workspace/Lucene-Solr-master-Linux/solr/build/contrib/solr-cell/test/temp/junit4-J0-20190722_164406_0123345346873537885942.syserr
   [junit4] >>> JVM J0 emitted unexpected output (verbatim) ----
   [junit4] OpenJDK 64-Bit Server VM warning: Option UseConcMarkSweepGC was deprecated in version 9.0 and will likely be removed in a future release.
   [junit4] <<< JVM J0: EOF ----

[...truncated 566 lines...]
   [junit4] JVM J0: stderr was not empty, see: /home/jenkins/workspace/Lucene-Solr-master-Linux/solr/build/contrib/solr-jaegertracer-configurator/test/temp/junit4-J0-20190722_164504_18410898807577617863238.syserr
   [junit4] >>> JVM J0 emitted unexpected output (verbatim) ----
   [junit4] OpenJDK 64-Bit Server VM warning: Option UseConcMarkSweepGC was deprecated in version 9.0 and will likely be removed in a future release.
   [junit4] <<< JVM J0: EOF ----

[...truncated 577 lines...]
   [junit4] JVM J1: stderr was not empty, see: /home/jenkins/workspace/Lucene-Solr-master-Linux/solr/build/contrib/solr-langid/test/temp/junit4-J1-20190722_164533_8929039859274127807541.syserr
   [junit4] JVM J0: stderr was not empty, see: /home/jenkins/workspace/Lucene-Solr-master-Linux/solr/build/contrib/solr-langid/test/temp/junit4-J0-20190722_164533_8922990190577401828622.syserr
   [junit4] >>> JVM J0 emitted unexpected output (verbatim) ----
   [junit4] OpenJDK 64-Bit Server VM warning: Option UseConcMarkSweepGC was deprecated in version 9.0 and will likely be removed in a future release.
   [junit4] <<< JVM J0: EOF ----

[...truncated 6 lines...]
   [junit4] JVM J2: stderr was not empty, see: /home/jenkins/workspace/Lucene-Solr-master-Linux/solr/build/contrib/solr-langid/test/temp/junit4-J2-20190722_164533_8929554179559456188304.syserr
   [junit4] >>> JVM J2 emitted unexpected output (verbatim) ----
   [junit4] OpenJDK 64-Bit Server VM warning: Option UseConcMarkSweepGC was deprecated in version 9.0 and will likely be removed in a future release.
   [junit4] <<< JVM J2: EOF ----

[...truncated 685 lines...]
   [junit4] JVM J1: stderr was not empty, see: /home/jenkins/workspace/Lucene-Solr-master-Linux/solr/build/contrib/solr-ltr/test/temp/junit4-J1-20190722_164600_3335961743222275537129.syserr
   [junit4] JVM J2: stderr was not empty, see: /home/jenkins/workspace/Lucene-Solr-master-Linux/solr/build/contrib/solr-ltr/test/temp/junit4-J2-20190722_164600_3338800035215201195071.syserr
   [junit4] >>> JVM J2 emitted unexpected output (verbatim) ----
   [junit4] OpenJDK 64-Bit Server VM warning: Option UseConcMarkSweepGC was deprecated in version 9.0 and will likely be removed in a future release.
   [junit4] <<< JVM J2: EOF ----

[...truncated 2 lines...]
   [junit4] JVM J0: stderr was not empty, see: /home/jenkins/workspace/Lucene-Solr-master-Linux/solr/build/contrib/solr-ltr/test/temp/junit4-J0-20190722_164600_3339323157878416473892.syserr
   [junit4] <<< JVM J1: EOF ----

[...truncated 583 lines...]
   [junit4] JVM J2: stderr was not empty, see: /home/jenkins/workspace/Lucene-Solr-master-Linux/solr/build/contrib/solr-prometheus-exporter/test/temp/junit4-J2-20190722_164711_43216404063629410222511.syserr
   [junit4] >>> JVM J2 emitted unexpected output (verbatim) ----
   [junit4] OpenJDK 64-Bit Server VM warning: Option UseConcMarkSweepGC was deprecated in version 9.0 and will likely be removed in a future release.
   [junit4] <<< JVM J2: EOF ----

[...truncated 3 lines...]
   [junit4] JVM J1: stderr was not empty, see: /home/jenkins/workspace/Lucene-Solr-master-Linux/solr/build/contrib/solr-prometheus-exporter/test/temp/junit4-J1-20190722_164711_4322021496141816619435.syserr
   [junit4] >>> JVM J1 emitted unexpected output (verbatim) ----
   [junit4] OpenJDK 64-Bit Server VM warning: Option UseConcMarkSweepGC was deprecated in version 9.0 and will likely be removed in a future release.
   [junit4] <<< JVM J1: EOF ----

[...truncated 3 lines...]
   [junit4] JVM J0: stderr was not empty, see: /home/jenkins/workspace/Lucene-Solr-master-Linux/solr/build/contrib/solr-prometheus-exporter/test/temp/junit4-J0-20190722_164711_43217542533499553776653.syserr
   [junit4] >>> JVM J0 emitted unexpected output (verbatim) ----
   [junit4] OpenJDK 64-Bit Server VM warning: Option UseConcMarkSweepGC was deprecated in version 9.0 and will likely be removed in a future release.
   [junit4] <<< JVM J0: EOF ----

[...truncated 567 lines...]
   [junit4] JVM J0: stderr was not empty, see: /home/jenkins/workspace/Lucene-Solr-master-Linux/solr/build/contrib/solr-velocity/test/temp/junit4-J0-20190722_164813_26712704767242893238672.syserr
   [junit4] >>> JVM J0 emitted unexpected output (verbatim) ----
   [junit4] OpenJDK 64-Bit Server VM warning: Option UseConcMarkSweepGC was deprecated in version 9.0 and will likely be removed in a future release.
   [junit4] <<< JVM J0: EOF ----

[...truncated 35403 lines...]
[repro] Jenkins log URL: https://jenkins.thetaphi.de/job/Lucene-Solr-master-Linux/24432/consoleText

[repro] Revision: 369a5dc796e998f11fa5f76b40ade5aad8cff6ea

[repro] Ant options: "-Dargs=-XX:+UseCompressedOops -XX:+UseConcMarkSweepGC"
[repro] Repro line:  ant test  -Dtestcase=MetricsHistoryWithAuthIntegrationTest -Dtests.method=testValuesAreCollected -Dtests.seed=95057ED33567B7F4 -Dtests.multiplier=3 -Dtests.slow=true -Dtests.locale=lu -Dtests.timezone=Africa/Malabo -Dtests.asserts=true -Dtests.file.encoding=ISO-8859-1

[repro] ant clean

[...truncated 6 lines...]
[repro] Test suites by module:
[repro]    solr/core
[repro]       MetricsHistoryWithAuthIntegrationTest
[repro] ant compile-test

[...truncated 3336 lines...]
[repro] ant test-nocompile -Dtests.dups=5 -Dtests.maxfailures=5 -Dtests.class="*.MetricsHistoryWithAuthIntegrationTest" -Dtests.showOutput=onerror "-Dargs=-XX:+UseCompressedOops -XX:+UseConcMarkSweepGC" -Dtests.seed=95057ED33567B7F4 -Dtests.multiplier=3 -Dtests.slow=true -Dtests.locale=lu -Dtests.timezone=Africa/Malabo -Dtests.asserts=true -Dtests.file.encoding=ISO-8859-1

[...truncated 44 lines...]
   [junit4] JVM J0: stderr was not empty, see: /home/jenkins/workspace/Lucene-Solr-master-Linux/solr/build/solr-core/test/temp/junit4-J0-20190722_165557_8865807685613921001888.syserr
   [junit4] >>> JVM J0 emitted unexpected output (verbatim) ----
   [junit4] OpenJDK 64-Bit Server VM warning: Option UseConcMarkSweepGC was deprecated in version 9.0 and will likely be removed in a future release.
   [junit4] <<< JVM J0: EOF ----

[...truncated 4 lines...]
   [junit4] JVM J2: stderr was not empty, see: /home/jenkins/workspace/Lucene-Solr-master-Linux/solr/build/solr-core/test/temp/junit4-J2-20190722_165557_89216049534379581662452.syserr
   [junit4] >>> JVM J2 emitted unexpected output (verbatim) ----
   [junit4] OpenJDK 64-Bit Server VM warning: Option UseConcMarkSweepGC was deprecated in version 9.0 and will likely be removed in a future release.
   [junit4] <<< JVM J2: EOF ----

[...truncated 4 lines...]
   [junit4] JVM J1: stderr was not empty, see: /home/jenkins/workspace/Lucene-Solr-master-Linux/solr/build/solr-core/test/temp/junit4-J1-20190722_165557_89211402548194525326642.syserr
   [junit4] >>> JVM J1 emitted unexpected output (verbatim) ----
   [junit4] OpenJDK 64-Bit Server VM warning: Option UseConcMarkSweepGC was deprecated in version 9.0 and will likely be removed in a future release.
   [junit4] <<< JVM J1: EOF ----

[...truncated 23 lines...]
[repro] Failures:
[repro]   0/5 failed: org.apache.solr.cloud.MetricsHistoryWithAuthIntegrationTest
[repro] Exiting with code 0

[...truncated 43 lines...]

Mime
View raw message