lucene-dev mailing list archives

Site index · List index
Message view « Date » · « Thread »
Top « Date » · « Thread »
From Policeman Jenkins Server <jenk...@thetaphi.de>
Subject [JENKINS] Lucene-Solr-master-Linux (64bit/jdk-12.0.1) - Build # 24469 - Still Unstable!
Date Tue, 30 Jul 2019 01:55:21 GMT
Build: https://jenkins.thetaphi.de/job/Lucene-Solr-master-Linux/24469/
Java: 64bit/jdk-12.0.1 -XX:+UseCompressedOops -XX:+UseSerialGC

1 tests failed.
FAILED:  org.apache.solr.schema.TestUseDocValuesAsStored.testDuplicateMultiValued

Error Message:
Exception during query

Stack Trace:
java.lang.RuntimeException: Exception during query
	at __randomizedtesting.SeedInfo.seed([76BC5A6650E2A727:98614E469E53519B]:0)
	at org.apache.solr.SolrTestCaseJ4.assertQ(SolrTestCaseJ4.java:947)
	at org.apache.solr.schema.TestUseDocValuesAsStored.doTest(TestUseDocValuesAsStored.java:367)
	at org.apache.solr.schema.TestUseDocValuesAsStored.testDuplicateMultiValued(TestUseDocValuesAsStored.java:165)
	at java.base/jdk.internal.reflect.NativeMethodAccessorImpl.invoke0(Native Method)
	at java.base/jdk.internal.reflect.NativeMethodAccessorImpl.invoke(NativeMethodAccessorImpl.java:62)
	at java.base/jdk.internal.reflect.DelegatingMethodAccessorImpl.invoke(DelegatingMethodAccessorImpl.java:43)
	at java.base/java.lang.reflect.Method.invoke(Method.java:567)
	at com.carrotsearch.randomizedtesting.RandomizedRunner.invoke(RandomizedRunner.java:1750)
	at com.carrotsearch.randomizedtesting.RandomizedRunner$8.evaluate(RandomizedRunner.java:938)
	at com.carrotsearch.randomizedtesting.RandomizedRunner$9.evaluate(RandomizedRunner.java:974)
	at com.carrotsearch.randomizedtesting.RandomizedRunner$10.evaluate(RandomizedRunner.java:988)
	at com.carrotsearch.randomizedtesting.rules.SystemPropertiesRestoreRule$1.evaluate(SystemPropertiesRestoreRule.java:57)
	at org.apache.lucene.util.TestRuleSetupTeardownChained$1.evaluate(TestRuleSetupTeardownChained.java:49)
	at org.apache.lucene.util.AbstractBeforeAfterRule$1.evaluate(AbstractBeforeAfterRule.java:45)
	at org.apache.lucene.util.TestRuleThreadAndTestName$1.evaluate(TestRuleThreadAndTestName.java:48)
	at org.apache.lucene.util.TestRuleIgnoreAfterMaxFailures$1.evaluate(TestRuleIgnoreAfterMaxFailures.java:64)
	at org.apache.lucene.util.TestRuleMarkFailure$1.evaluate(TestRuleMarkFailure.java:47)
	at com.carrotsearch.randomizedtesting.rules.StatementAdapter.evaluate(StatementAdapter.java:36)
	at com.carrotsearch.randomizedtesting.ThreadLeakControl$StatementRunner.run(ThreadLeakControl.java:368)
	at com.carrotsearch.randomizedtesting.ThreadLeakControl.forkTimeoutingTask(ThreadLeakControl.java:817)
	at com.carrotsearch.randomizedtesting.ThreadLeakControl$3.evaluate(ThreadLeakControl.java:468)
	at com.carrotsearch.randomizedtesting.RandomizedRunner.runSingleTest(RandomizedRunner.java:947)
	at com.carrotsearch.randomizedtesting.RandomizedRunner$5.evaluate(RandomizedRunner.java:832)
	at com.carrotsearch.randomizedtesting.RandomizedRunner$6.evaluate(RandomizedRunner.java:883)
	at com.carrotsearch.randomizedtesting.RandomizedRunner$7.evaluate(RandomizedRunner.java:894)
	at com.carrotsearch.randomizedtesting.rules.StatementAdapter.evaluate(StatementAdapter.java:36)
	at com.carrotsearch.randomizedtesting.rules.SystemPropertiesRestoreRule$1.evaluate(SystemPropertiesRestoreRule.java:57)
	at org.apache.lucene.util.AbstractBeforeAfterRule$1.evaluate(AbstractBeforeAfterRule.java:45)
	at com.carrotsearch.randomizedtesting.rules.StatementAdapter.evaluate(StatementAdapter.java:36)
	at org.apache.lucene.util.TestRuleStoreClassName$1.evaluate(TestRuleStoreClassName.java:41)
	at com.carrotsearch.randomizedtesting.rules.NoShadowingOrOverridesOnMethodsRule$1.evaluate(NoShadowingOrOverridesOnMethodsRule.java:40)
	at com.carrotsearch.randomizedtesting.rules.NoShadowingOrOverridesOnMethodsRule$1.evaluate(NoShadowingOrOverridesOnMethodsRule.java:40)
	at com.carrotsearch.randomizedtesting.rules.StatementAdapter.evaluate(StatementAdapter.java:36)
	at com.carrotsearch.randomizedtesting.rules.StatementAdapter.evaluate(StatementAdapter.java:36)
	at org.apache.lucene.util.TestRuleAssertionsRequired$1.evaluate(TestRuleAssertionsRequired.java:53)
	at org.apache.lucene.util.TestRuleMarkFailure$1.evaluate(TestRuleMarkFailure.java:47)
	at org.apache.lucene.util.TestRuleIgnoreAfterMaxFailures$1.evaluate(TestRuleIgnoreAfterMaxFailures.java:64)
	at org.apache.lucene.util.TestRuleIgnoreTestSuites$1.evaluate(TestRuleIgnoreTestSuites.java:54)
	at com.carrotsearch.randomizedtesting.rules.StatementAdapter.evaluate(StatementAdapter.java:36)
	at com.carrotsearch.randomizedtesting.ThreadLeakControl$StatementRunner.run(ThreadLeakControl.java:368)
	at java.base/java.lang.Thread.run(Thread.java:835)
Caused by: java.lang.RuntimeException: REQUEST FAILED: xpath=//arr[@name='test_ss_dv']/str[.='X']
	xml response was: <?xml version="1.0" encoding="UTF-8"?>
<response>
<lst name="responseHeader"><int name="status">0</int><int name="QTime">0</int></lst><result name="response" numFound="11" start="0"><doc><str name="id">262</str><str name="test_s_dvo">𑂝𑂩𑂫𑂠𑂒𑂺𑂻𑂤𑂍𑂭𑂍𑂃𑂳𑂯𑂲𑂮𑂠𑂹𑂍𑃊</str></doc><doc><str name="id">263</str><int name="test_i_dvo">-208869042</int></doc><doc><str name="id">264</str><double name="test_d_dvo">3.017973786699776E214</double></doc><doc><str name="id">265</str><long name="test_l_dvo">-6232938349408285120</long></doc><doc><str name="id">266</str><float name="test_f_dvo">-2.7302657E-29</float></doc><doc><str name="id">267</str><date name="test_dt_dvo">-8366-05-09T16:56:06.483Z</date></doc><doc><str name="id">268</str><arr name="test_ss_dv"><str>說老見𢡊令輪﫡﫾</str><str>ܟܴܱܿ܋ܐܬݏܯ܃ܶ܃ܭܐܭ݃</str><str>ꣳ꣹꣱ꣻ꣩ꣾ꣼꣨꣤꣰ꣷ꣢</str></arr></doc><doc><str name="id">269</str><arr name="test_ss_dvo2"><str>†™‡¨ä¸Éæ</str><str>¸à¹¼ê¼àˆ¨¶Çç¨ÎÃÀ</str><str>࿚ཇྖཿསཾཝ༹ྎཞ࿺࿱࿻ུ</str><str>ᏘᎦᏈᏴᏪᏹᏝᏍᏩ</str><str>ᨇ᨜ᨑᨉ᨜ᨐᨄᨁᨓᨛᨓ᨞ᨒᨑᨖ᨟ᨐ᨜ᨃᨙ</str><str>ᩘᨾ᪙᩾ᩝ᪖᪮᪯᪢ᩧ᪨</str><str>ⱨⱮ</str><str>𐇓𐇻𐇱𐇳𐇽𐇡𐇹𐇦𐇺𐇙𐇭𐇷𐇠𐇴</str><str>𐑇𐐭𐐖𐐵𐐗𐑍𐐲𐐔𐑎𐐰𐐒𐐕𐐨𐑂𐐏𐐆𐐋𐑎</str><str>􍺼􀉍􃙔􉓢􂳲􏍥􌵢􌨍􀪳􉣫</str></arr></doc><doc><str name="id">270</str><arr name="enums_dvo"><str>x5</str><str>x8</str><str>x9</str><str>x10</str><str>x10</str><str>x15</str></arr></doc><doc><str name="id">1</str><arr name="test_ss_dvo"><str>X</str><str>Y</str></arr></doc></result>
</response>

	request was:q=*:*&fl=*&wt=xml
	at org.apache.solr.SolrTestCaseJ4.assertQ(SolrTestCaseJ4.java:940)
	... 40 more




Build Log:
[...truncated 15396 lines...]
   [junit4] Suite: org.apache.solr.schema.TestUseDocValuesAsStored
   [junit4]   2> Creating dataDir: /home/jenkins/workspace/Lucene-Solr-master-Linux/solr/build/solr-core/test/J2/temp/solr.schema.TestUseDocValuesAsStored_76BC5A6650E2A727-001/init-core-data-001
   [junit4]   2> 2105176 WARN  (SUITE-TestUseDocValuesAsStored-seed#[76BC5A6650E2A727]-worker) [     ] o.a.s.SolrTestCaseJ4 startTrackingSearchers: numOpens=8 numCloses=8
   [junit4]   2> 2105176 INFO  (SUITE-TestUseDocValuesAsStored-seed#[76BC5A6650E2A727]-worker) [     ] o.a.s.SolrTestCaseJ4 Using PointFields (NUMERIC_POINTS_SYSPROP=true) w/NUMERIC_DOCVALUES_SYSPROP=false
   [junit4]   2> 2105177 INFO  (SUITE-TestUseDocValuesAsStored-seed#[76BC5A6650E2A727]-worker) [     ] o.a.s.SolrTestCaseJ4 Randomized ssl (true) and clientAuth (true) via: @org.apache.solr.util.RandomizeSSL(reason="", value=0.0/0.0, ssl=0.0/0.0, clientAuth=0.0/0.0)
   [junit4]   2> 2105177 INFO  (SUITE-TestUseDocValuesAsStored-seed#[76BC5A6650E2A727]-worker) [     ] o.a.s.SolrTestCaseJ4 SecureRandom sanity checks: test.solr.allowed.securerandom=null & java.security.egd=file:/dev/./urandom
   [junit4]   2> 2105181 INFO  (TEST-TestUseDocValuesAsStored.testManagedSchema-seed#[76BC5A6650E2A727]) [     ] o.a.s.SolrTestCaseJ4 ###Starting testManagedSchema
   [junit4]   2> 2105184 INFO  (TEST-TestUseDocValuesAsStored.testManagedSchema-seed#[76BC5A6650E2A727]) [     ] o.a.s.SolrTestCaseJ4 ####initCore
   [junit4]   2> 2105188 INFO  (TEST-TestUseDocValuesAsStored.testManagedSchema-seed#[76BC5A6650E2A727]) [     ] o.a.s.c.SolrConfig Using Lucene MatchVersion: 9.0.0
   [junit4]   2> 2105193 INFO  (TEST-TestUseDocValuesAsStored.testManagedSchema-seed#[76BC5A6650E2A727]) [     ] o.a.s.s.ManagedIndexSchemaFactory The schema is configured as managed, but managed schema resource managed-schema not found - loading non-managed schema schema-non-stored-docvalues.xml instead
   [junit4]   2> 2105202 INFO  (TEST-TestUseDocValuesAsStored.testManagedSchema-seed#[76BC5A6650E2A727]) [     ] o.a.s.s.IndexSchema [null] Schema name=test-non-stored-docvalues
   [junit4]   2> 2105207 INFO  (TEST-TestUseDocValuesAsStored.testManagedSchema-seed#[76BC5A6650E2A727]) [     ] o.a.s.s.IndexSchema Loaded schema test-non-stored-docvalues/1.6 with uniqueid field id
   [junit4]   2> 2105210 INFO  (TEST-TestUseDocValuesAsStored.testManagedSchema-seed#[76BC5A6650E2A727]) [     ] o.a.s.s.ManagedIndexSchema Upgraded to managed schema at /home/jenkins/workspace/Lucene-Solr-master-Linux/solr/build/solr-core/test/J2/temp/solr.schema.TestUseDocValuesAsStored_76BC5A6650E2A727-001/tempDir-001/collection1/conf/managed-schema
   [junit4]   2> 2105254 INFO  (TEST-TestUseDocValuesAsStored.testManagedSchema-seed#[76BC5A6650E2A727]) [     ] o.a.s.s.ManagedIndexSchemaFactory After upgrading to managed schema, renamed the non-managed schema /home/jenkins/workspace/Lucene-Solr-master-Linux/solr/build/solr-core/test/J2/temp/solr.schema.TestUseDocValuesAsStored_76BC5A6650E2A727-001/tempDir-001/collection1/conf/schema-non-stored-docvalues.xml to /home/jenkins/workspace/Lucene-Solr-master-Linux/solr/build/solr-core/test/J2/temp/solr.schema.TestUseDocValuesAsStored_76BC5A6650E2A727-001/tempDir-001/collection1/conf/schema-non-stored-docvalues.xml.bak
   [junit4]   2> 2105449 INFO  (TEST-TestUseDocValuesAsStored.testManagedSchema-seed#[76BC5A6650E2A727]) [     ] o.a.s.h.c.HttpShardHandlerFactory Host whitelist initialized: WhitelistHostChecker [whitelistHosts=null, whitelistHostCheckingEnabled=true]
   [junit4]   2> 2105450 WARN  (TEST-TestUseDocValuesAsStored.testManagedSchema-seed#[76BC5A6650E2A727]) [     ] o.e.j.u.s.S.config Trusting all certificates configured for Client@4e22d06a[provider=null,keyStore=null,trustStore=null]
   [junit4]   2> 2105450 WARN  (TEST-TestUseDocValuesAsStored.testManagedSchema-seed#[76BC5A6650E2A727]) [     ] o.e.j.u.s.S.config No Client EndPointIdentificationAlgorithm configured for Client@4e22d06a[provider=null,keyStore=null,trustStore=null]
   [junit4]   2> 2105455 WARN  (TEST-TestUseDocValuesAsStored.testManagedSchema-seed#[76BC5A6650E2A727]) [     ] o.e.j.u.s.S.config Trusting all certificates configured for Client@14b1c8d2[provider=null,keyStore=null,trustStore=null]
   [junit4]   2> 2105455 WARN  (TEST-TestUseDocValuesAsStored.testManagedSchema-seed#[76BC5A6650E2A727]) [     ] o.e.j.u.s.S.config No Client EndPointIdentificationAlgorithm configured for Client@14b1c8d2[provider=null,keyStore=null,trustStore=null]
   [junit4]   2> 2105494 INFO  (TEST-TestUseDocValuesAsStored.testManagedSchema-seed#[76BC5A6650E2A727]) [     ] o.a.s.c.TransientSolrCoreCacheDefault Allocating transient cache for 2147483647 transient cores
   [junit4]   2> 2105494 INFO  (TEST-TestUseDocValuesAsStored.testManagedSchema-seed#[76BC5A6650E2A727]) [     ] o.a.s.h.a.MetricsHistoryHandler No .system collection, keeping metrics history in memory.
   [junit4]   2> 2105519 INFO  (TEST-TestUseDocValuesAsStored.testManagedSchema-seed#[76BC5A6650E2A727]) [     ] o.a.s.m.r.SolrJmxReporter JMX monitoring for 'solr.node' (registry 'solr.node') enabled at server: com.sun.jmx.mbeanserver.JmxMBeanServer@1b887e25
   [junit4]   2> 2105527 INFO  (TEST-TestUseDocValuesAsStored.testManagedSchema-seed#[76BC5A6650E2A727]) [     ] o.a.s.m.r.SolrJmxReporter JMX monitoring for 'solr.jvm' (registry 'solr.jvm') enabled at server: com.sun.jmx.mbeanserver.JmxMBeanServer@1b887e25
   [junit4]   2> 2105528 INFO  (TEST-TestUseDocValuesAsStored.testManagedSchema-seed#[76BC5A6650E2A727]) [     ] o.a.s.m.r.SolrJmxReporter JMX monitoring for 'solr.jetty' (registry 'solr.jetty') enabled at server: com.sun.jmx.mbeanserver.JmxMBeanServer@1b887e25
   [junit4]   2> 2105533 INFO  (coreLoadExecutor-14554-thread-1) [    x:collection1 ] o.a.s.c.SolrConfig Using Lucene MatchVersion: 9.0.0
   [junit4]   2> 2105539 INFO  (coreLoadExecutor-14554-thread-1) [    x:collection1 ] o.a.s.s.IndexSchema [collection1] Schema name=test-non-stored-docvalues
   [junit4]   2> 2105548 INFO  (coreLoadExecutor-14554-thread-1) [    x:collection1 ] o.a.s.s.IndexSchema Loaded schema test-non-stored-docvalues/1.6 with uniqueid field id
   [junit4]   2> 2105548 INFO  (coreLoadExecutor-14554-thread-1) [    x:collection1 ] o.a.s.c.CoreContainer Creating SolrCore 'collection1' using configuration from instancedir /home/jenkins/workspace/Lucene-Solr-master-Linux/solr/build/solr-core/test/J2/temp/solr.schema.TestUseDocValuesAsStored_76BC5A6650E2A727-001/tempDir-001/collection1, trusted=true
   [junit4]   2> 2105548 INFO  (coreLoadExecutor-14554-thread-1) [    x:collection1 ] o.a.s.m.r.SolrJmxReporter JMX monitoring for 'solr.core.collection1' (registry 'solr.core.collection1') enabled at server: com.sun.jmx.mbeanserver.JmxMBeanServer@1b887e25
   [junit4]   2> 2105548 INFO  (coreLoadExecutor-14554-thread-1) [    x:collection1 ] o.a.s.c.SolrCore [[collection1] ] Opening new SolrCore at [/home/jenkins/workspace/Lucene-Solr-master-Linux/solr/build/solr-core/test/J2/temp/solr.schema.TestUseDocValuesAsStored_76BC5A6650E2A727-001/tempDir-001/collection1], dataDir=[/home/jenkins/workspace/Lucene-Solr-master-Linux/solr/build/solr-core/test/J2/temp/solr.schema.TestUseDocValuesAsStored_76BC5A6650E2A727-001/init-core-data-001/]
   [junit4]   2> 2105550 INFO  (coreLoadExecutor-14554-thread-1) [    x:collection1 ] o.a.s.u.RandomMergePolicy RandomMergePolicy wrapping class org.apache.lucene.index.TieredMergePolicy: [TieredMergePolicy: maxMergeAtOnce=23, maxMergeAtOnceExplicit=37, maxMergedSegmentMB=31.5791015625, floorSegmentMB=0.9853515625, forceMergeDeletesPctAllowed=21.078489119377895, segmentsPerTier=46.0, maxCFSSegmentSizeMB=8.796093022207999E12, noCFSRatio=0.0, deletesPctAllowed=29.499915817912743
   [junit4]   2> 2105600 WARN  (coreLoadExecutor-14554-thread-1) [    x:collection1 ] o.a.s.c.RequestHandlers INVALID paramSet a in requestHandler {type = requestHandler,name = /dump,class = DumpRequestHandler,attributes = {initParams=a, name=/dump, registerPath=/solr,/v2, class=DumpRequestHandler},args = {defaults={a=A,b=B}}}
   [junit4]   2> 2105645 INFO  (coreLoadExecutor-14554-thread-1) [    x:collection1 ] o.a.s.u.CommitTracker Hard AutoCommit: disabled
   [junit4]   2> 2105645 INFO  (coreLoadExecutor-14554-thread-1) [    x:collection1 ] o.a.s.u.CommitTracker Soft AutoCommit: disabled
   [junit4]   2> 2105647 INFO  (coreLoadExecutor-14554-thread-1) [    x:collection1 ] o.a.s.u.RandomMergePolicy RandomMergePolicy wrapping class org.apache.lucene.index.TieredMergePolicy: [TieredMergePolicy: maxMergeAtOnce=48, maxMergeAtOnceExplicit=31, maxMergedSegmentMB=42.5966796875, floorSegmentMB=0.3818359375, forceMergeDeletesPctAllowed=24.17250536855207, segmentsPerTier=13.0, maxCFSSegmentSizeMB=8.796093022207999E12, noCFSRatio=0.0, deletesPctAllowed=46.75701942805985
   [junit4]   2> 2105647 INFO  (coreLoadExecutor-14554-thread-1) [    x:collection1 ] o.a.s.s.SolrIndexSearcher Opening [Searcher@165b239[collection1] main]
   [junit4]   2> 2105647 INFO  (coreLoadExecutor-14554-thread-1) [    x:collection1 ] o.a.s.r.ManagedResourceStorage File-based storage initialized to use dir: /home/jenkins/workspace/Lucene-Solr-master-Linux/solr/build/solr-core/test/J2/temp/solr.schema.TestUseDocValuesAsStored_76BC5A6650E2A727-001/tempDir-001/collection1/conf
   [junit4]   2> 2105648 INFO  (coreLoadExecutor-14554-thread-1) [    x:collection1 ] o.a.s.h.ReplicationHandler Commits will be reserved for 10000ms.
   [junit4]   2> 2105649 INFO  (searcherExecutor-14555-thread-1-processing-x:collection1) [    x:collection1 ] o.a.s.c.SolrCore [collection1] Registered new searcher Searcher@165b239[collection1] main{ExitableDirectoryReader(UninvertingDirectoryReader())}
   [junit4]   2> 2105649 INFO  (TEST-TestUseDocValuesAsStored.testManagedSchema-seed#[76BC5A6650E2A727]) [     ] o.a.s.SolrTestCaseJ4 ####initCore end
   [junit4]   2> 2105650 INFO  (TEST-TestUseDocValuesAsStored.testManagedSchema-seed#[76BC5A6650E2A727]) [     ] o.a.s.s.ManagedIndexSchema Upgraded to managed schema at /home/jenkins/workspace/Lucene-Solr-master-Linux/solr/build/solr-core/test/J2/temp/solr.schema.TestUseDocValuesAsStored_76BC5A6650E2A727-001/tempDir-001/collection1/conf/managed-schema
   [junit4]   2> 2105656 INFO  (TEST-TestUseDocValuesAsStored.testManagedSchema-seed#[76BC5A6650E2A727]) [     ] o.a.s.s.ManagedIndexSchema Upgraded to managed schema at /home/jenkins/workspace/Lucene-Solr-master-Linux/solr/build/solr-core/test/J2/temp/solr.schema.TestUseDocValuesAsStored_76BC5A6650E2A727-001/tempDir-001/collection1/conf/managed-schema
   [junit4]   2> 2105661 INFO  (TEST-TestUseDocValuesAsStored.testManagedSchema-seed#[76BC5A6650E2A727]) [     ] o.a.s.u.DirectUpdateHandler2 [collection1] REMOVING ALL DOCUMENTS FROM INDEX
   [junit4]   2> 2105661 INFO  (TEST-TestUseDocValuesAsStored.testManagedSchema-seed#[76BC5A6650E2A727]) [     ] o.a.s.u.p.LogUpdateProcessorFactory [collection1]  webapp=null path=null params={_version_=-9223372036854775807&update.distrib=FROMLEADER&versions=true&wt=json&indent=true}{deleteByQuery=*:*} 0 0
   [junit4]   2> 2105661 INFO  (TEST-TestUseDocValuesAsStored.testManagedSchema-seed#[76BC5A6650E2A727]) [     ] o.a.s.u.p.LogUpdateProcessorFactory [collection1]  webapp=null path=null params={}{add=[myid1]} 0 0
   [junit4]   2> 2105662 INFO  (TEST-TestUseDocValuesAsStored.testManagedSchema-seed#[76BC5A6650E2A727]) [     ] o.a.s.u.DirectUpdateHandler2 start commit{,optimize=false,openSearcher=true,waitSearcher=true,expungeDeletes=false,softCommit=false,prepareCommit=false}
   [junit4]   2> 2105662 INFO  (TEST-TestUseDocValuesAsStored.testManagedSchema-seed#[76BC5A6650E2A727]) [     ] o.a.s.u.SolrIndexWriter Calling setCommitData with IW:org.apache.solr.update.SolrIndexWriter@4c0784af commitCommandVersion:0
   [junit4]   2> 2105743 INFO  (TEST-TestUseDocValuesAsStored.testManagedSchema-seed#[76BC5A6650E2A727]) [     ] o.a.s.s.SolrIndexSearcher Opening [Searcher@122c8855[collection1] main]
   [junit4]   2> 2105746 INFO  (searcherExecutor-14555-thread-1) [     ] o.a.s.c.SolrCore [collection1] Registered new searcher Searcher@122c8855[collection1] main{ExitableDirectoryReader(UninvertingDirectoryReader(Uninverting(_0(9.0.0):C1:[diagnostics={java.version=12.0.1, java.vm.version=12.0.1+12, lucene.version=9.0.0, source=flush, os.arch=amd64, java.runtime.version=12.0.1+12, os.version=4.18.0-25-generic, os=Linux, java.vendor=AdoptOpenJDK, timestamp=1564450521316}]:[attributes={Lucene50StoredFieldsFormat.mode=BEST_SPEED}])))}
   [junit4]   2> 2105746 INFO  (TEST-TestUseDocValuesAsStored.testManagedSchema-seed#[76BC5A6650E2A727]) [     ] o.a.s.u.DirectUpdateHandler2 end_commit_flush
   [junit4]   2> 2105746 INFO  (TEST-TestUseDocValuesAsStored.testManagedSchema-seed#[76BC5A6650E2A727]) [     ] o.a.s.u.p.LogUpdateProcessorFactory [collection1]  webapp=null path=null params={}{commit=} 0 84
   [junit4]   2> 2105748 INFO  (TEST-TestUseDocValuesAsStored.testManagedSchema-seed#[76BC5A6650E2A727]) [     ] o.a.s.c.S.Request [collection1]  webapp=null path=null params={q=id:myid*&fl=*&wt=xml} hits=1 status=0 QTime=0
   [junit4]   2> 2105749 INFO  (TEST-TestUseDocValuesAsStored.testManagedSchema-seed#[76BC5A6650E2A727]) [     ] o.a.s.u.DirectUpdateHandler2 [collection1] REMOVING ALL DOCUMENTS FROM INDEX
   [junit4]   2> 2105749 INFO  (TEST-TestUseDocValuesAsStored.testManagedSchema-seed#[76BC5A6650E2A727]) [     ] o.a.s.u.p.LogUpdateProcessorFactory [collection1]  webapp=null path=null params={_version_=-9223372036854775807&update.distrib=FROMLEADER&versions=true&wt=json&indent=true}{deleteByQuery=*:*} 0 0
   [junit4]   2> 2105750 INFO  (TEST-TestUseDocValuesAsStored.testManagedSchema-seed#[76BC5A6650E2A727]) [     ] o.a.s.SolrTestCaseJ4 ###deleteCore
   [junit4]   2> 2105750 INFO  (TEST-TestUseDocValuesAsStored.testManagedSchema-seed#[76BC5A6650E2A727]) [     ] o.a.s.c.CoreContainer Shutting down CoreContainer instance=1459210581
   [junit4]   2> 2105751 INFO  (coreCloseExecutor-14559-thread-1) [    x:collection1 ] o.a.s.c.SolrCore [collection1]  CLOSING SolrCore org.apache.solr.core.SolrCore@3f0ba5c3
   [junit4]   2> 2105751 INFO  (coreCloseExecutor-14559-thread-1) [    x:collection1 ] o.a.s.m.SolrMetricManager Closing metric reporters for registry=solr.core.collection1, tag=3f0ba5c3
   [junit4]   2> 2105751 INFO  (coreCloseExecutor-14559-thread-1) [    x:collection1 ] o.a.s.m.r.SolrJmxReporter Closing reporter [org.apache.solr.metrics.reporters.SolrJmxReporter@4b393065: rootName = null, domain = solr.core.collection1, service url = null, agent id = null] for registry solr.core.collection1 / com.codahale.metrics.MetricRegistry@1197076
   [junit4]   2> 2105778 INFO  (TEST-TestUseDocValuesAsStored.testManagedSchema-seed#[76BC5A6650E2A727]) [     ] o.a.s.m.SolrMetricManager Closing metric reporters for registry=solr.node, tag=null
   [junit4]   2> 2105778 INFO  (TEST-TestUseDocValuesAsStored.testManagedSchema-seed#[76BC5A6650E2A727]) [     ] o.a.s.m.r.SolrJmxReporter Closing reporter [org.apache.solr.metrics.reporters.SolrJmxReporter@38c720b5: rootName = null, domain = solr.node, service url = null, agent id = null] for registry solr.node / com.codahale.metrics.MetricRegistry@71e61c9a
   [junit4]   2> 2105785 INFO  (TEST-TestUseDocValuesAsStored.testManagedSchema-seed#[76BC5A6650E2A727]) [     ] o.a.s.m.SolrMetricManager Closing metric reporters for registry=solr.jvm, tag=null
   [junit4]   2> 2105785 INFO  (TEST-TestUseDocValuesAsStored.testManagedSchema-seed#[76BC5A6650E2A727]) [     ] o.a.s.m.r.SolrJmxReporter Closing reporter [org.apache.solr.metrics.reporters.SolrJmxReporter@58743cde: rootName = null, domain = solr.jvm, service url = null, agent id = null] for registry solr.jvm / com.codahale.metrics.MetricRegistry@73a619a6
   [junit4]   2> 2105789 INFO  (TEST-TestUseDocValuesAsStored.testManagedSchema-seed#[76BC5A6650E2A727]) [     ] o.a.s.m.SolrMetricManager Closing metric reporters for registry=solr.jetty, tag=null
   [junit4]   2> 2105789 INFO  (TEST-TestUseDocValuesAsStored.testManagedSchema-seed#[76BC5A6650E2A727]) [     ] o.a.s.m.r.SolrJmxReporter Closing reporter [org.apache.solr.metrics.reporters.SolrJmxReporter@70b7b3c: rootName = null, domain = solr.jetty, service url = null, agent id = null] for registry solr.jetty / com.codahale.metrics.MetricRegistry@78b2e80
   [junit4]   2> 2105803 INFO  (TEST-TestUseDocValuesAsStored.testManagedSchema-seed#[76BC5A6650E2A727]) [     ] o.a.s.SolrTestCaseJ4 ###Ending testManagedSchema
   [junit4]   2> 2105808 INFO  (TEST-TestUseDocValuesAsStored.testRandomSingleAndMultiValued-seed#[76BC5A6650E2A727]) [     ] o.a.s.SolrTestCaseJ4 ###Starting testRandomSingleAndMultiValued
   [junit4]   2> 2105811 INFO  (TEST-TestUseDocValuesAsStored.testRandomSingleAndMultiValued-seed#[76BC5A6650E2A727]) [     ] o.a.s.SolrTestCaseJ4 ####initCore
   [junit4]   2> 2105826 INFO  (TEST-TestUseDocValuesAsStored.testRandomSingleAndMultiValued-seed#[76BC5A6650E2A727]) [     ] o.a.s.c.SolrConfig Using Lucene MatchVersion: 9.0.0
   [junit4]   2> 2105835 INFO  (TEST-TestUseDocValuesAsStored.testRandomSingleAndMultiValued-seed#[76BC5A6650E2A727]) [     ] o.a.s.s.ManagedIndexSchemaFactory The schema is configured as managed, but managed schema resource managed-schema not found - loading non-managed schema schema-non-stored-docvalues.xml instead
   [junit4]   2> 2105837 INFO  (TEST-TestUseDocValuesAsStored.testRandomSingleAndMultiValued-seed#[76BC5A6650E2A727]) [     ] o.a.s.s.IndexSchema [null] Schema name=test-non-stored-docvalues
   [junit4]   2> 2105841 INFO  (TEST-TestUseDocValuesAsStored.testRandomSingleAndMultiValued-seed#[76BC5A6650E2A727]) [     ] o.a.s.s.IndexSchema Loaded schema test-non-stored-docvalues/1.6 with uniqueid field id
   [junit4]   2> 2105842 INFO  (TEST-TestUseDocValuesAsStored.testRandomSingleAndMultiValued-seed#[76BC5A6650E2A727]) [     ] o.a.s.s.ManagedIndexSchema Upgraded to managed schema at /home/jenkins/workspace/Lucene-Solr-master-Linux/solr/build/solr-core/test/J2/temp/solr.schema.TestUseDocValuesAsStored_76BC5A6650E2A727-001/tempDir-002/collection1/conf/managed-schema
   [junit4]   2> 2105848 INFO  (TEST-TestUseDocValuesAsStored.testRandomSingleAndMultiValued-seed#[76BC5A6650E2A727]) [     ] o.a.s.s.ManagedIndexSchemaFactory After upgrading to managed schema, renamed the non-managed schema /home/jenkins/workspace/Lucene-Solr-master-Linux/solr/build/solr-core/test/J2/temp/solr.schema.TestUseDocValuesAsStored_76BC5A6650E2A727-001/tempDir-002/collection1/conf/schema-non-stored-docvalues.xml to /home/jenkins/workspace/Lucene-Solr-master-Linux/solr/build/solr-core/test/J2/temp/solr.schema.TestUseDocValuesAsStored_76BC5A6650E2A727-001/tempDir-002/collection1/conf/schema-non-stored-docvalues.xml.bak
   [junit4]   2> 2105944 INFO  (TEST-TestUseDocValuesAsStored.testRandomSingleAndMultiValued-seed#[76BC5A6650E2A727]) [     ] o.a.s.h.c.HttpShardHandlerFactory Host whitelist initialized: WhitelistHostChecker [whitelistHosts=null, whitelistHostCheckingEnabled=true]
   [junit4]   2> 2105946 WARN  (TEST-TestUseDocValuesAsStored.testRandomSingleAndMultiValued-seed#[76BC5A6650E2A727]) [     ] o.e.j.u.s.S.config Trusting all certificates configured for Client@7c68ee12[provider=null,keyStore=null,trustStore=null]
   [junit4]   2> 2105946 WARN  (TEST-TestUseDocValuesAsStored.testRandomSingleAndMultiValued-seed#[76BC5A6650E2A727]) [     ] o.e.j.u.s.S.config No Client EndPointIdentificationAlgorithm configured for Client@7c68ee12[provider=null,keyStore=null,trustStore=null]
   [junit4]   2> 2105955 WARN  (TEST-TestUseDocValuesAsStored.testRandomSingleAndMultiValued-seed#[76BC5A6650E2A727]) [     ] o.e.j.u.s.S.config Trusting all certificates configured for Client@765b553a[provider=null,keyStore=null,trustStore=null]
   [junit4]   2> 2105955 WARN  (TEST-TestUseDocValuesAsStored.testRandomSingleAndMultiValued-seed#[76BC5A6650E2A727]) [     ] o.e.j.u.s.S.config No Client EndPointIdentificationAlgorithm configured for Client@765b553a[provider=null,keyStore=null,trustStore=null]
   [junit4]   2> 2105982 INFO  (TEST-TestUseDocValuesAsStored.testRandomSingleAndMultiValued-seed#[76BC5A6650E2A727]) [     ] o.a.s.c.TransientSolrCoreCacheDefault Allocating transient cache for 2147483647 transient cores
   [junit4]   2> 2105982 INFO  (TEST-TestUseDocValuesAsStored.testRandomSingleAndMultiValued-seed#[76BC5A6650E2A727]) [     ] o.a.s.h.a.MetricsHistoryHandler No .system collection, keeping metrics history in memory.
   [junit4]   2> 2105998 INFO  (TEST-TestUseDocValuesAsStored.testRandomSingleAndMultiValued-seed#[76BC5A6650E2A727]) [     ] o.a.s.m.r.SolrJmxReporter JMX monitoring for 'solr.node' (registry 'solr.node') enabled at server: com.sun.jmx.mbeanserver.JmxMBeanServer@1b887e25
   [junit4]   2> 2106017 INFO  (TEST-TestUseDocValuesAsStored.testRandomSingleAndMultiValued-seed#[76BC5A6650E2A727]) [     ] o.a.s.m.r.SolrJmxReporter JMX monitoring for 'solr.jvm' (registry 'solr.jvm') enabled at server: com.sun.jmx.mbeanserver.JmxMBeanServer@1b887e25
   [junit4]   2> 2106017 INFO  (TEST-TestUseDocValuesAsStored.testRandomSingleAndMultiValued-seed#[76BC5A6650E2A727]) [     ] o.a.s.m.r.SolrJmxReporter JMX monitoring for 'solr.jetty' (registry 'solr.jetty') enabled at server: com.sun.jmx.mbeanserver.JmxMBeanServer@1b887e25
   [junit4]   2> 2106038 INFO  (coreLoadExecutor-14569-thread-1) [    x:collection1 ] o.a.s.c.SolrConfig Using Lucene MatchVersion: 9.0.0
   [junit4]   2> 2106064 INFO  (coreLoadExecutor-14569-thread-1) [    x:collection1 ] o.a.s.s.IndexSchema [collection1] Schema name=test-non-stored-docvalues
   [junit4]   2> 2106068 INFO  (coreLoadExecutor-14569-thread-1) [    x:collection1 ] o.a.s.s.IndexSchema Loaded schema test-non-stored-docvalues/1.6 with uniqueid field id
   [junit4]   2> 2106068 INFO  (coreLoadExecutor-14569-thread-1) [    x:collection1 ] o.a.s.c.CoreContainer Creating SolrCore 'collection1' using configuration from instancedir /home/jenkins/workspace/Lucene-Solr-master-Linux/solr/build/solr-core/test/J2/temp/solr.schema.TestUseDocValuesAsStored_76BC5A6650E2A727-001/tempDir-002/collection1, trusted=true
   [junit4]   2> 2106068 INFO  (coreLoadExecutor-14569-thread-1) [    x:collection1 ] o.a.s.m.r.SolrJmxReporter JMX monitoring for 'solr.core.collection1' (registry 'solr.core.collection1') enabled at server: com.sun.jmx.mbeanserver.JmxMBeanServer@1b887e25
   [junit4]   2> 2106068 INFO  (coreLoadExecutor-14569-thread-1) [    x:collection1 ] o.a.s.c.SolrCore [[collection1] ] Opening new SolrCore at [/home/jenkins/workspace/Lucene-Solr-master-Linux/solr/build/solr-core/test/J2/temp/solr.schema.TestUseDocValuesAsStored_76BC5A6650E2A727-001/tempDir-002/collection1], dataDir=[/home/jenkins/workspace/Lucene-Solr-master-Linux/solr/build/solr-core/test/J2/temp/solr.schema.TestUseDocValuesAsStored_76BC5A6650E2A727-001/init-core-data-001/]
   [junit4]   2> 2106070 WARN  (coreLoadExecutor-14569-thread-1) [    x:collection1 ] o.a.s.c.RequestHandlers INVALID paramSet a in requestHandler {type = requestHandler,name = /dump,class = DumpRequestHandler,attributes = {initParams=a, name=/dump, registerPath=/solr,/v2, class=DumpRequestHandler},args = {defaults={a=A,b=B}}}
   [junit4]   2> 2106106 INFO  (coreLoadExecutor-14569-thread-1) [    x:collection1 ] o.a.s.u.CommitTracker Hard AutoCommit: disabled
   [junit4]   2> 2106106 INFO  (coreLoadExecutor-14569-thread-1) [    x:collection1 ] o.a.s.u.CommitTracker Soft AutoCommit: disabled
   [junit4]   2> 2106107 INFO  (coreLoadExecutor-14569-thread-1) [    x:collection1 ] o.a.s.u.RandomMergePolicy RandomMergePolicy wrapping class org.apache.lucene.index.TieredMergePolicy: [TieredMergePolicy: maxMergeAtOnce=23, maxMergeAtOnceExplicit=37, maxMergedSegmentMB=31.5791015625, floorSegmentMB=0.9853515625, forceMergeDeletesPctAllowed=21.078489119377895, segmentsPerTier=46.0, maxCFSSegmentSizeMB=8.796093022207999E12, noCFSRatio=0.0, deletesPctAllowed=29.499915817912743
   [junit4]   2> 2106108 INFO  (coreLoadExecutor-14569-thread-1) [    x:collection1 ] o.a.s.s.SolrIndexSearcher Opening [Searcher@42a53ac0[collection1] main]
   [junit4]   2> 2106108 INFO  (coreLoadExecutor-14569-thread-1) [    x:collection1 ] o.a.s.r.ManagedResourceStorage File-based storage initialized to use dir: /home/jenkins/workspace/Lucene-Solr-master-Linux/solr/build/solr-core/test/J2/temp/solr.schema.TestUseDocValuesAsStored_76BC5A6650E2A727-001/tempDir-002/collection1/conf
   [junit4]   2> 2106109 INFO  (coreLoadExecutor-14569-thread-1) [    x:collection1 ] o.a.s.h.ReplicationHandler Commits will be reserved for 10000ms.
   [junit4]   2> 2106110 INFO  (searcherExecutor-14570-thread-1-processing-x:collection1) [    x:collection1 ] o.a.s.c.SolrCore [collection1] Registered new searcher Searcher@42a53ac0[collection1] main{ExitableDirectoryReader(UninvertingDirectoryReader(Uninverting(_0(9.0.0):C1:[diagnostics={java.version=12.0.1, java.vm.version=12.0.1+12, lucene.version=9.0.0, source=flush, os.arch=amd64, java.runtime.version=12.0.1+12, os.version=4.18.0-25-generic, java.vendor=AdoptOpenJDK, os=Linux, timestamp=1564450521316}]:[attributes={Lucene50StoredFieldsFormat.mode=BEST_SPEED}])))}
   [junit4]   2> 2106110 INFO  (TEST-TestUseDocValuesAsStored.testRandomSingleAndMultiValued-seed#[76BC5A6650E2A727]) [     ] o.a.s.SolrTestCaseJ4 ####initCore end
   [junit4]   2> 2106111 INFO  (TEST-TestUseDocValuesAsStored.testRandomSingleAndMultiValued-seed#[76BC5A6650E2A727]) [     ] o.a.s.u.DirectUpdateHandler2 [collection1] REMOVING ALL DOCUMENTS FROM INDEX
   [junit4]   2> 2106111 INFO  (TEST-TestUseDocValuesAsStored.testRandomSingleAndMultiValued-seed#[76BC5A6650E2A727]) [     ] o.a.s.u.p.LogUpdateProcessorFactory [collection1]  webapp=null path=null params={_version_=-9223372036854775807&update.distrib=FROMLEADER&versions=true&wt=json&indent=true}{deleteByQuery=*:*} 0 0
   [junit4]   2> 2106112 INFO  (TEST-TestUseDocValuesAsStored.testRandomSingleAndMultiValued-seed#[76BC5A6650E2A727]) [     ] o.a.s.u.p.LogUpdateProcessorFactory [collection1]  webapp=null path=null params={}{add=[1]} 0 0
   [junit4]   2> 2106112 INFO  (TEST-TestUseDocValuesAsStored.testRandomSingleAndMultiValued-seed#[76BC5A6650E2A727]) [     ] o.a.s.u.DirectUpdateHandler2 start commit{,optimize=false,openSearcher=true,waitSearcher=true,expungeDeletes=false,softCommit=false,prepareCommit=false}
   [junit4]   2> 2106112 INFO  (TEST-TestUseDocValuesAsStored.testRandomSingleAndMultiValued-seed#[76BC5A6650E2A727]) [     ] o.a.s.u.SolrIndexWriter Calling setCommitData with IW:org.apache.solr.update.SolrIndexWriter@65f1fa9f commitCommandVersion:0
   [junit4]   2> 2106207 INFO  (TEST-TestUseDocValuesAsStored.testRandomSingleAndMultiValued-seed#[76BC5A6650E2A727]) [     ] o.a.s.s.SolrIndexSearcher Opening [Searcher@77bc2df3[collection1] main]
   [junit4]   2> 2106207 INFO  (TEST-TestUseDocValuesAsStored.testRandomSingleAndMultiValued-seed#[76BC5A6650E2A727]) [     ] o.a.s.u.DirectUpdateHandler2 end_commit_flush
   [junit4]   2> 2106211 INFO  (searcherExecutor-14570-thread-1) [     ] o.a.s.c.SolrCore [collection1] Registered new searcher Searcher@77bc2df3[collection1] main{ExitableDirectoryReader(UninvertingDirectoryReader(Uninverting(_1(9.0.0):C1:[diagnostics={java.version=12.0.1, java.vm.version=12.0.1+12, lucene.version=9.0.0, source=flush, os.arch=amd64, java.runtime.version=12.0.1+12, os.version=4.18.0-25-generic, os=Linux, java.vendor=AdoptOpenJDK, timestamp=1564450521766}]:[attributes={Lucene50StoredFieldsFormat.mode=BEST_SPEED}])))}
   [junit4]   2> 2106215 INFO  (TEST-TestUseDocValuesAsStored.testRandomSingleAndMultiValued-seed#[76BC5A6650E2A727]) [     ] o.a.s.u.p.LogUpdateProcessorFactory [collection1]  webapp=null path=null params={}{commit=} 0 102
   [junit4]   2> 2106215 INFO  (TEST-TestUseDocValuesAsStored.testRandomSingleAndMultiValued-seed#[76BC5A6650E2A727]) [     ] o.a.s.c.S.Request [collection1]  webapp=null path=null params={q=id:1&fl=test_ss_dvo&wt=xml} hits=1 status=0 QTime=0
   [junit4]   2> 2106217 INFO  (TEST-TestUseDocValuesAsStored.testRandomSingleAndMultiValued-seed#[76BC5A6650E2A727]) [     ] o.a.s.c.S.Request [collection1]  webapp=null path=null params={q=id:1&fl=test_ss_dvo,*&wt=xml} hits=1 status=0 QTime=0
   [junit4]   2> 2106218 INFO  (TEST-TestUseDocValuesAsStored.testRandomSingleAndMultiValued-seed#[76BC5A6650E2A727]) [     ] o.a.s.c.S.Request [collection1]  webapp=null path=null params={q=id:1&fl=*dvo&wt=xml} hits=1 status=0 QTime=0
   [junit4]   2> 2106219 INFO  (TEST-TestUseDocValuesAsStored.testRandomSingleAndMultiValued-seed#[76BC5A6650E2A727]) [     ] o.a.s.c.S.Request [collection1]  webapp=null path=null params={q=id:1&fl=*&wt=xml} hits=1 status=0 QTime=0
   [junit4]   2> 2106219 INFO  (TEST-TestUseDocValuesAsStored.testRandomSingleAndMultiValued-seed#[76BC5A6650E2A727]) [     ] o.a.s.c.S.Request [collection1]  webapp=null path=null params={q=id:1&fl=test_ss_dvo,fakeFieldName&wt=xml} hits=1 status=0 QTime=0
   [junit4]   2> 2106220 INFO  (TEST-TestUseDocValuesAsStored.testRandomSingleAndMultiValued-seed#[76BC5A6650E2A727]) [     ] o.a.s.c.S.Request [collection1]  webapp=null path=null params={q=*:*&fl=*&wt=xml} hits=1 status=0 QTime=0
   [junit4]   2> 2106221 INFO  (TEST-TestUseDocValuesAsStored.testRandomSingleAndMultiValued-seed#[76BC5A6650E2A727]) [     ] o.a.s.u.p.LogUpdateProcessorFactory [collection1]  webapp=null path=null params={}{add=[2]} 0 0
   [junit4]   2> 2106221 INFO  (TEST-TestUseDocValuesAsStored.testRandomSingleAndMultiValued-seed#[76BC5A6650E2A727]) [     ] o.a.s.u.DirectUpdateHandler2 start commit{,optimize=false,openSearcher=true,waitSearcher=true,expungeDeletes=false,softCommit=false,prepareCommit=false}
   [junit4]   2> 2106221 INFO  (TEST-TestUseDocValuesAsStored.testRandomSingleAndMultiValued-seed#[76BC5A6650E2A727]) [     ] o.a.s.u.SolrIndexWriter Calling setCommitData with IW:org.apache.solr.update.SolrIndexWriter@65f1fa9f commitCommandVersion:0
   [junit4]   2> 2106308 INFO  (TEST-TestUseDocValuesAsStored.testRandomSingleAndMultiValued-seed#[76BC5A6650E2A727]) [     ] o.a.s.s.SolrIndexSearcher Opening [Searcher@2c9bcff[collection1] main]
   [junit4]   2> 2106309 INFO  (TEST-TestUseDocValuesAsStored.testRandomSingleAndMultiValued-seed#[76BC5A6650E2A727]) [     ] o.a.s.u.DirectUpdateHandler2 end_commit_flush
   [junit4]   2> 2106310 INFO  (searcherExecutor-14570-thread-1) [     ] o.a.s.c.SolrCore [collection1] Registered new searcher Searcher@2c9bcff[collection1] main{ExitableDirectoryReader(UninvertingDirectoryReader(Uninverting(_1(9.0.0):C1:[diagnostics={java.version=12.0.1, java.vm.version=12.0.1+12, lucene.version=9.0.0, source=flush, os.arch=amd64, java.runtime.version=12.0.1+12, os.version=4.18.0-25-generic, os=Linux, java.vendor=AdoptOpenJDK, timestamp=1564450521766}]:[attributes={Lucene50StoredFieldsFormat.mode=BEST_SPEED}]) Uninverting(_2(9.0.0):C1:[diagnostics={java.version=12.0.1, java.vm.version=12.0.1+12, lucene.version=9.0.0, source=flush, os.arch=amd64, java.runtime.version=12.0.1+12, os.version=4.18.0-25-generic, os=Linux, java.vendor=AdoptOpenJDK, timestamp=1564450521875}]:[attributes={Lucene50StoredFieldsFormat.mode=BEST_SPEED}])))}
   [junit4]   2> 2106311 INFO  (TEST-TestUseDocValuesAsStored.testRandomSingleAndMultiValued-seed#[76BC5A6650E2A727]) [     ] o.a.s.u.p.LogUpdateProcessorFactory [collection1]  webapp=null path=null params={}{commit=} 0 89
   [junit4]   2> 2106312 INFO  (TEST-TestUseDocValuesAsStored.testRandomSingleAndMultiValued-seed#[76BC5A6650E2A727]) [     ] o.a.s.c.S.Request [collection1]  webapp=null path=null params={q=id:2&fl=test_i_dvo&wt=xml} hits=1 status=0 QTime=0
   [junit4]   2> 2106312 INFO  (TEST-TestUseDocValuesAsStored.testRandomSingleAndMultiValued-seed#[76BC5A6650E2A727]) [     ] o.a.s.c.S.Request [collection1]  webapp=null path=null params={q=id:2&fl=test_i_dvo,*&wt=xml} hits=1 status=0 QTime=0
   [junit4]   2> 2106312 INFO  (TEST-TestUseDocValuesAsStored.testRandomSingleAndMultiValued-seed#[76BC5A6650E2A727]) [     ] o.a.s.c.S.Request [collection1]  webapp=null path=null params={q=id:2&fl=*dvo&wt=xml} hits=1 status=0 QTime=0
   [junit4]   2> 2106313 INFO  (TEST-TestUseDocValuesAsStored.testRandomSingleAndMultiValued-seed#[76BC5A6650E2A727]) [     ] o.a.s.c.S.Request [collection1]  webapp=null path=null params={q=id:2&fl=*&wt=xml} hits=1 status=0 QTime=0
   [junit4]   2> 2106313 INFO  (TEST-TestUseDocValuesAsStored.testRandomSingleAndMultiValued-seed#[76BC5A6650E2A727]) [     ] o.a.s.c.S.Request [collection1]  webapp=null path=null params={q=id:2&fl=test_i_dvo,fakeFieldName&wt=xml} hits=1 status=0 QTime=0
   [junit4]   2> 2106313 INFO  (TEST-TestUseDocValuesAsStored.testRandomSingleAndMultiValued-seed#[76BC5A6650E2A727]) [     ] o.a.s.c.S.Request [collection1]  webapp=null path=null params={q=*:*&fl=*&wt=xml} hits=2 status=0 QTime=0
   [junit4]   2> 2106314 INFO  (TEST-TestUseDocValuesAsStored.testRandomSingleAndMultiValued-seed#[76BC5A6650E2A727]) [     ] o.a.s.u.p.LogUpdateProcessorFactory [collection1]  webapp=null path=null params={}{add=[3]} 0 0
   [junit4]   2> 2106314 INFO  (TEST-TestUseDocValuesAsStored.testRandomSingleAndMultiValued-seed#[76BC5A6650E2A727]) [     ] o.a.s.u.DirectUpdateHandler2 start commit{,optimize=false,openSearcher=true,waitSearcher=true,expungeDeletes=false,softCommit=false,prepareCommit=false}
   [junit4]   2> 2106314 INFO  (TEST-TestUseDocValuesAsStored.testRandomSingleAndMultiValued-seed#[76BC5A6650E2A727]) [     ] o.a.s.u.SolrIndexWriter Calling setCommitData with IW:org.apache.solr.update.SolrIndexWriter@65f1fa9f commitCommandVersion:0
   [junit4]   2> 2106432 INFO  (TEST-TestUseDocValuesAsStored.testRandomSingleAndMultiValued-seed#[76BC5A6650E2A727]) [     ] o.a.s.s.SolrIndexSearcher Opening [Searcher@674b6525[collection1] main]
   [junit4]   2> 2106434 INFO  (searcherExecutor-14570-thread-1) [     ] o.a.s.c.SolrCore [collection1] Registered new searcher Searcher@674b6525[collection1] main{ExitableDirectoryReader(UninvertingDirectoryReader(Uninverting(_1(9.0.0):C1:[diagnostics={java.version=12.0.1, java.vm.version=12.0.1+12, lucene.version=9.0.0, source=flush, os.arch=amd64, java.runtime.version=12.0.1+12, os.version=4.18.0-25-generic, os=Linux, java.vendor=AdoptOpenJDK, timestamp=1564450521766}]:[attributes={Lucene50StoredFieldsFormat.mode=BEST_SPEED}]) Uninverting(_2(9.0.0):C1:[diagnostics={java.version=12.0.1, java.vm.version=12.0.1+12, lucene.version=9.0.0, source=flush, os.arch=amd64, java.runtime.version=12.0.1+12, os.version=4.18.0-25-generic, os=Linux, java.vendor=AdoptOpenJDK, timestamp=1564450521875}]:[attributes={Lucene50StoredFieldsFormat.mode=BEST_SPEED}]) Uninverting(_3(9.0.0):C1:[diagnostics={java.version=12.0.1, java.vm.version=12.0.1+12, lucene.version=9.0.0, source=flush, os.arch=amd64, java.runtime.version=12.0.1+12, os.version=4.18.0-25-generic, os=Linux, java.vendor=AdoptOpenJDK, timestamp=1564450521967}]:[attributes={Lucene50StoredFieldsFormat.mode=BEST_SPEED}])))}
   [junit4]   2> 2106434 INFO  (TEST-TestUseDocValuesAsStored.testRandomSingleAndMultiValued-seed#[76BC5A6650E2A727]) [     ] o.a.s.u.DirectUpdateHandler2 end_commit_flush
   [junit4]   2> 2106434 INFO  (TEST-TestUseDocValuesAsStored.testRandomSingleAndMultiValued-seed#[76BC5A6650E2A727]) [     ] o.a.s.u.p.LogUpdateProcessorFactory [collection1]  webapp=null path=null params={}{commit=} 0 119
   [junit4]   2> 2106435 INFO  (TEST-TestUseDocValuesAsStored.testRandomSingleAndMultiValued-seed#[76BC5A6650E2A727]) [     ] o.a.s.c.S.Request [collection1]  webapp=null path=null params={q=id:3&fl=test_d_dvo&wt=xml} hits=1 status=0 QTime=0
   [junit4]   2> 2106435 INFO  (TEST-TestUseDocValuesAsStored.testRandomSingleAndMultiValued-seed#[76BC5A6650E2A727]) [     ] o.a.s.c.S.Request [collection1]  webapp=null path=null params={q=id:3&fl=test_d_dvo,*&wt=xml} hits=1 status=0 QTime=0
   [junit4]   2> 2106436 INFO  (TEST-TestUseDocValuesAsStored.testRandomSingleAndMultiValued-seed#[76BC5A6650E2A727]) [     ] o.a.s.c.S.Request [collection1]  webapp=null path=null params={q=id:3&fl=*dvo&wt=xml} hits=1 status=0 QTime=0
   [junit4]   2> 2106436 INFO  (TEST-TestUseDocValuesAsStored.testRandomSingleAndMultiValued-seed#[76BC5A6650E2A727]) [     ] o.a.s.c.S.Request [collection1]  webapp=null path=null params={q=id:3&fl=*&wt=xml} hits=1 status=0 QTime=0
   [junit4]   2> 2106436 INFO  (TEST-TestUseDocValuesAsStored.testRandomSingleAndMultiValued-seed#[76BC5A6650E2A727]) [     ] o.a.s.c.S.Request [collection1]  webapp=null path=null params={q=id:3&fl=test_d_dvo,fakeFieldName&wt=xml} hits=1 status=0 QTime=0
   [junit4]   2> 2106436 INFO  (TEST-TestUseDocValuesAsStored.testRandomSingleAndMultiValued-seed#[76BC5A6650E2A727]) [     ] o.a.s.c.S.Request [collection1]  webapp=null path=null params={q=*:*&fl=*&wt=xml} hits=3 status=0 QTime=0
   [junit4]   2> 2106437 INFO  (TEST-TestUseDocValuesAsStored.testRandomSingleAndMultiValued-seed#[76BC5A6650E2A727]) [     ] o.a.s.u.p.LogUpdateProcessorFactory [collection1]  webapp=null path=null params={}{add=[4]} 0 0
   [junit4]   2> 2106437 INFO  (TEST-TestUseDocValuesAsStored.testRandomSingleAndMultiValued-seed#[76BC5A6650E2A727]) [     ] o.a.s.u.DirectUpdateHandler2 start commit{,optimize=false,openSearcher=true,waitSearcher=true,expungeDeletes=false,softCommit=false,prepareCommit=false}
   [junit4]   2> 2106437 INFO  (TEST-TestUseDocValuesAsStored.testRandomSingleAndMultiValued-seed#[76BC5A6650E2A727]) [     ] o.a.s.u.SolrIndexWriter Calling setCommitData with IW:org.apache.solr.update.SolrIndexWriter@65f1fa9f commitCommandVersion:0
   [junit4]   2> 2106614 INFO  (TEST-TestUseDocValuesAsStored.testRandomSingleAndMultiValued-seed#[76BC5A6650E2A727]) [     ] o.a.s.s.SolrIndexSearcher Opening [Searcher@4cbea184[collection1] main]
   [junit4]   2> 2106615 INFO  (TEST-TestUseDocValuesAsStored.testRandomSingleAndMultiValued-seed#[76BC5A6650E2A727]) [     ] o.a.s.u.DirectUpdateHandler2 end_commit_flush
   [junit4]   2> 2106616 INFO  (searcherExecutor-14570-thread-1) [     ] o.a.s.c.SolrCore [collection1] Registered new searcher Searcher@4cbea184[collection1] main{ExitableDirectoryReader(UninvertingDirectoryReader(Uninverting(_1(9.0.0):C1:[diagnostics={java.version=12.0.1, java.vm.version=12.0.1+12, lucene.version=9.0.0, source=flush, os.arch=amd64, java.runtime.version=12.0.1+12, os.version=4.18.0-25-generic, os=Linux, java.vendor=AdoptOpenJDK, timestamp=1564450521766}]:[attributes={Lucene50StoredFieldsFormat.mode=BEST_SPEED}]) Uninverting(_2(9.0.0):C1:[diagnostics={java.version=12.0.1, java.vm.version=12.0.1+12, lucene.version=9.0.0, source=flush, os.arch=amd64, java.runtime.version=12.0.1+12, os.version=4.18.0-25-generic, os=Linux, java.vendor=AdoptOpenJDK, timestamp=1564450521875}]:[attributes={Lucene50StoredFieldsFormat.mode=BEST_SPEED}]) Uninverting(_3(9.0.0):C1:[diagnostics={java.version=12.0.1, java.vm.version=12.0.1+12, lucene.version=9.0.0, source=flush, os.arch=amd64, java.runtime.version=12.0.1+12, os.version=4.18.0-25-generic, os=Linux, java.vendor=AdoptOpenJDK, timestamp=1564450521967}]:[attributes={Lucene50StoredFieldsFormat.mode=BEST_SPEED}]) Uninverting(_4(9.0.0):C1:[diagnostics={java.version=12.0.1, java.vm.version=12.0.1+12, lucene.version=9.0.0, source=flush, os.arch=amd64, java.runtime.version=12.0.1+12, os.version=4.18.0-25-generic, os=Linux, java.vendor=AdoptOpenJDK, timestamp=1564450522091}]:[attributes={Lucene50StoredFieldsFormat.mode=BEST_SPEED}])))}
   [junit4]   2> 2106616 INFO  (TEST-TestUseDocValuesAsStored.testRandomSingleAndMultiValued-seed#[76BC5A6650E2A727]) [     ] o.a.s.u.p.LogUpdateProcessorFactory [collection1]  webapp=null path=null params={}{commit=} 0 178
   [junit4]   2> 2106617 INFO  (TEST-TestUseDocValuesAsStored.testRandomSingleAndMultiValued-seed#[76BC5A6650E2A727]) [     ] o.a.s.c.S.Request [collection1]  webapp=null path=null params={q=id:4&fl=test_ls_dvo&wt=xml} hits=1 status=0 QTime=0
   [junit4]   2> 2106618 INFO  (TEST-TestUseDocValuesAsStored.testRandomSingleAndMultiValued-seed#[76BC5A6650E2A727]) [     ] o.a.s.c.S.Request [collection1]  webapp=null path=null params={q=id:4&fl=test_ls_dvo,*&wt=xml} hits=1 status=0 QTime=0
   [junit4]   2> 2106619 INFO  (TEST-TestUseDocValuesAsStored.testRandomSingleAndMultiValued-seed#[76BC5A6650E2A727]) [     ] o.a.s.c.S.Request [collection1]  webapp=null path=null params={q=id:4&fl=*dvo&wt=xml} hits=1 status=0 QTime=0
   [junit4]   2> 2106620 INFO  (TEST-TestUseDocValuesAsStored.testRandomSingleAndMultiValued-seed#[76BC5A6650E2A727]) [     ] o.a.s.c.S.Request [collection1]  webapp=null path=null params={q=id:4&fl=*&wt=xml} hits=1 status=0 QTime=0
   [junit4]   2> 2106621 INFO  (TEST-TestUseDocValuesAsStored.testRandomSingleAndMultiValued-seed#[76BC5A6650E2A727]) [     ] o.a.s.c.S.Request [collection1]  webapp=null path=null params={q=id:4&fl=test_ls_dvo,fakeFieldName&wt=xml} hits=1 status=0 QTime=0
   [junit4]   2> 2106622 INFO  (TEST-TestUseDocValuesAsStored.testRandomSingleAndMultiValued-seed#[76BC5A6650E2A727]) [     ] o.a.s.c.S.Request [collection1]  webapp=null path=null params={q=*:*&fl=*&wt=xml} hits=4 status=0 QTime=0
   [junit4]   2> 2106624 INFO  (TEST-TestUseDocValuesAsStored.testRandomSingleAndMultiValued-seed#[76BC5A6650E2A727]) [     ] o.a.s.u.p.LogUpdateProcessorFactory [collection1]  webapp=null path=null params={}{add=[5]} 0 0
   [junit4]   2> 2106624 INFO  (TEST-TestUseDocValuesAsStored.testRandomSingleAndMultiValued-seed#[76BC5A6650E2A727]) [     ] o.a.s.u.DirectUpdateHandler2 start commit{,optimize=false,openSearcher=true,waitSearcher=true,expungeDeletes=false,softCommit=false,prepareCommit=false}
   [junit4]   2> 2106624 INFO  (TEST-TestUseDocValuesAsStored.testRandomSingleAndMultiValued-seed#[76BC5A6650E2A727]) [     ] o.a.s.u.SolrIndexWriter Calling setCommitData with IW:org.apache.solr.update.SolrIndexWriter@65f1fa9f commitCommandVersion:0
   [junit4]   2> 2106778 INFO  (TEST-TestUseDocValuesAsStored.testRandomSingleAndMultiValued-seed#[76BC5A6650E2A727]) [     ] o.a.s.s.SolrIndexSearcher Opening [Searcher@24e0d2e2[collection1] main]
   [junit4]   2> 2106778 INFO  (TEST-TestUseDocValuesAsStored.testRandomSingleAndMultiValued-seed#[76BC5A6650E2A727]) [     ] o.a.s.u.DirectUpdateHandler2 end_commit_flush
   [junit4]   2> 2106780 INFO  (searcherExecutor-14570-thread-1) [     ] o.a.s.c.SolrCore [collection1] Registered new searcher Searcher@24e0d2e2[collection1] main{ExitableDirectoryReader(UninvertingDirectoryReader(Uninverting(_1(9.0.0):C1:[diagnostics={java.version=12.0.1, java.vm.version=12.0.1+12, lucene.version=9.0.0, source=flush, os.arch=amd64, java.runtime.version=12.0.1+12, os.version=4.18.0-25-generic, os=Linux, java.vendor=AdoptOpenJDK, timestamp=1564450521766}]:[attributes={Lucene50StoredFieldsFormat.mode=BEST_SPEED}]) Uninverting(_2(9.0.0):C1:[diagnostics={java.version=12.0.1, java.vm.version=12.0.1+12, lucene.version=9.0.0, source=flush, os.arch=amd64, java.runtime.version=12.0.1+12, os.version=4.18.0-25-generic, os=Linux, java.vendor=AdoptOpenJDK, timestamp=1564450521875}]:[attributes={Lucene50StoredFieldsFormat.mode=BEST_SPEED}]) Uninverting(_3(9.0.0):C1:[diagnostics={java.version=12.0.1, java.vm.version=12.0.1+12, lucene.version=9.0.0, source=flush, os.arch=amd64, java.runtime.version=12.0.1+12, os.version=4.18.0-25-generic, os=Linux, java.vendor=AdoptOpenJDK, timestamp=1564450521967}]:[attributes={Lucene50StoredFieldsFormat.mode=BEST_SPEED}]) Uninverting(_4(9.0.0):C1:[diagnostics={java.version=12.0.1, java.vm.version=12.0.1+12, lucene.version=9.0.0, source=flush, os.arch=amd64, java.runtime.version=12.0.1+12, os.version=4.18.0-25-generic, os=Linux, java.vendor=AdoptOpenJDK, timestamp=1564450522091}]:[attributes={Lucene50StoredFieldsFormat.mode=BEST_SPEED}]) Uninverting(_5(9.0.0):C1:[diagnostics={java.version=12.0.1, java.vm.version=12.0.1+12, lucene.version=9.0.0, source=flush, os.arch=amd64, java.runtime.version=12.0.1+12, os.version=4.18.0-25-generic, os=Linux, java.vendor=AdoptOpenJDK, timestamp=1564450522278}]:[attributes={Lucene50StoredFieldsFormat.mode=BEST_SPEED}])))}
   [junit4]   2> 2106780 INFO  (TEST-TestUseDocValuesAsStored.testRandomSingleAndMultiValued-seed#[76BC5A6650E2A727]) [     ] o.a.s.u.p.LogUpdateProcessorFactory [collection1]  webapp=null path=null params={}{commit=} 0 155
   [junit4]   2> 2106780 INFO  (TEST-TestUseDocValuesAsStored.testRandomSingleAndMultiValued-seed#[76BC5A6650E2A727]) [     ] o.a.s.c.S.Request [collection1]  webapp=null path=null params={q=id:5&fl=test_fs_dvo&wt=xml} hits=1 status=0 QTime=0
   [junit4]   2> 2106781 INFO  (TEST-TestUseDocValuesAsStored.testRandomSingleAndMultiValued-seed#[76BC5A6650E2A727]) [     ] o.a.s.c.S.Request [collection1]  webapp=null path=null params={q=id:5&fl=test_fs_dvo,*&wt=xml} hits=1 status=0 QTime=0
   [junit4]   2> 2106781 INFO  (TEST-TestUseDocValuesAsStored.testRandomSingleAndMultiValued-seed#[76BC5A6650E2A727]) [     ] o.a.s.c.S.Request [collection1]  webapp=null path=null params={q=id:5&fl=*dvo&wt=xml} hits=1 status=0 QTime=0
   [junit4]   2> 2106782 INFO  (TEST-TestUseDocValuesAsStored.testRandomSingleAndMultiValued-seed#[76BC5A6650E2A727]) [     ] o.a.s.c.S.Request [collection1]  webapp=null path=null params={q=id:5&fl=*&wt=xml} hits=1 status=0 QTime=0
   [junit4]   2> 2106782 INFO  (TEST-TestUseDocValuesAsStored.testRandomSingleAndMultiValued-seed#[76BC5A6650E2A727]) [     ] o.a.s.c.S.Request [collection1]  webapp=null path=null params={q=id:5&fl=test_fs_dvo,fakeFieldName&wt=xml} hits=1 status=0 QTime=0
   [junit4]   2> 2106783 INFO  (TEST-TestUseDocValuesAsStored.testRandomSingleAndMultiValued-seed#[76BC5A6650E2A727]) [     ] o.a.s.c.S.Request [collection1]  webapp=null path=null params={q=*:*&fl=*&wt=xml} hits=5 status=0 QTime=0
   [junit4]   2> 2106784 INFO  (TEST-TestUseDocValuesAsStored.testRandomSingleAndMultiValued-seed#[76BC5A6650E2A727]) [     ] o.a.s.u.p.LogUpdateProcessorFactory [collection1]  webapp=null path=null params={}{add=[6]} 0 0
   [junit4]   2> 2106784 INFO  (TEST-TestUseDocValuesAsStored.testRandomSingleAndMultiValued-seed#[76BC5A6650E2A727]) [     ] o.a.s.u.DirectUpdateHandler2 start commit{,optimize=false,openSearcher=true,waitSearcher=true,expungeDeletes=false,softCommit=false,prepareCommit=false}
   [junit4]   2> 2106784 INFO  (TEST-TestUseDocValuesAsStored.testRandomSingleAndMultiValued-seed#[76BC5A6650E2A727]) [     ] o.a.s.u.SolrIndexWriter Calling setCommitData with IW:org.apache.solr.update.SolrIndexWriter@65f1fa9f commitCommandVersion:0
   [junit4]   2> 2106947 INFO  (TEST-TestUseDocValuesAsStored.testRandomSingleAndMultiValued-seed#[76BC5A6650E2A727]) [     ] o.a.s.s.SolrIndexSearcher Opening [Searcher@6736d28e[collection1] main]
   [junit4]   2> 2106948 INFO  (TEST-TestUseDocValuesAsStored.testRandomSingleAndMultiValued-seed#[76BC5A6650E2A727]) [     ] o.a.s.u.DirectUpdateHandler2 end_commit_flush
   [junit4]   2> 2106949 INFO  (searcherExecutor-14570-thread-1) [     ] o.a.s.c.SolrCore [collection1] Registered new searcher Searcher@6736d28e[collection1] main{ExitableDirectoryReader(UninvertingDirectoryReader(Uninverting(_1(9.0.0):C1:[diagnostics={java.version=12.0.1, java.vm.version=12.0.1+12, lucene.version=9.0.0, source=flush, os.arch=amd64, java.runtime.version=12.0.1+12, os.version=4.18.0-25-generic, os=Linux, java.vendor=AdoptOpenJDK, timestamp=1564450521766}]:[attributes={Lucene50StoredFieldsFormat.mode=BEST_SPEED}]) Uninverting(_2(9.0.0):C1:[diagnostics={java.version=12.0.1, java.vm.version=12.0.1+12, lucene.version=9.0.0, source=flush, os.arch=amd64, java.runtime.version=12.0.1+12, os.version=4.18.0-25-generic, os=Linux, java.vendor=AdoptOpenJDK, timestamp=1564450521875}]:[attributes={Lucene50StoredFieldsFormat.mode=BEST_SPEED}]) Uninverting(_3(9.0.0):C1:[diagnostics={java.version=12.0.1, java.vm.version=12.0.1+12, lucene.version=9.0.0, source=flush, os.arch=amd64, java.runtime.version=12.0.1+12, os.version=4.18.0-25-generic, os=Linux, java.vendor=AdoptOpenJDK, timestamp=1564450521967}]:[attributes={Lucene50StoredFieldsFormat.mode=BEST_SPEED}]) Uninverting(_4(9.0.0):C1:[diagnostics={java.version=12.0.1, java.vm.version=12.0.1+12, lucene.version=9.0.0, source=flush, os.arch=amd64, java.runtime.version=12.0.1+12, os.version=4.18.0-25-generic, os=Linux, java.vendor=AdoptOpenJDK, timestamp=1564450522091}]:[attributes={Lucene50StoredFieldsFormat.mode=BEST_SPEED}]) Uninverting(_5(9.0.0):C1:[diagnostics={java.version=12.0.1, java.vm.version=12.0.1+12, lucene.version=9.0.0, source=flush, os.arch=amd64, java.runtime.version=12.0.1+12, os.version=4.18.0-25-generic, os=Linux, java.vendor=AdoptOpenJDK, timestamp=1564450522278}]:[attributes={Lucene50StoredFieldsFormat.mode=BEST_SPEED}]) Uninverting(_6(9.0.0):C1:[diagnostics={java.version=12.0.1, java.vm.version=12.0.1+12, lucene.version=9.0.0, source=flush, os.arch=amd64, java.runtime.version=12.0.1+12, os.version=4.18.0-25-generic, os=Linux, java.vendor=AdoptOpenJDK, timestamp=1564450522437}]:[attributes={Lucene50StoredFieldsFormat.mode=BEST_SPEED}])))}
   [junit4]   2> 2106949 INFO  (TEST-TestUseDocValuesAsStored.testRandomSingleAndMultiValued-seed#[76BC5A6650E2A727]) [     ] o.a.s.u.p.LogUpdateProcessorFactory [collection1]  webapp=null path=null params={}{commit=} 0 165
   [junit4]   2> 2106950 INFO  (TEST-TestUseDocValuesAsStored.testRandomSingleAndMultiValued-seed#[76BC5A6650E2A727]) [     ] o.a.s.c.S.Request [collection1]  webapp=null path=null params={q=id:6&fl=test_dts_dvo&wt=xml} hits=1 status=0 QTime=0
   [junit4]   2> 2106950 INFO  (TEST-TestUseDocValuesAsStored.testRandomSingleAndMultiValued-seed#[76BC5A6650E2A727]) [     ] o.a.s.c.S.Request [collection1]  webapp=null path=null params={q=id:6&fl=test_dts_dvo,*&wt=xml} hits=1 status=0 QTime=0
   [junit4]   2> 2106951 INFO  (TEST-TestUseDocValuesAsStored.testRandomSingleAndMultiValued-seed#[76BC5A6650E2A727]) [     ] o.a.s.c.S.Request [collection1]  webapp=null path=null params={q=id:6&fl=*dvo&wt=xml} hits=1 status=0 QTime=0
   [junit4]   2> 2106951 INFO  (TEST-TestUseDocValuesAsStored.testRandomSingleAndMultiValued-seed#[76BC5A6650E2A727]) [     ] o.a.s.c.S.Request [collection1]  webapp=null path=null params={q=id:6&fl=*&wt=xml} hits=1 status=0 QTime=0
   [junit4]   2> 2106952 INFO  (TEST-TestUseDocValuesAsStored.testRandomSingleAndMultiValued-seed#[76BC5A6650E2A727]) [     ] o.a.s.c.S.Request [collection1]  webapp=null path=null params={q=id:6&fl=test_dts_dvo,fakeFieldName&wt=xml} hits=1 status=0 QTime=0
   [junit4]   2> 2106952 INFO  (TEST-TestUseDocValuesAsStored.testRandomSingleAndMultiValued-seed#[76BC5A6650E2A727]) [     ] o.a.s.c.S.Request [collection1]  webapp=null path=null params={q=*:*&fl=*&wt=xml} hits=6 status=0 QTime=0
   [junit4]   2> 2106953 INFO  (TEST-TestUseDocValuesAsStored.testRandomSingleAndMultiValued-seed#[76BC5A6650E2A727]) [     ] o.a.s.u.p.LogUpdateProcessorFactory [collection1]  webapp=null path=null params={}{add=[7]} 0 0
   [junit4]   2> 2106954 INFO  (TEST-TestUseDocValuesAsStored.testRandomSingleAndMultiValued-seed#[76BC5A6650E2A727]) [     ] o.a.s.u.DirectUpdateHandler2 start commit{,optimize=false,openSearcher=true,waitSearcher=true,expungeDeletes=false,softCommit=false,prepareCommit=false}
   [junit4]   2> 2106954 INFO  (TEST-TestUseDocValuesAsStored.testRandomSingleAndMultiValued-seed#[76BC5A6650E2A727]) [     ] o.a.s.u.SolrIndexWriter Calling setCommitData with IW:org.apache.solr.update.SolrIndexWriter@65f1fa9f commitCommandVersion:0
   [junit4]   2> 2107107 INFO  (TEST-TestUseDocValuesAsStored.testRandomSingleAndMultiValued-seed#[76BC5A6650E2A727]) [     ] o.a.s.s.SolrIndexSearcher Opening [Searcher@14e4f214[collection1] main]
   [junit4]   2> 2107107 INFO  (TEST-TestUseDocValuesAsStored.testRandomSingleAndMultiValued-seed#[76BC5A6650E2A727]) [     ] o.a.s.u.DirectUpdateHandler2 end_commit_flush
   [junit4]   2> 2107108 INFO  (searcherExecutor-14570-thread-1) [     ] o.a.s.c.SolrCore [collection1] Registered new searcher Searcher@14e4f214[collection1] main{ExitableDirectoryReader(UninvertingDirectoryReader(Uninverting(_1(9.0.0):C1:[diagnostics={java.version=12.0.1, java.vm.version=12.0.1+12, lucene.version=9.0.0, source=flush, os.arch=amd64, java.runtime.version=12.0.1+12, os.version=4.18.0-25-generic, os=Linux, java.vendor=AdoptOpenJDK, timestamp=1564450521766}]:[attributes={Lucene50StoredFieldsFormat.mode=BEST_SPEED}]) Uninverting(_2(9.0.0):C1:[diagnostics={java.version=12.0.1, java.vm.version=12.0.1+12, lucene.version=9.0.0, source=flush, os.arch=amd64, java.runtime.version=12.0.1+12, os.version=4.18.0-25-generic, os=Linux, java.vendor=AdoptOpenJDK, timestamp=1564450521875}]:[attributes={Lucene50StoredFieldsFormat.mode=BEST_SPEED}]) Uninverting(_3(9.0.0):C1:[diagnostics={java.version=12.0.1, java.vm.version=12.0.1+12, lucene.version=9.0.0, source=flush, os.arch=amd64, java.runtime.version=12.0.1+12, os.version=4.18.0-25-generic, os=Linux, java.vendor=AdoptOpenJDK, timestamp=1564450521967}]:[attributes={Lucene50StoredFieldsFormat.mode=BEST_SPEED}]) Uninverting(_4(9.0.0):C1:[diagnostics={java.version=12.0.1, java.vm.version=12.0.1+12, lucene.version=9.0.0, source=flush, os.arch=amd64, java.runtime.version=12.0.1+12, os.version=4.18.0-25-generic, os=Linux, java.vendor=AdoptOpenJDK, timestamp=1564450522091}]:[attributes={Lucene50StoredFieldsFormat.mode=BEST_SPEED}]) Uninverting(_5(9.0.0):C1:[diagnostics={java.version=12.0.1, java.vm.version=12.0.1+12, lucene.version=9.0.0, source=flush, os.arch=amd64, java.runtime.version=12.0.1+12, os.version=4.18.0-25-generic, os=Linux, java.vendor=AdoptOpenJDK, timestamp=1564450522278}]:[attributes={Lucene50StoredFieldsFormat.mode=BEST_SPEED}]) Uninverting(_6(9.0.0):C1:[diagnostics={java.version=12.0.1, java.vm.version=12.0.1+12, lucene.version=9.0.0, source=flush, os.arch=amd64, java.runtime.version=12.0.1+12, os.version=4.18.0-25-generic, os=Linux, java.vendor=AdoptOpenJDK, timestamp=1564450522437}]:[attributes={Lucene50StoredFieldsFormat.mode=BEST_SPEED}]) Uninverting(_7(9.0.0):C1:[diagnostics={java.version=12.0.1, java.vm.version=12.0.1+12, lucene.version=9.0.0, source=flush, os.arch=amd64, java.runtime.version=12.0.1+12, os.version=4.18.0-25-generic, os=Linux, java.vendor=AdoptOpenJDK, timestamp=1564450522607}]:[attributes={Lucene50StoredFieldsFormat.mode=BEST_SPEED}])))}
   [junit4]   2> 2107108 INFO  (TEST-TestUseDocValuesAsStored.testRandomSingleAndMultiValued-seed#[76BC5A6650E2A727]) [     ] o.a.s.u.p.LogUpdateProcessorFactory [collection1]  webapp=null path=null params={}{commit=} 0 154
   [junit4]   2> 2107108 INFO  (TEST-TestUseDocValuesAsStored.testRandomSingleAndMultiValued-seed#[76BC5A6650E2A727]) [     ] o.a.s.c.S.Request [collection1]  webapp=null path=null params={q=id:7&fl=test_s_dv&wt=xml} hits=1 status=0 QTime=0
   [junit4]   2> 2107109 INFO  (TEST-TestUseDocValuesAsStored.testRandomSingleAndMultiValued-seed#[76BC5A6650E2A727]) [     ] o.a.s.c.S.Request [collection1]  webapp=null path=null params={q=id:7&fl=test_s_dv,*&wt=xml} hits=1 status=0 QTime=0
   [junit4]   2> 2107109 INFO  (TEST-TestUseDocValuesAsStored.testRandomSingleAndMultiValued-seed#[76BC5A6650E2A727]) [     ] o.a.s.c.S.Request [collection1]  webapp=null path=null params={q=id:7&fl=*_dv&wt=xml} hits=1 status=0 QTime=0
   [junit4]   2> 2107109 INFO  (TEST-TestUseDocValuesAsStored.testRandomSingleAndMultiValued-seed#[76BC5A6650E2A727]) [     ] o.a.s.c.S.Request [collection1]  webapp=null path=null params={q=id:7&fl=*&wt=xml} hits=1 status=0 QTime=0
   [junit4]   2> 2107109 INFO  (TEST-TestUseDocValuesAsStored.testRandomSingleAndMultiValued-seed#[76BC5A6650E2A727]) [     ] o.a.s.c.S.Request [collection1]  webapp=null path=null params={q=id:7&fl=test_s_dv,fakeFieldName&wt=xml} hits=1 status=0 QTime=0
   [junit4]   2> 2107109 INFO  (TEST-TestUseDocValuesAsStored.testRandomSingleAndMultiValued-seed#[76BC5A6650E2A727]) [     ] o.a.s.c.S.Request [collection1]  webapp=null path=null params={q=*:*&fl=*&wt=xml} hits=7 status=0 QTime=0
   [junit4]   2> 2107110 INFO  (TEST-TestUseDocValuesAsStored.testRandomSingleAndMultiValued-seed#[76BC5A6650E2A727]) [     ] o.a.s.u.p.LogUpdateProcessorFactory [collection1]  webapp=null path=null params={}{add=[8]} 0 0
   [junit4]   2> 2107110 INFO  (TEST-TestUseDocValuesAsStored.testRandomSingleAndMultiValued-seed#[76BC5A6650E2A727]) [     ] o.a.s.u.DirectUpdateHandler2 start commit{,optimize=false,openSearcher=true,waitSearcher=true,expungeDeletes=false,softCommit=false,prepareCommit=false}
   [junit4]   2> 2107111 INFO  (TEST-TestUseDocValuesAsStored.testRandomSingleAndMultiValued-seed#[76BC5A6650E2A727]) [     ] o.a.s.u.SolrIndexWriter Calling setCommitData with IW:org.apache.solr.update.SolrIndexWriter@65f1fa9f commitCommandVersion:0
   [junit4]   2> 2108467 INFO  (TEST-TestUseDocValuesAsStored.testRandomSingleAndMultiValued-seed#[76BC5A6650E2A727]) [     ] o.a.s.s.SolrIndexSearcher Opening [Searcher@6849738e[collection1] main]
   [junit4]   2> 2108467 INFO  (TEST-TestUseDocValuesAsStored.testRandomSingleAndMultiValued-seed#[76BC5A6650E2A727]) [     ] o.a.s.u.DirectUpdateHandler2 end_commit_flush
   [junit4]   2> 2108468 INFO  (searcherExecutor-14570-thread-1) [     ] o.a.s.c.SolrCore [collection1] Registered new searcher Searcher@6849738e[collection1] main{ExitableDirectoryReader(UninvertingDirectoryReader(Uninverting(_1(9.0.0):C1:[diagnostics={java.version=12.0.1, java.vm.version=12.0.1+12, lucene.version=9.0.0, source=flush, os.arch=amd64, java.runtime.version=12.0.1+12, os.version=4.18.0-25-generic, os=Linux, java.vendor=AdoptOpenJDK, timestamp=1564450521766}]:[attributes={Lucene50StoredFieldsFormat.mode=BEST_SPEED}]) Uninverting(_2(9.0.0):C1:[diagnostics={java.version=12.0.1, java.vm.version=12.0.1+12, lucene.version=9.0.0, source=flush, os.arch=amd64, java.runtime.version=12.0.1+12, os.version=4.18.0-25-generic, os=Linux, java.vendor=AdoptOpenJDK, timestamp=1564450521875}]:[attributes={Lucene50StoredFieldsFormat.mode=BEST_SPEED}]) Uninverting(_3(9.0.0):C1:[diagnostics={java.version=12.0.1, java.vm.version=12.0.1+12, lucene.version=9.0.0, source=flush, os.arch=amd64, java.runtime.version=12.0.1+12, os.version=4.18.0-25-generic, os=Linux, java.vendor=AdoptOpenJDK, timestamp=1564450521967}]:[attributes={Lucene50StoredFieldsFormat.mode=BEST_SPEED}]) Uninverting(_4(9.0.0):C1:[diagnostics={java.version=12.0.1, java.vm.version=12.0.1+12, lucene.version=9.0.0, source=flush, os.arch=amd64, java.runtime.version=12.0.1+12, os.version=4.18.0-25-generic, os=Linux, java.vendor=AdoptOpenJDK, timestamp=1564450522091}]:[attributes={Lucene50StoredFieldsFormat.mode=BEST_SPEED}]) Uninverting(_5(9.0.0):C1:[diagnostics={java.version=12.0.1, java.vm.version=12.0.1+12, lucene.version=9.0.0, source=flush, os.arch=amd64, java.runtime.version=12.0.1+12, os.version=4.18.0-25-generic, os=Linux, java.vendor=AdoptOpenJDK, timestamp=1564450522278}]:[attributes={Lucene50StoredFieldsFormat.mode=BEST_SPEED}]) Uninverting(_6(9.0.0):C1:[diagnostics={java.version=12.0.1, java.vm.version=12.0.1+12, lucene.version=9.0.0, source=flush, os.arch=amd64, java.runtime.version=12.0.1+12, os.version=4.18.0-25-generic, os=Linux, java.vendor=AdoptOpenJDK, timestamp=1564450522437}]:[attributes={Lucene50StoredFieldsFormat.mode=BEST_SPEED}]) Uninverting(_7(9.0.0):C1:[diagnostics={java.version=12.0.1, java.vm.version=12.0.1+12, lucene.version=9.0.0, source=flush, os.arch=amd64, java.runtime.version=12.0.1+12, os.version=4.18.0-25-generic, os=Linux, java.vendor=AdoptOpenJDK, timestamp=1564450522607}]:[attributes={Lucene50StoredFieldsFormat.mode=BEST_SPEED}]) Uninverting(_8(9.0.0):C1:[diagnostics={java.version=12.0.1, java.vm.version=12.0.1+12, lucene.version=9.0.0, source=flush, os.arch=amd64, java.runtime.version=12.0.1+12, os.version=4.18.0-25-generic, os=Linux, java.vendor=AdoptOpenJDK, timestamp=1564450522764}]:[attributes={Lucene50StoredFieldsFormat.mode=BEST_SPEED}])))}
   [junit4]   2> 2108468 INFO  (TEST-TestUseDocValuesAsStored.testRandomSingleAndMultiValued-seed#[76BC5A6650E2A727]) [     ] o.a.s.u.p.LogUpdateProcessorFactory [collection1]  webapp=null path=null params={}{commit=} 0 1357
   [junit4]   2> 2108469 INFO  (TEST-TestUseDocValuesAsStored.testRandomSingleAndMultiValued-seed#[76BC5A6650E2A727]) [     ] o.a.s.c.S.Request [collection1]  webapp=null path=null params={q=id:8&fl=test_ss_dvo2&wt=xml} hits=1 status=0 QTime=0
   [junit4]   2> 2108469 INFO  (TEST-TestUseDocValuesAsStored.testRandomSingleAndMultiValued-seed#[76BC5A6650E2A727]) [     ] o.a.s.c.S.Request [collection1]  webapp=null path=null params={q=id:8&fl=test_ss_dvo2,*&wt=xml} hits=1 status=0 QTime=0
   [junit4]   2> 2108476 INFO  (TEST-TestUseDocValuesAsStored.testRandomSingleAndMultiValued-seed#[76BC5A6650E2A727]) [     ] o.a.s.c.S.Request [collection1]  webapp=null path=null params={q=id:8&fl=*vo2&wt=xml} hits=1 status=0 QTime=0
   [junit4]   2> 2108477 INFO  (TEST-TestUseDocValuesAsStored.testRandomSingleAndMultiValued-seed#[76BC5A6650E2A727]) [     ] o.a.s.c.S.Request [collection1]  webapp=null path=null params={q=id:8&fl=*&wt=xml} hits=1 status=0 QTime=0
   [junit4]   2> 2108478 INFO  (TEST-TestUseDocValuesAsStored.testRandomSingleAndMultiValued-seed#[76BC5A6650E2A727]) [     ] o.a.s.c.S.Request [collection1]  webapp=null path=null params={q=id:8&fl=test_ss_dvo2,fakeFieldName&wt=xml} hits=1 status=0 QTime=0
   [junit4]   2> 2108479 INFO  (TEST-TestUseDocValuesAsStored.testRandomSingleAndMultiValued-seed#[76BC5A6650E2A727]) [     ] o.a.s.c.S.Request [collection1]  webapp=null path=null params={q=*:*&fl=*&wt=xml} hits=8 status=0 QTime=0
   [junit4]   2> 2108480 INFO  (TEST-TestUseDocValuesAsStored.testRandomSingleAndMultiValued-seed#[76BC5A6650E2A727]) [     ] o.a.s.u.p.LogUpdateProcessorFactory [collection1]  webapp=null path=null params={}{add=[9]} 0 0
   [junit4]   2> 2108480 INFO  (TEST-TestUseDocValuesAsStored.testRandomSingleAndMultiValued-seed#[76BC5A6650E2A727]) [     ] o.a.s.u.DirectUpdateHandler2 start commit{,optimize=false,openSearcher=true,waitSearcher=true,expungeDeletes=false,softCommit=false,prepareCommit=false}
   [junit4]   2> 2108480 INFO  (TEST-TestUseDocValuesAsStored.testRandomSingleAndMultiValued-seed#[76BC5A6650E2A727]) [     ] o.a.s.u.SolrIndexWriter Calling setCommitData with IW:org.apache.solr.update.SolrIndexWriter@65f1fa9f commitCommandVersion:0
   [junit4]   2> 2108825 INFO  (TEST-TestUseDocValuesAsStored.testRandomSingleAndMultiValued-seed#[76BC5A6650E2A727]) [     ] o.a.s.s.SolrIndexSearcher Opening [Searcher@3eaf9172[collection1] main]
   [junit4]   2> 2108825 INFO  (TEST-TestUseDocValuesAsStored.testRandomSingleAndMultiValued-seed#[76BC5A6650E2A727]) [     ] o.a.s.u.DirectUpdateHandler2 end_commit_flush
   [junit4]   2> 2108826 INFO  (searcherExecutor-14570-thread-1) [     ] o.a.s.c.SolrCore [collection1] Registered new searcher Searcher@3eaf9172[collection1] main{ExitableDirectoryReader(UninvertingDirectoryReader(Uninverting(_1(9.0.0):C1:[diagnostics={java.version=12.0.1, java.vm.version=12.0.1+12, lucene.version=9.0.0, source=flush, os.arch=amd64, java.runtime.version=12.0.1+12, os.version=4.18.0-25-generic, os=Linux, java.vendor=AdoptOpenJDK, timestamp=1564450521766}]:[attributes={Lucene50StoredFieldsFormat.mode=BEST_SPEED}]) Uninverting(_2(9.0.0):C1:[diagnostics={java.version=12.0.1, java.vm.version=12.0.1+12, lucene.version=9.0.0, source=flush, os.arch=amd64, java.runtime.version=12.0.1+12, os.version=4.18.0-25-generic, os=Linux, java.vendor=AdoptOpenJDK, timestamp=1564450521875}]:[attributes={Lucene50StoredFieldsFormat.mode=BEST_SPEED}]) Uninverting(_3(9.0.0):C1:[diagnostics={java.version=12.0.1, java.vm.version=12.0.1+12, lucene.version=9.0.0, source=flush, os.arch=amd64, java.runtime.version=12.0.1+12, os.version=4.18.0-25-generic, os=Linux, java.vendor=AdoptOpenJDK, timestamp=1564450521967}]:[attributes={Lucene50StoredFieldsFormat.mode=BEST_SPEED}]) Uninverting(_4(9.0.0):C1:[diagnostics={java.version=12.0.1, java.vm.version=12.0.1+12, lucene.version=9.0.0, source=flush, os.arch=amd64, java.runtime.version=12.0.1+12, os.version=4.18.0-25-generic, os=Linux, java.vendor=AdoptOpenJDK, timestamp=1564450522091}]:[attributes={Lucene50StoredFieldsFormat.mode=BEST_SPEED}]) Uninverting(_5(9.0.0):C1:[diagnostics={java.version=12.0.1, java.vm.version=12.0.1+12, lucene.version=9.0.0, source=flush, os.arch=amd64, java.runtime.version=12.0.1+12, os.version=4.18.0-25-generic, os=Linux, java.vendor=AdoptOpenJDK, timestamp=1564450522278}]:[attributes={Lucene50StoredFieldsFormat.mode=BEST_SPEED}]) Uninverting(_6(9.0.0):C1:[diagnostics={java.version=12.0.1, java.vm.version=12.0.1+12, lucene.version=9.0.0, source=flush, os.arch=amd64, java.runtime.version=12.0.1+12, os.version=4.18.0-25-generic, os=Linux, java.vendor=AdoptOpenJDK, timestamp=1564450522437}]:[attributes={Lucene50StoredFieldsFormat.mode=BEST_SPEED}]) Uninverting(_7(9.0.0):C1:[diagnostics={java.version=12.0.1, java.vm.version=12.0.1+12, lucene.version=9.0.0, source=flush, os.arch=amd64, java.runtime.version=12.0.1+12, os.version=4.18.0-25-generic, os=Linux, java.vendor=AdoptOpenJDK, timestamp=1564450522607}]:[attributes={Lucene50StoredFieldsFormat.mode=BEST_SPEED}]) Uninverting(_8(9.0.0):C1:[diagnostics={java.version=12.0.1, java.vm.version=12.0.1+12, lucene.version=9.0.0, source=flush, os.arch=amd64, java.runtime.version=12.0.1+12, os.version=4.18.0-25-generic, os=Linux, java.vendor=AdoptOpenJDK, timestamp=1564450522764}]:[attributes={Lucene50StoredFieldsFormat.mode=BEST_SPEED}]) Uninverting(_9(9.0.0):C1:[diagnostics={java.version=12.0.1, java.vm.version=12.0.1+12, lucene.version=9.0.0, source=flush, os.arch=amd64, java.runtime.version=12.0.1+12, os.version=4.18.0-25-generic, os=Linux, java.vendor=AdoptOpenJDK, timestamp=1564450524133}]:[attributes={Lucene50StoredFieldsFormat.mode=BEST_SPEED}])))}
   [junit4]   2> 2108826 INFO  (TEST-TestUseDocValuesAsStored.testRandomSingleAndMultiValued-seed#[76BC5A6650E2A727]) [     ] o.a.s.u.p.LogUpdateProcessorFactory [collection1]  webapp=null path=null params={}{commit=} 0 346
   [junit4]   2> 2108827 INFO  (TEST-TestUseDocValuesAsStored.testRandomSingleAndMultiValued-seed#[76BC5A6650E2A727]) [     ] o.a.s.c.S.Request [collection1]  webapp=null path=null params={q=id:9&fl=enum_dvo&wt=xml} hits=1 status=0 QTime=0
   [junit4]   2> 2108827 INFO  (TEST-TestUseDocValuesAsStored.testRandomSingleAndMultiValued-seed#[76BC5A6650E2A727]) [     ] o.a.s.c.S.Request [collection1]  webapp=null path=null params={q=id:9&fl=enum_dvo,*&wt=xml} hits=1 status=0 QTime=0
   [junit4]   2> 2108827 INFO  (TEST-TestUseDocValuesAsStored.testRandomSingleAndMultiValued-seed#[76BC5A6650E2A727]) [     ] o.a.s.c.S.Request [collection1]  webapp=null path=null params={q=id:9&fl=*dvo&wt=xml} hits=1 status=0 QTime=0
   [junit4]   2> 2108828 INFO  (TEST-TestUseDocValuesAsStored.testRandomSingleAndMultiValued-seed#[76BC5A6650E2A727]) [     ] o.a.s.c.S.Request [collection1]  webapp=null path=null params={q=id:9&fl=*&wt=xml} hits=1 status=0 QTime=0
   [junit4]   2> 2108828 INFO  (TEST-TestUseDocValuesAsStored.testRandomSingleAndMultiValued-seed#[76BC5A6650E2A727]) [     ] o.a.s.c.S.Request [collection1]  webapp=null path=null params={q=id:9&fl=enum_dvo,fakeFieldName&wt=xml} hits=1 status=0 QTime=0
   [junit4]   2> 2108828 INFO  (TEST-TestUseDocValuesAsStored.testRandomSingleAndMultiValued-seed#[76BC5A6650E2A727]) [     ] o.a.s.c.S.Request [collection1]  webapp=null path=null params={q=*:*&fl=*&wt=xml} hits=9 status=0 QTime=0
   [junit4]   2> 2108829 INFO  (TEST-TestUseDocValuesAsStored.testRandomSingleAndMultiValued-seed#[76BC5A6650E2A727]) [     ] o.a.s.u.DirectUpdateHandler2 [collection1] REMOVING ALL DOCUMENTS FROM INDEX
   [junit4]   2> 2108829 INFO  (TEST-TestUseDocValuesAsStored.testRandomSingleAndMultiValued-seed#[76BC5A6650E2A727]) [     ] o.a.s.u.p.LogUpdateProcessorFactory [collection1]  webapp=null path=null params={_version_=-9223372036854775807&update.distrib=FROMLEADER&versions=true&wt=json&indent=true}{deleteByQuery=*:*} 0 0
   [junit4]   2> 2108829 INFO  (TEST-TestUseDocValuesAsStored.testRandomSingleAndMultiValued-seed#[76BC5A6650E2A727]) [     ] o.a.s.u.p.LogUpdateProcessorFactory [collection1]  webapp=null path=null params={}{add=[10]} 0 0
   [junit4]   2> 2108829 INFO  (TEST-TestUseDocValuesAsStored.testRandomSingleAndMultiValued-seed#[76BC5A6650E2A727]) [     ] o.a.s.u.DirectUpdateHandler2 start commit{,optimize=false,openSearcher=true,waitSearcher=true,expungeDeletes=false,softCommit=false,prepareCommit=false}
   [junit4]   2> 2108829 INFO  (TEST-TestUseDocValuesAsStored.testRandomSingleAndMultiValued-seed#[76BC5A6650E2A727]) [     ] o.a.s.u.SolrIndexWriter Calling setCommitData with IW:org.apache.solr.update.SolrIndexWriter@65f1fa9f commitCommandVersion:0
   [junit4]   2> 2108894 INFO  (TEST-TestUseDocValuesAsStored.testRandomSingleAndMultiValued-seed#[76BC5A6650E2A727]) [     ] o.a.s.s.SolrIndexSearcher Opening [Searcher@7d0a0363[collection1] main]
   [junit4]   2> 2108894 INFO  (TEST-TestUseDocValuesAsStored.testRandomSingleAndMultiValued-seed#[76BC5A6650E2A727]) [     ] o.a.s.u.DirectUpdateHandler2 end_commit_flush
   [junit4]   2> 2108895 INFO  (searcherExecutor-14570-thread-1) [     ] o.a.s.c.SolrCore [collection1] Registered new searcher Searcher@7d0a0363[collection1] main{ExitableDirectoryReader(UninvertingDirectoryReader(Uninverting(_a(9.0.0):C1:[diagnostics={java.version=12.0.1, java.vm.version=12.0.1+12, lucene.version=9.0.0, source=flush, os.arch=amd64, java.runtime.version=12.0.1+12, os.version=4.18.0-25-generic, os=Linux, java.vendor=AdoptOpenJDK, timestamp=1564450524483}]:[attributes={Lucene50StoredFieldsFormat.mode=BEST_SPEED}])))}
   [junit4]   2> 2108899 INFO  (TEST-TestUseDocValuesAsStored.testRandomSingleAndMultiValued-seed#[76BC5A6650E2A727]) [     ] o.a.s.u.p.LogUpdateProcessorFactory [collection1]  webapp=null path=null params={}{commit=} 0 69
   [junit4]   2> 2108900 INFO  (TEST-TestUseDocValuesAsStored.testRandomSingleAndMultiValued-seed#[76BC5A6650E2A727]) [     ] o.a.s.c.S.Request [collection1]  webapp=null path=null params={q=id:10&fl=test_ss_dvo&wt=xml} hits=1 status=0 QTime=0
   [junit4]   2> 2108901 INFO  (TEST-TestUseDocValuesAsStored.testRandomSingleAndMultiValued-seed#[76BC5A6650E2A727]) [     ] o.a.s.c.S.Request [collection1]  webapp=null path=null params={q=id:10&fl=test_ss_dvo,*&wt=xml} hits=1 status=0 QTime=0
   [junit4]   2> 2108902 INFO  (TEST-TestUseDocValuesAsStored.testRandomSingleAndMultiValued-seed#[76BC5A6650E2A727]) [     ] o.a.s.c.S.Request [collection1]  webapp=null path=null params={q=id:10&fl=*dvo&wt=xml} hits=1 status=0 QTime=0
   [junit4]   2> 2108903 INFO  (TEST-TestUseDocValuesAsStored.testRandomSingleAndMultiValued-seed#[76BC5A6650E2A727]) [     ] o.a.s.c.S.Request [collection1]  webapp=null path=null params={q=id:10&fl=*&wt=xml} hits=1 status=0 QTime=0
   [junit4]   2> 2108904 INFO  (TEST-TestUseDocValuesAsStored.testRandomSingleAndMultiValued-seed#[76BC5A6650E2A727]) [     ] o.a.s.c.S.Request [collection1]  webapp=null path=null params={q=id:10&fl=test_ss_dvo,fakeFieldName&wt=xml} hits=1 status=0 QTime=0
   [junit4]   2> 2108904 INFO  (TEST-TestUseDocValuesAsStored.testRandomSingleAndMultiValued-seed#[76BC5A6650E2A727]) [     ] o.a.s.c.S.Request [collection1]  webapp=null path=null params={q=*:*&fl=*&wt=xml} hits=1 status=0 QTime=0
   [junit4]   2> 2108905 INFO  (TEST-TestUseDocValuesAsStored.testRandomSingleAndMultiValued-seed#[76BC5A6650E2A727]) [     ] o.a.s.u.p.LogUpdateProcessorFactory [collection1]  webapp=null path=null params={}{add=[11]} 0 0
   [junit4]   2> 2108906 INFO  (TEST-TestUseDocValuesAsStored.testRandomSingleAndMultiValued-seed#[76BC5A6650E2A727]) [     ] o.a.s.u.DirectUpdateHandler2 start commit{,optimize=false,openSearcher=true,waitSearcher=true,expungeDeletes=false,softCommit=false,prepareCommit=false}
   [junit4]   2> 2108906 INFO  (TEST-TestUseDocValuesAsStored.testRandomSingleAndMultiValued-seed#[76BC5A6650E2A727]) [     ] o.a.s.u.SolrIndexWriter Calling setCommitData with IW:org.apache.solr.update.SolrIndexWriter@65f1fa9f commitCommandVersion:0
   [junit4]   2> 2108991 INFO  (TEST-TestUseDocValuesAsStored.testRandomSingleAndMultiValued-seed#[76BC5A6650E2A727]) [     ] o.a.s.s.SolrIndexSearcher Opening [Searcher@e77f572[collection1] main]
   [junit4]   2> 2108991 INFO  (TEST-TestUseDocValuesAsStored.testRandomSingleAndMultiValued-seed#[76BC5A6650E2A727]) [     ] o.a.s.u.DirectUpdateHandler2 end_commit_flush
   [junit4]   2> 2108992 INFO  (searcherExecutor-14570-thread-1) [     ] o.a.s.c.SolrCore [collection1] Registered new searcher Searcher@e77f572[collection1] main{ExitableDirectoryReader(UninvertingDirectoryReader(Uninverting(_a(9.0.0):C1:[diagnostics={java.version=12.0.1, java.vm.version=12.0.1+12, lucene.version=9.0.0, source=flush, os.arch=amd64, java.runtime.version=12.0.1+12, os.version=4.18.0-25-generic, os=Linux, java.vendor=AdoptOpenJDK, timestamp=1564450524483}]:[attributes={Lucene50StoredFieldsFormat.mode=BEST_SPEED}]) Uninverting(_b(9.0.0):C1:[diagnostics={java.version=12.0.1, java.vm.version=12.0.1+12, lucene.version=9.0.0, source=flush, os.arch=amd64, java.runtime.version=12.0.1+12, os.version=4.18.0-25-generic, os=Linux, java.vendor=AdoptOpenJDK, timestamp=1564450524559}]:[attributes={Lucene50StoredFieldsFormat.mode=BEST_SPEED}])))}
   [junit4]   2> 2108992 INFO  (TEST-TestUseDocValuesAsStored.testRandomSingleAndMultiValued-seed#[76BC5A6650E2A727]) [     ] o.a.s.u.p.LogUpdateProcessorFactory [collection1]  webapp=null path=null params={}{commit=} 0 86
   [junit4]   2> 2108992 INFO  (TEST-TestUseDocValuesAsStored.testRandomSingleAndMultiValued-seed#[76BC5A6650E2A727]) [     ] o.a.s.c.S.Request [collection1]  webapp=null path=null params={q=id:11&fl=test_is_dvo&wt=xml} hits=1 status=0 QTime=0
   [junit4]   2> 2108993 INFO  (TEST-TestUseDocValuesAsStored.testRandomSingleAndMultiValued-seed#[76BC5A6650E2A727]) [     ] o.a.s.c.S.Request [collection1]  webapp=null path=null params={q=id:11&fl=test_is_dvo,*&wt=xml} hits=1 status=0 QTime=0
   [junit4]   2> 2108993 INFO  (TEST-TestUseDocValuesAsStored.testRandomSingleAndMultiValued-seed#[76BC5A6650E2A727]) [     ] o.a.s.c.S.Request [collection1]  webapp=null path=null params={q=id:11&fl=*dvo&wt=xml} hits=1 status=0 QTime=0
   [junit4]   2> 2108994 INFO  (TEST-TestUseDocValuesAsStored.testRandomSingleAndMultiValued-seed#[76BC5A6650E2A727]) [     ] o.a.s.c.S.Request [collection1]  webapp=null path=null params={q=id:11&fl=*&wt=xml} hits=1 status=0 QTime=0
   [junit4]   2> 2108994 INFO  (TEST-TestUseDocValuesAsStored.testRandomSingleAndMultiValued-seed#[76BC5A6650E2A727]) [     ] o.a.s.c.S.Request [collection1]  webapp=null path=null params={q=id:11&fl=test_is_dvo,fakeFieldName&wt=xml} hits=1 status=0 QTime=0
   [junit4]   2> 2108995 INFO  (TEST-TestUseDocValuesAsStored.testRandomSingleAndMultiValued-seed#[76BC5A6650E2A727]) [     ] o.a.s.c.S.Request [collection1]  webapp=null path=null params={q=*:*&fl=*&wt=xml} hits=2 status=0 QTime=0
   [junit4]   2> 2108996 INFO  (TEST-TestUseDocValuesAsStored.testRandomSingleAndMultiValued-seed#[76BC5A6650E2A727]) [     ] o.a.s.u.p.LogUpdateProcessorFactory [collection1]  webapp=null path=null params={}{add=[12]} 0 0
   [junit4]   2> 2108996 INFO  (TEST-TestUseDocValuesAsStored.testRandomSingleAndMultiValued-seed#[76BC5A6650E2A727]) [     ] o.a.s.u.DirectUpdateHandler2 start commit{,optimize=false,openSearcher=true,waitSearcher=true,expungeDeletes=false,softCommit=false,prepareCommit=false}
   [junit4]   2> 2108996 INFO  (TEST-TestUseDocValuesAsStored.testRandomSingleAndMultiValued-seed#[76BC5A6650E2A727]) [     ] o.a.s.u.SolrIndexWriter Calling setCommitData with IW:org.apache.solr.update.SolrIndexWriter@65f1fa9f commitCommandVersion:0
   [junit4]   2> 2109093 INFO  (TEST-TestUseDocValuesAsStored.testRandomSingleAndMultiValued-seed#[76BC5A6650E2A727]) [     ] o.a.s.s.SolrIndexSearcher Opening [Searcher@c8cb2b4[collection1] main]
   [junit4]   2> 2109094 INFO  (TEST-TestUseDocValuesAsStored.testRandomSingleAndMultiValued-seed#[76BC5A6650E2A727]) [     ] o.a.s.u.DirectUpdateHandler2 end_commit_flush
   [junit4]   2> 2109095 INFO  (searcherExecutor-14570-thread-1) [     ] o.a.s.c.SolrCore [collection1] Registered new searcher Searcher@c8cb2b4[collection1] main{ExitableDirectoryReader(UninvertingDirectoryReader(Uninverting(_a(9.0.0):C1:[diagnostics={java.version=12.0.1, java.vm.version=12.0.1+12, lucene.version=9.0.0, source=flush, os.arch=amd64, java.runtime.version=12.0.1+12, os.version=4.18.0-25-generic, os=Linux, java.vendor=AdoptOpenJDK, timestamp=1564450524483}]:[attributes={Lucene50StoredFieldsFormat.mode=BEST_SPEED}]) Uninverting(_b(9.0.0):C1:[diagnostics={java.version=12.0.1, java.vm.version=12.0.1+12, lucene.version=9.0.0, source=flush, os.arch=amd64, java.runtime.version=12.0.1+12, os.version=4.18.0-25-generic, os=Linux, java.vendor=AdoptOpenJDK, timestamp=1564450524559}]:[attributes={Lucene50StoredFieldsFormat.mode=BEST_SPEED}]) Uninverting(_c(9.0.0):C1:[diagnostics={java.version=12.0.1, java.vm.version=12.0.1+12, lucene.version=9.0.0, source=flush, os.arch=amd64, java.runtime.version=12.0.1+12, os.version=4.18.0-25-generic, os=Linux, java.vendor=AdoptOpenJDK, timestamp=1564450524649}]:[attributes={Lucene50StoredFieldsFormat.mode=BEST_SPEED}])))}
   [junit4]   2> 2109095 INFO  (TEST-TestUseDocValuesAsStored.testRandomSingleAndMultiValued-seed#[76BC5A6650E2A727]) [     ] o.a.s.u.p.LogUpdateProcessorFactory [collection1]  webapp=null path=null params={}{commit=} 0 98
   [junit4]   2> 2109095 INFO  (TEST-TestUseDocValuesAsStored.testRandomSingleAndMultiValued-seed#[76BC5A6650E2A727]) [     ] o.a.s.c.S.Request [collection1]  webapp=null path=null params={q=id:12&fl=test_d_dvo&wt=xml} hits=1 status=0 QTime=0
   [junit4]   2> 2109096 INFO  (TEST-TestUseDocValuesAsStored.testRandomSingleAndMultiValued-seed#[76BC5A6650E2A727]) [     ] o.a.s.c.S.Request [collection1]  webapp=null path=null params={q=id:12&fl=test_d_dvo,*&wt=xml} hits=1 status=0 QTime=0
   [junit4]   2> 2109096 INFO  (TEST-TestUseDocValuesAsStored.testRandomSingleAndMultiValued-seed#[76BC5A6650E2A727]) [     ] o.a.s.c.S.Request [collection1]  webapp=null path=null params={q=id:12&fl=*dvo&wt=xml} hits=1 status=0 QTime=0
   [junit4]   2> 2109096 INFO  (TEST-TestUseDocValuesAsStored.testRandomSingleAndMultiValued-seed#[76BC5A6650E2A727]) [     ] o.a.s.c.S.Request [collection1]  webapp=null path=null params={q=id:12&fl=*&wt=xml} hits=1 status=0 QTime=0
   [junit4]   2> 2109096 INFO  (TEST-TestUseDocValuesAsStored.testRandomSingleAndMultiValued-seed#[76BC5A6650E2A727]) [     ] o.a.s.c.S.Request [collection1]  webapp=null path=null params={q=id:12&fl=test_d_dvo,fakeFieldName&wt=xml} hits=1 status=0 QTime=0
   [junit4]   2> 2109097 INFO  (TEST-TestUseDocValuesAsStored.testRandomSingleAndMultiValued-seed#[76BC5A6650E2A727]) [     ] o.a.s.c.S.Request [collection1]  webapp=null path=null params={q=*:*&fl=*&wt=xml} hits=3 status=0 QTime=0
   [junit4]   2> 2109097 INFO  (TEST-TestUseDocValuesAsStored.testRandomSingleAndMultiValued-seed#[76BC5A6650E2A727]) [     ] o.a.s.u.p.LogUpdateProcessorFactory [collection1]  webapp=null path=null params={}{add=[13]} 0 0
   [junit4]   2> 2109097 INFO  (TEST-TestUseDocValuesAsStored.testRandomSingleAndMultiValued-seed#[76BC5A6650E2A727]) [     ] o.a.s.u.DirectUpdateHandler2 start commit{,optimize=false,openSearcher=true,waitSearcher=true,expungeDeletes=false,softCommit=false,prepareCommit=false}
   [junit4]   2> 2109097 INFO  (TEST-TestUseDocValuesAsStored.testRandomSingleAndMultiValued-seed#[76BC5A6650E2A727]) [     ] o.a.s.u.SolrIndexWriter Calling setCommitData with IW:org.apache.solr.update.SolrIndexWriter@65f1fa9f commitCommandVersion:0
   [junit4]   2> 2109208 INFO  (TEST-TestUseDocValuesAsStored.testRandomSingleAndMultiValued-seed#[76BC5A6650E2A727]) [     ] o.a.s.s.SolrIndexSearcher Opening [Searcher@2e8ab322[collection1] main]
   [junit4]   2> 2109208 INFO  (TEST-TestUseDocValuesAsStored.testRandomSingleAndMultiValued-seed#[76BC5A6650E2A727]) [     ] o.a.s.u.DirectUpdateHandler2 end_commit_flush
   [junit4]   2> 2109209 INFO  (searcherExecutor-14570-thread-1) [     ] o.a.s.c.SolrCore [collection1] Registered new searcher Searcher@2e8ab322[collection1] main{ExitableDirectoryReader(UninvertingDirectoryReader(Uninverting(_a(9.0.0):C1:[diagnostics={java.version=12.0.1, java.vm.version=12.0.1+12, lucene.version=9.0.0, source=flush, os.arch=amd64, java.runtime.version=12.0.1+12, os.version=4.18.0-25-generic, os=Linux, java.vendor=AdoptOpenJDK, timestamp=1564450524483}]:[attributes={Lucene50StoredFieldsFormat.mode=BEST_SPEED}]) Uninverting(_b(9.0.0):C1:[diagnostics={java.version=12.0.1, java.vm.version=12.0.1+12, lucene.version=9.0.0, source=flush, os.arch=amd64, java.runtime.version=12.0.1+12, os.version=4.18.0-25-generic, os=Linux, java.vendor=AdoptOpenJDK, timestamp=1564450524559}]:[attributes={Lucene50StoredFieldsFormat.mode=BEST_SPEED}]) Uninverting(_c(9.0.0):C1:[diagnostics={java.version=12.0.1, java.vm.version=12.0.1+12, lucene.version=9.0.0, source=flush, os.arch=amd64, java.runtime.version=12.0.1+12, os.version=4.18.0-25-generic, os=Linux, java.vendor=AdoptOpenJDK, timestamp=1564450524649}]:[attributes={Lucene50StoredFieldsFormat.mode=BEST_SPEED}]) Uninverting(_d(9.0.0):C1:[diagnostics={java.version=12.0.1, java.vm.version=12.0.1+12, lucene.version=9.0.0, source=flush, os.arch=amd64, java.runtime.version=12.0.1+12, os.version=4.18.0-25-generic, os=Linux, java.vendor=AdoptOpenJDK, timestamp=1564450524751}]:[attributes={Lucene50StoredFieldsFormat.mode=BEST_SPEED}])))}
   [junit4]   2> 2109209 INFO  (TEST-TestUseDocValuesAsStored.testRandomSingleAndMultiValued-seed#[76BC5A6650E2A727]) [     ] o.a.s.u.p.LogUpdateProcessorFactory [collection1]  webapp=null path=null params={}{commit=} 0 111
   [junit4]   2> 2109209 INFO  (TEST-TestUseDocValuesAsStored.testRandomSingleAndMultiValued-seed#[76BC5A6650E2A727]) [     ] o.a.s.c.S.Request [collection1]  webapp=null path=null params={q=id:13&fl=test_ls_dvo&wt=xml} hits=1 status=0 QTime=0
   [junit4]   2> 2109209 INFO  (TEST-TestUseDocValuesAsStored.testRandomSingleAndMultiValued-seed#[76BC5A6650E2A727]) [     ] o.a.s.c.S.Request [collection1]  webapp=null path=null params={q=id:13&fl=test_ls_dvo,*&wt=xml} hits=1 status=0 QTime=0
   [junit4]   2> 2109210 INFO  (TEST-TestUseDocValuesAsStored.testRandomSingleAndMultiValued-seed#[76BC5A6650E2A727]) [     ] o.a.s.c.S.Request [collection1]  webapp=null path=null params={q=id:13&fl=*dvo&wt=xml} hits=1 status=0 QTime=0
   [junit4]   2> 2109210 INFO  (TEST-TestUseDocValuesAsStored.testRandomSingleAndMultiValued-seed#[76BC5A6650E2A727]) [     ] o.a.s.c.S.Request [collection1]  webapp=null path=null params={q=id:13&fl=*&wt=xml} hits=1 status=0 QTime=0
   [junit4]   2> 2109211 INFO  (TEST-TestUseDocValuesAsStored.testRandomSingleAndMultiValued-seed#[76BC5A6650E2A727]) [     ] o.a.s.c.S.Request [collection1]  webapp=null path=null params={q=id:13&fl=test_ls_dvo,fakeFieldName&wt=xml} hits=1 status=0 QTime=0
   [junit4]   2> 2109211 INFO  (TEST-TestUseDocValuesAsStored.testRandomSingleAndMultiValued-seed#[76BC5A6650E2A727]) [     ] o.a.s.c.S.Request [collection1]  webapp=null path=null params={q=*:*&fl=*&wt=xml} hits=4 status=0 QTime=0
   [junit4]   2> 2109212 INFO  (TEST-TestUseDocValuesAsStored.testRandomSingleAndMultiValued-seed#[76BC5A6650E2A727]) [     ] o.a.s.u.p.LogUpdateProcessorFactory [collection1]  webapp=null path=null params={}{add=[14]} 0 0
   [junit4]   2> 2109212 INFO  (TEST-TestUseDocValuesAsStored.testRandomSingleAndMultiValued-seed#[76BC5A6650E2A727]) [     ] o.a.s.u.DirectUpdateHandler2 start commit{,optimize=false,openSearcher=true,waitSearcher=true,expungeDeletes=false,softCommit=false,prepareCommit=false}
   [junit4]   2> 2109212 INFO  (TEST-TestUseDocValuesAsStored.testRandomSingleAndMultiValued-seed#[76BC5A6650E2A727]) [     ] o.a.s.u.SolrIndexWriter Calling setCommitData with IW:org.apache.solr.update.SolrI

[...truncated too long message...]

 com.codahale.metrics.MetricRegistry@6c1d0898
   [junit4]   2> 2167717 INFO  (TEST-TestUseDocValuesAsStored.testMultipleSearchResults-seed#[76BC5A6650E2A727]) [     ] o.a.s.m.SolrMetricManager Closing metric reporters for registry=solr.node, tag=null
   [junit4]   2> 2167717 INFO  (TEST-TestUseDocValuesAsStored.testMultipleSearchResults-seed#[76BC5A6650E2A727]) [     ] o.a.s.m.r.SolrJmxReporter Closing reporter [org.apache.solr.metrics.reporters.SolrJmxReporter@608a7a20: rootName = null, domain = solr.node, service url = null, agent id = null] for registry solr.node / com.codahale.metrics.MetricRegistry@4c28996f
   [junit4]   2> 2167721 INFO  (TEST-TestUseDocValuesAsStored.testMultipleSearchResults-seed#[76BC5A6650E2A727]) [     ] o.a.s.m.SolrMetricManager Closing metric reporters for registry=solr.jvm, tag=null
   [junit4]   2> 2167721 INFO  (TEST-TestUseDocValuesAsStored.testMultipleSearchResults-seed#[76BC5A6650E2A727]) [     ] o.a.s.m.r.SolrJmxReporter Closing reporter [org.apache.solr.metrics.reporters.SolrJmxReporter@60deacb1: rootName = null, domain = solr.jvm, service url = null, agent id = null] for registry solr.jvm / com.codahale.metrics.MetricRegistry@73a619a6
   [junit4]   2> 2167724 INFO  (TEST-TestUseDocValuesAsStored.testMultipleSearchResults-seed#[76BC5A6650E2A727]) [     ] o.a.s.m.SolrMetricManager Closing metric reporters for registry=solr.jetty, tag=null
   [junit4]   2> 2167724 INFO  (TEST-TestUseDocValuesAsStored.testMultipleSearchResults-seed#[76BC5A6650E2A727]) [     ] o.a.s.m.r.SolrJmxReporter Closing reporter [org.apache.solr.metrics.reporters.SolrJmxReporter@61fe3abc: rootName = null, domain = solr.jetty, service url = null, agent id = null] for registry solr.jetty / com.codahale.metrics.MetricRegistry@78b2e80
   [junit4]   2> 2167725 INFO  (TEST-TestUseDocValuesAsStored.testMultipleSearchResults-seed#[76BC5A6650E2A727]) [     ] o.a.s.SolrTestCaseJ4 ###Ending testMultipleSearchResults
   [junit4]   2> NOTE: leaving temporary files on disk at: /home/jenkins/workspace/Lucene-Solr-master-Linux/solr/build/solr-core/test/J2/temp/solr.schema.TestUseDocValuesAsStored_76BC5A6650E2A727-001
   [junit4]   2> NOTE: test params are: codec=Asserting(Lucene80): {}, docValues:{}, maxPointsInLeafNode=1391, maxMBSortInHeap=7.261999175860271, sim=Asserting(org.apache.lucene.search.similarities.AssertingSimilarity@54178ba9), locale=en-BE, timezone=Europe/Copenhagen
   [junit4]   2> NOTE: Linux 4.18.0-25-generic amd64/AdoptOpenJDK 12.0.1 (64-bit)/cpus=8,threads=1,free=240280088,total=518979584
   [junit4]   2> NOTE: All tests run in this JVM: [ClusterStateUpdateTest, TestUniqueKeyFieldResource, DeleteReplicaTest, TestMacros, BasicZkTest, TestObjectReleaseTracker, TestSolrCLIRunExample, TestSimDistribStateManager, TolerantUpdateProcessorTest, CdcrBidirectionalTest, TestSearchPerf, TestMiniSolrCloudClusterSSL, TestCorePropertiesReload, DocExpirationUpdateProcessorFactoryTest, TestScoreJoinQPScore, SolrTestCaseJ4Test, ZkFailoverTest, TestReversedWildcardFilterFactory, UniqFieldsUpdateProcessorFactoryTest, TestExtendedDismaxParser, TestSolrCoreParser, TestPseudoReturnFields, TestReplicationHandler, MetricsHistoryIntegrationTest, BadComponentTest, HttpSolrCallGetCoreTest, TestManagedResourceStorage, TestSSLRandomization, ClassificationUpdateProcessorIntegrationTest, DeleteInactiveReplicaTest, SubstringBytesRefFilterTest, ConnectionManagerTest, PreAnalyzedFieldManagedSchemaCloudTest, ZkStateReaderTest, DistributedIntervalFacetingTest, TestAuthenticationFramework, BlockDirectoryTest, DocValuesMissingTest, TestConfigSets, SolrPluginUtilsTest, CdcrUpdateLogTest, OutputWriterTest, SolrMetricManagerTest, TestNRTOpen, SpatialFilterTest, AtomicUpdatesTest, CollectionsAPISolrJTest, TestLRUStatsCache, TestReloadAndDeleteDocs, TestSimNodeAddedTrigger, TestLuceneIndexBackCompat, TestHttpShardHandlerFactory, TestHighFrequencyDictionaryFactory, TestSQLHandlerNonCloud, TestContainerReqHandler, TestSolrQueryParser, TestImplicitCoreProperties, DistributedQueueTest, DirectoryFactoryTest, IndexSchemaTest, TestComplexPhraseLeadingWildcard, TestTrie, RandomizedTaggerTest, TestCopyFieldCollectionResource, MetricTriggerIntegrationTest, ScriptEngineTest, TestManagedSynonymGraphFilterFactory, TestPullReplica, RuleEngineTest, SuggesterTSTTest, CachingDirectoryFactoryTest, TestDistributedTracing, SSLMigrationTest, BlockJoinFacetRandomTest, TestCloudNestedDocsSort, BooleanFieldTest, NodeAddedTriggerTest, RequestHandlersTest, TestLMDirichletSimilarityFactory, TermsComponentTest, SuggestComponentTest, DistanceUnitsTest, TestPKIAuthenticationPlugin, TestLegacyNumericRangeQueryBuilder, DistanceFunctionTest, FieldAnalysisRequestHandlerTest, SystemInfoHandlerTest, TestFieldCollectionResource, ForceLeaderTest, TestDFISimilarityFactory, TestDynamicLoading, SpellCheckCollatorWithCollapseTest, TestDelegationWithHadoopAuth, TestCloudInspectUtil, TestUtils, TestSolrConfigHandler, AutoScalingHandlerTest, TestBlobHandler, TestSimpleTrackingShardHandler, TestJmxIntegration, CircularListTest, JvmMetricsTest, ChaosMonkeySafeLeaderTest, TestDistribIDF, TestSubQueryTransformerCrossCore, TestFieldCache, TestSuggestSpellingConverter, ShardRoutingTest, TriggerSetPropertiesIntegrationTest, TestOverriddenPrefixQueryForCustomFieldType, DocumentBuilderTest, RecoveryZkTest, TestFieldTypeResource, FileBasedSpellCheckerTest, IgnoreLargeDocumentProcessorFactoryTest, TestLegacyField, SolrRrdBackendFactoryTest, ScheduledTriggerIntegrationTest, TestInPlaceUpdatesRequiredField, CollectionsAPIDistributedZkTest, TestRecoveryHdfs, NumericFieldsTest, DistribCursorPagingTest, TaggingAttributeTest, HttpPartitionWithTlogReplicasTest, TestExportWriter, OverriddenZkACLAndCredentialsProvidersTest, CollectionReloadTest, TestDownShardTolerantSearch, TestAnalyzeInfixSuggestions, TestCharFilters, DefaultValueUpdateProcessorTest, LeaderTragicEventTest, OverseerRolesTest, TestRTGBase, TestNamedUpdateProcessors, ZkSolrClientTest, TriggerCooldownIntegrationTest, HdfsTlogReplayBufferedWhileIndexingTest, OrderedExecutorTest, BasicFunctionalityTest, ConvertedLegacyTest, SampleTest, TestCrossCoreJoin, TestCursorMarkWithoutUniqueKey, TestDistributedGrouping, TestDistributedMissingSort, TestDistributedSearch, TestDocumentBuilder, TestHighlightDedupGrouping, TestJoin, TestSolrCoreProperties, TestDeprecatedFilters, TestWordDelimiterFilterFactory, TestEmbeddedSolrServerConstructors, TestEmbeddedSolrServerSchemaAPI, ConnectionReuseTest, ActionThrottleTest, AddReplicaTest, AliasIntegrationTest, AssignBackwardCompatibilityTest, ChaosMonkeyNothingIsSafeTest, ChaosMonkeySafeLeaderWithPullReplicasTest, CleanupOldIndexTest, ConcurrentCreateRoutedAliasTest, CreateCollectionCleanupTest, DeleteLastCustomShardedReplicaTest, DistributedVersionInfoTest, LeaderElectionTest, LeaderVoteWaitTimeoutTest, MultiThreadedOCPTest, NestedShardedAtomicUpdateTest, OverseerTaskQueueTest, PeerSyncReplicationTest, RestartWhileUpdatingTest, SaslZkACLProviderTest, SliceStateTest, SolrCLIZkUtilsTest, SyncSliceTest, TestCloudRecovery, TestConfigSetsAPI, TestDeleteCollectionOnDownNodes, TestExclusionRuleCollectionAccess, TestLeaderElectionWithEmptyReplica, TestRandomRequestDistribution, TestSegmentSorting, TestSolrCloudWithDelegationTokens, TestStressInPlaceUpdates, TestWaitForStateWithJettyShutdowns, TestWithCollection, HdfsCollectionsAPIDistributedZkTest, SimpleCollectionCreateDeleteTest, TestHdfsCloudBackupRestore, TestRequestStatusCollectionAPI, NodeLostTriggerIntegrationTest, SearchRateTriggerIntegrationTest, SystemLogListenerTest, CdcrWithNodesRestartsTest, HDFSCollectionsAPITest, PluginInfoTest, ResourceLoaderTest, SOLR749Test, SolrCoreCheckLockOnStartupTest, TestBackupRepositoryFactory, TestBadConfig, TestConfigSetImmutable, TestQuerySenderListener, TestSolrDeletionPolicy1, TestSolrDeletionPolicy2, TestSolrIndexConfig, TestSolrCloudSnapshots, V2StandaloneTest, XmlUpdateRequestHandlerTest, XsltUpdateRequestHandlerTest, AdminHandlersProxyTest, CoreAdminHandlerTest, CoreAdminOperationTest, CoreMergeIndexesAdminHandlerTest, DaemonStreamApiTest, MBeansHandlerTest, DistributedFacetPivotLongTailTest, DistributedFacetPivotWhiteBoxTest, DistributedQueryElevationComponentTest, DistributedSpellCheckComponentTest, MoreLikeThisComponentTest, QueryElevationComponentTest, ShufflingReplicaListTransformerTest, SpellCheckComponentTest, StatsComponentTest, UninvertDocValuesMergePolicyTest, TestLegacyTerms, TestMultiValuedNumericRangeQuery, TestNumericRangeQuery64, SolrGraphiteReporterTest, RegexBytesRefFilterTest, TestFaceting, TestIntervalFaceting, TestSchemaManager, TestSortableTextField, TestUseDocValuesAsStored]
   [junit4] Completed [763/871 (1!)] on J2 in 62.79s, 7 tests, 1 error <<< FAILURES!

[...truncated 45208 lines...]
[repro] Jenkins log URL: https://jenkins.thetaphi.de/job/Lucene-Solr-master-Linux/24469/consoleText

[repro] Revision: 70a8deb0abedd42aec86b10a8da2676737853514

[repro] Ant options: "-Dargs=-XX:+UseCompressedOops -XX:+UseSerialGC"
[repro] Repro line:  ant test  -Dtestcase=TestUseDocValuesAsStored -Dtests.method=testDuplicateMultiValued -Dtests.seed=76BC5A6650E2A727 -Dtests.multiplier=3 -Dtests.slow=true -Dtests.locale=en-BE -Dtests.timezone=Europe/Copenhagen -Dtests.asserts=true -Dtests.file.encoding=UTF-8

[repro] ant clean

[...truncated 6 lines...]
[repro] Test suites by module:
[repro]    solr/core
[repro]       TestUseDocValuesAsStored
[repro] ant compile-test

[...truncated 3315 lines...]
[repro] ant test-nocompile -Dtests.dups=5 -Dtests.maxfailures=5 -Dtests.class="*.TestUseDocValuesAsStored" -Dtests.showOutput=onerror "-Dargs=-XX:+UseCompressedOops -XX:+UseSerialGC" -Dtests.seed=76BC5A6650E2A727 -Dtests.multiplier=3 -Dtests.slow=true -Dtests.locale=en-BE -Dtests.timezone=Europe/Copenhagen -Dtests.asserts=true -Dtests.file.encoding=UTF-8

[...truncated 110 lines...]
[repro] Failures:
[repro]   0/5 failed: org.apache.solr.schema.TestUseDocValuesAsStored
[repro] Exiting with code 0

[...truncated 43 lines...]

Mime
View raw message