lucene-dev mailing list archives

Site index · List index
Message view « Date » · « Thread »
Top « Date » · « Thread »
From Policeman Jenkins Server <jenk...@thetaphi.de>
Subject [JENKINS] Lucene-Solr-8.x-Linux (64bit/jdk-11.0.3) - Build # 935 - Unstable!
Date Sun, 28 Jul 2019 20:22:46 GMT
Build: https://jenkins.thetaphi.de/job/Lucene-Solr-8.x-Linux/935/
Java: 64bit/jdk-11.0.3 -XX:+UseCompressedOops -XX:+UseParallelGC

4 tests failed.
FAILED:  org.apache.solr.handler.export.TestExportWriter.testStringWithCase

Error Message:
expected:<...:"3"},       {"id":"[1"},       {"id":"4]"},       {"id":"2"}...> but was:<...:"3"},       {"id":"[4"},       {"id":"1]"},       {"id":"2"}...>

Stack Trace:
org.junit.ComparisonFailure: expected:<...:"3"},
      {"id":"[1"},
      {"id":"4]"},
      {"id":"2"}...> but was:<...:"3"},
      {"id":"[4"},
      {"id":"1]"},
      {"id":"2"}...>
	at __randomizedtesting.SeedInfo.seed([DB51704BFD0EEEBB:BF1A8CCD6483EEDE]:0)
	at org.junit.Assert.assertEquals(Assert.java:115)
	at org.junit.Assert.assertEquals(Assert.java:144)
	at org.apache.solr.handler.export.TestExportWriter.assertJsonEquals(TestExportWriter.java:540)
	at org.apache.solr.handler.export.TestExportWriter.testStringWithCase(TestExportWriter.java:365)
	at java.base/jdk.internal.reflect.NativeMethodAccessorImpl.invoke0(Native Method)
	at java.base/jdk.internal.reflect.NativeMethodAccessorImpl.invoke(NativeMethodAccessorImpl.java:62)
	at java.base/jdk.internal.reflect.DelegatingMethodAccessorImpl.invoke(DelegatingMethodAccessorImpl.java:43)
	at java.base/java.lang.reflect.Method.invoke(Method.java:566)
	at com.carrotsearch.randomizedtesting.RandomizedRunner.invoke(RandomizedRunner.java:1750)
	at com.carrotsearch.randomizedtesting.RandomizedRunner$8.evaluate(RandomizedRunner.java:938)
	at com.carrotsearch.randomizedtesting.RandomizedRunner$9.evaluate(RandomizedRunner.java:974)
	at com.carrotsearch.randomizedtesting.RandomizedRunner$10.evaluate(RandomizedRunner.java:988)
	at com.carrotsearch.randomizedtesting.rules.SystemPropertiesRestoreRule$1.evaluate(SystemPropertiesRestoreRule.java:57)
	at org.apache.lucene.util.TestRuleSetupTeardownChained$1.evaluate(TestRuleSetupTeardownChained.java:49)
	at org.apache.lucene.util.AbstractBeforeAfterRule$1.evaluate(AbstractBeforeAfterRule.java:45)
	at org.apache.lucene.util.TestRuleThreadAndTestName$1.evaluate(TestRuleThreadAndTestName.java:48)
	at org.apache.lucene.util.TestRuleIgnoreAfterMaxFailures$1.evaluate(TestRuleIgnoreAfterMaxFailures.java:64)
	at org.apache.lucene.util.TestRuleMarkFailure$1.evaluate(TestRuleMarkFailure.java:47)
	at com.carrotsearch.randomizedtesting.rules.StatementAdapter.evaluate(StatementAdapter.java:36)
	at com.carrotsearch.randomizedtesting.ThreadLeakControl$StatementRunner.run(ThreadLeakControl.java:368)
	at com.carrotsearch.randomizedtesting.ThreadLeakControl.forkTimeoutingTask(ThreadLeakControl.java:817)
	at com.carrotsearch.randomizedtesting.ThreadLeakControl$3.evaluate(ThreadLeakControl.java:468)
	at com.carrotsearch.randomizedtesting.RandomizedRunner.runSingleTest(RandomizedRunner.java:947)
	at com.carrotsearch.randomizedtesting.RandomizedRunner$5.evaluate(RandomizedRunner.java:832)
	at com.carrotsearch.randomizedtesting.RandomizedRunner$6.evaluate(RandomizedRunner.java:883)
	at com.carrotsearch.randomizedtesting.RandomizedRunner$7.evaluate(RandomizedRunner.java:894)
	at com.carrotsearch.randomizedtesting.rules.StatementAdapter.evaluate(StatementAdapter.java:36)
	at com.carrotsearch.randomizedtesting.rules.SystemPropertiesRestoreRule$1.evaluate(SystemPropertiesRestoreRule.java:57)
	at org.apache.lucene.util.AbstractBeforeAfterRule$1.evaluate(AbstractBeforeAfterRule.java:45)
	at com.carrotsearch.randomizedtesting.rules.StatementAdapter.evaluate(StatementAdapter.java:36)
	at org.apache.lucene.util.TestRuleStoreClassName$1.evaluate(TestRuleStoreClassName.java:41)
	at com.carrotsearch.randomizedtesting.rules.NoShadowingOrOverridesOnMethodsRule$1.evaluate(NoShadowingOrOverridesOnMethodsRule.java:40)
	at com.carrotsearch.randomizedtesting.rules.NoShadowingOrOverridesOnMethodsRule$1.evaluate(NoShadowingOrOverridesOnMethodsRule.java:40)
	at com.carrotsearch.randomizedtesting.rules.StatementAdapter.evaluate(StatementAdapter.java:36)
	at com.carrotsearch.randomizedtesting.rules.StatementAdapter.evaluate(StatementAdapter.java:36)
	at org.apache.lucene.util.TestRuleAssertionsRequired$1.evaluate(TestRuleAssertionsRequired.java:53)
	at org.apache.lucene.util.TestRuleMarkFailure$1.evaluate(TestRuleMarkFailure.java:47)
	at org.apache.lucene.util.TestRuleIgnoreAfterMaxFailures$1.evaluate(TestRuleIgnoreAfterMaxFailures.java:64)
	at org.apache.lucene.util.TestRuleIgnoreTestSuites$1.evaluate(TestRuleIgnoreTestSuites.java:54)
	at com.carrotsearch.randomizedtesting.rules.StatementAdapter.evaluate(StatementAdapter.java:36)
	at com.carrotsearch.randomizedtesting.ThreadLeakControl$StatementRunner.run(ThreadLeakControl.java:368)
	at java.base/java.lang.Thread.run(Thread.java:834)


FAILED:  org.apache.solr.handler.export.TestExportWriter.testStringWithCase

Error Message:
expected:<...:"3"},       {"id":"[1"},       {"id":"4]"},       {"id":"2"}...> but was:<...:"3"},       {"id":"[4"},       {"id":"1]"},       {"id":"2"}...>

Stack Trace:
org.junit.ComparisonFailure: expected:<...:"3"},
      {"id":"[1"},
      {"id":"4]"},
      {"id":"2"}...> but was:<...:"3"},
      {"id":"[4"},
      {"id":"1]"},
      {"id":"2"}...>
	at __randomizedtesting.SeedInfo.seed([DB51704BFD0EEEBB:BF1A8CCD6483EEDE]:0)
	at org.junit.Assert.assertEquals(Assert.java:115)
	at org.junit.Assert.assertEquals(Assert.java:144)
	at org.apache.solr.handler.export.TestExportWriter.assertJsonEquals(TestExportWriter.java:540)
	at org.apache.solr.handler.export.TestExportWriter.testStringWithCase(TestExportWriter.java:365)
	at java.base/jdk.internal.reflect.NativeMethodAccessorImpl.invoke0(Native Method)
	at java.base/jdk.internal.reflect.NativeMethodAccessorImpl.invoke(NativeMethodAccessorImpl.java:62)
	at java.base/jdk.internal.reflect.DelegatingMethodAccessorImpl.invoke(DelegatingMethodAccessorImpl.java:43)
	at java.base/java.lang.reflect.Method.invoke(Method.java:566)
	at com.carrotsearch.randomizedtesting.RandomizedRunner.invoke(RandomizedRunner.java:1750)
	at com.carrotsearch.randomizedtesting.RandomizedRunner$8.evaluate(RandomizedRunner.java:938)
	at com.carrotsearch.randomizedtesting.RandomizedRunner$9.evaluate(RandomizedRunner.java:974)
	at com.carrotsearch.randomizedtesting.RandomizedRunner$10.evaluate(RandomizedRunner.java:988)
	at com.carrotsearch.randomizedtesting.rules.SystemPropertiesRestoreRule$1.evaluate(SystemPropertiesRestoreRule.java:57)
	at org.apache.lucene.util.TestRuleSetupTeardownChained$1.evaluate(TestRuleSetupTeardownChained.java:49)
	at org.apache.lucene.util.AbstractBeforeAfterRule$1.evaluate(AbstractBeforeAfterRule.java:45)
	at org.apache.lucene.util.TestRuleThreadAndTestName$1.evaluate(TestRuleThreadAndTestName.java:48)
	at org.apache.lucene.util.TestRuleIgnoreAfterMaxFailures$1.evaluate(TestRuleIgnoreAfterMaxFailures.java:64)
	at org.apache.lucene.util.TestRuleMarkFailure$1.evaluate(TestRuleMarkFailure.java:47)
	at com.carrotsearch.randomizedtesting.rules.StatementAdapter.evaluate(StatementAdapter.java:36)
	at com.carrotsearch.randomizedtesting.ThreadLeakControl$StatementRunner.run(ThreadLeakControl.java:368)
	at com.carrotsearch.randomizedtesting.ThreadLeakControl.forkTimeoutingTask(ThreadLeakControl.java:817)
	at com.carrotsearch.randomizedtesting.ThreadLeakControl$3.evaluate(ThreadLeakControl.java:468)
	at com.carrotsearch.randomizedtesting.RandomizedRunner.runSingleTest(RandomizedRunner.java:947)
	at com.carrotsearch.randomizedtesting.RandomizedRunner$5.evaluate(RandomizedRunner.java:832)
	at com.carrotsearch.randomizedtesting.RandomizedRunner$6.evaluate(RandomizedRunner.java:883)
	at com.carrotsearch.randomizedtesting.RandomizedRunner$7.evaluate(RandomizedRunner.java:894)
	at com.carrotsearch.randomizedtesting.rules.StatementAdapter.evaluate(StatementAdapter.java:36)
	at com.carrotsearch.randomizedtesting.rules.SystemPropertiesRestoreRule$1.evaluate(SystemPropertiesRestoreRule.java:57)
	at org.apache.lucene.util.AbstractBeforeAfterRule$1.evaluate(AbstractBeforeAfterRule.java:45)
	at com.carrotsearch.randomizedtesting.rules.StatementAdapter.evaluate(StatementAdapter.java:36)
	at org.apache.lucene.util.TestRuleStoreClassName$1.evaluate(TestRuleStoreClassName.java:41)
	at com.carrotsearch.randomizedtesting.rules.NoShadowingOrOverridesOnMethodsRule$1.evaluate(NoShadowingOrOverridesOnMethodsRule.java:40)
	at com.carrotsearch.randomizedtesting.rules.NoShadowingOrOverridesOnMethodsRule$1.evaluate(NoShadowingOrOverridesOnMethodsRule.java:40)
	at com.carrotsearch.randomizedtesting.rules.StatementAdapter.evaluate(StatementAdapter.java:36)
	at com.carrotsearch.randomizedtesting.rules.StatementAdapter.evaluate(StatementAdapter.java:36)
	at org.apache.lucene.util.TestRuleAssertionsRequired$1.evaluate(TestRuleAssertionsRequired.java:53)
	at org.apache.lucene.util.TestRuleMarkFailure$1.evaluate(TestRuleMarkFailure.java:47)
	at org.apache.lucene.util.TestRuleIgnoreAfterMaxFailures$1.evaluate(TestRuleIgnoreAfterMaxFailures.java:64)
	at org.apache.lucene.util.TestRuleIgnoreTestSuites$1.evaluate(TestRuleIgnoreTestSuites.java:54)
	at com.carrotsearch.randomizedtesting.rules.StatementAdapter.evaluate(StatementAdapter.java:36)
	at com.carrotsearch.randomizedtesting.ThreadLeakControl$StatementRunner.run(ThreadLeakControl.java:368)
	at java.base/java.lang.Thread.run(Thread.java:834)


FAILED:  org.apache.solr.handler.export.TestExportWriter.testStringWithCase

Error Message:
expected:<...:"3"},       {"id":"[1"},       {"id":"4]"},       {"id":"2"}...> but was:<...:"3"},       {"id":"[4"},       {"id":"1]"},       {"id":"2"}...>

Stack Trace:
org.junit.ComparisonFailure: expected:<...:"3"},
      {"id":"[1"},
      {"id":"4]"},
      {"id":"2"}...> but was:<...:"3"},
      {"id":"[4"},
      {"id":"1]"},
      {"id":"2"}...>
	at __randomizedtesting.SeedInfo.seed([DB51704BFD0EEEBB:BF1A8CCD6483EEDE]:0)
	at org.junit.Assert.assertEquals(Assert.java:115)
	at org.junit.Assert.assertEquals(Assert.java:144)
	at org.apache.solr.handler.export.TestExportWriter.assertJsonEquals(TestExportWriter.java:540)
	at org.apache.solr.handler.export.TestExportWriter.testStringWithCase(TestExportWriter.java:365)
	at java.base/jdk.internal.reflect.NativeMethodAccessorImpl.invoke0(Native Method)
	at java.base/jdk.internal.reflect.NativeMethodAccessorImpl.invoke(NativeMethodAccessorImpl.java:62)
	at java.base/jdk.internal.reflect.DelegatingMethodAccessorImpl.invoke(DelegatingMethodAccessorImpl.java:43)
	at java.base/java.lang.reflect.Method.invoke(Method.java:566)
	at com.carrotsearch.randomizedtesting.RandomizedRunner.invoke(RandomizedRunner.java:1750)
	at com.carrotsearch.randomizedtesting.RandomizedRunner$8.evaluate(RandomizedRunner.java:938)
	at com.carrotsearch.randomizedtesting.RandomizedRunner$9.evaluate(RandomizedRunner.java:974)
	at com.carrotsearch.randomizedtesting.RandomizedRunner$10.evaluate(RandomizedRunner.java:988)
	at com.carrotsearch.randomizedtesting.rules.SystemPropertiesRestoreRule$1.evaluate(SystemPropertiesRestoreRule.java:57)
	at org.apache.lucene.util.TestRuleSetupTeardownChained$1.evaluate(TestRuleSetupTeardownChained.java:49)
	at org.apache.lucene.util.AbstractBeforeAfterRule$1.evaluate(AbstractBeforeAfterRule.java:45)
	at org.apache.lucene.util.TestRuleThreadAndTestName$1.evaluate(TestRuleThreadAndTestName.java:48)
	at org.apache.lucene.util.TestRuleIgnoreAfterMaxFailures$1.evaluate(TestRuleIgnoreAfterMaxFailures.java:64)
	at org.apache.lucene.util.TestRuleMarkFailure$1.evaluate(TestRuleMarkFailure.java:47)
	at com.carrotsearch.randomizedtesting.rules.StatementAdapter.evaluate(StatementAdapter.java:36)
	at com.carrotsearch.randomizedtesting.ThreadLeakControl$StatementRunner.run(ThreadLeakControl.java:368)
	at com.carrotsearch.randomizedtesting.ThreadLeakControl.forkTimeoutingTask(ThreadLeakControl.java:817)
	at com.carrotsearch.randomizedtesting.ThreadLeakControl$3.evaluate(ThreadLeakControl.java:468)
	at com.carrotsearch.randomizedtesting.RandomizedRunner.runSingleTest(RandomizedRunner.java:947)
	at com.carrotsearch.randomizedtesting.RandomizedRunner$5.evaluate(RandomizedRunner.java:832)
	at com.carrotsearch.randomizedtesting.RandomizedRunner$6.evaluate(RandomizedRunner.java:883)
	at com.carrotsearch.randomizedtesting.RandomizedRunner$7.evaluate(RandomizedRunner.java:894)
	at com.carrotsearch.randomizedtesting.rules.StatementAdapter.evaluate(StatementAdapter.java:36)
	at com.carrotsearch.randomizedtesting.rules.SystemPropertiesRestoreRule$1.evaluate(SystemPropertiesRestoreRule.java:57)
	at org.apache.lucene.util.AbstractBeforeAfterRule$1.evaluate(AbstractBeforeAfterRule.java:45)
	at com.carrotsearch.randomizedtesting.rules.StatementAdapter.evaluate(StatementAdapter.java:36)
	at org.apache.lucene.util.TestRuleStoreClassName$1.evaluate(TestRuleStoreClassName.java:41)
	at com.carrotsearch.randomizedtesting.rules.NoShadowingOrOverridesOnMethodsRule$1.evaluate(NoShadowingOrOverridesOnMethodsRule.java:40)
	at com.carrotsearch.randomizedtesting.rules.NoShadowingOrOverridesOnMethodsRule$1.evaluate(NoShadowingOrOverridesOnMethodsRule.java:40)
	at com.carrotsearch.randomizedtesting.rules.StatementAdapter.evaluate(StatementAdapter.java:36)
	at com.carrotsearch.randomizedtesting.rules.StatementAdapter.evaluate(StatementAdapter.java:36)
	at org.apache.lucene.util.TestRuleAssertionsRequired$1.evaluate(TestRuleAssertionsRequired.java:53)
	at org.apache.lucene.util.TestRuleMarkFailure$1.evaluate(TestRuleMarkFailure.java:47)
	at org.apache.lucene.util.TestRuleIgnoreAfterMaxFailures$1.evaluate(TestRuleIgnoreAfterMaxFailures.java:64)
	at org.apache.lucene.util.TestRuleIgnoreTestSuites$1.evaluate(TestRuleIgnoreTestSuites.java:54)
	at com.carrotsearch.randomizedtesting.rules.StatementAdapter.evaluate(StatementAdapter.java:36)
	at com.carrotsearch.randomizedtesting.ThreadLeakControl$StatementRunner.run(ThreadLeakControl.java:368)
	at java.base/java.lang.Thread.run(Thread.java:834)


FAILED:  org.apache.solr.handler.export.TestExportWriter.testStringWithCase

Error Message:
expected:<...:"3"},       {"id":"[1"},       {"id":"4]"},       {"id":"2"}...> but was:<...:"3"},       {"id":"[4"},       {"id":"1]"},       {"id":"2"}...>

Stack Trace:
org.junit.ComparisonFailure: expected:<...:"3"},
      {"id":"[1"},
      {"id":"4]"},
      {"id":"2"}...> but was:<...:"3"},
      {"id":"[4"},
      {"id":"1]"},
      {"id":"2"}...>
	at __randomizedtesting.SeedInfo.seed([DB51704BFD0EEEBB:BF1A8CCD6483EEDE]:0)
	at org.junit.Assert.assertEquals(Assert.java:115)
	at org.junit.Assert.assertEquals(Assert.java:144)
	at org.apache.solr.handler.export.TestExportWriter.assertJsonEquals(TestExportWriter.java:540)
	at org.apache.solr.handler.export.TestExportWriter.testStringWithCase(TestExportWriter.java:365)
	at java.base/jdk.internal.reflect.NativeMethodAccessorImpl.invoke0(Native Method)
	at java.base/jdk.internal.reflect.NativeMethodAccessorImpl.invoke(NativeMethodAccessorImpl.java:62)
	at java.base/jdk.internal.reflect.DelegatingMethodAccessorImpl.invoke(DelegatingMethodAccessorImpl.java:43)
	at java.base/java.lang.reflect.Method.invoke(Method.java:566)
	at com.carrotsearch.randomizedtesting.RandomizedRunner.invoke(RandomizedRunner.java:1750)
	at com.carrotsearch.randomizedtesting.RandomizedRunner$8.evaluate(RandomizedRunner.java:938)
	at com.carrotsearch.randomizedtesting.RandomizedRunner$9.evaluate(RandomizedRunner.java:974)
	at com.carrotsearch.randomizedtesting.RandomizedRunner$10.evaluate(RandomizedRunner.java:988)
	at com.carrotsearch.randomizedtesting.rules.SystemPropertiesRestoreRule$1.evaluate(SystemPropertiesRestoreRule.java:57)
	at org.apache.lucene.util.TestRuleSetupTeardownChained$1.evaluate(TestRuleSetupTeardownChained.java:49)
	at org.apache.lucene.util.AbstractBeforeAfterRule$1.evaluate(AbstractBeforeAfterRule.java:45)
	at org.apache.lucene.util.TestRuleThreadAndTestName$1.evaluate(TestRuleThreadAndTestName.java:48)
	at org.apache.lucene.util.TestRuleIgnoreAfterMaxFailures$1.evaluate(TestRuleIgnoreAfterMaxFailures.java:64)
	at org.apache.lucene.util.TestRuleMarkFailure$1.evaluate(TestRuleMarkFailure.java:47)
	at com.carrotsearch.randomizedtesting.rules.StatementAdapter.evaluate(StatementAdapter.java:36)
	at com.carrotsearch.randomizedtesting.ThreadLeakControl$StatementRunner.run(ThreadLeakControl.java:368)
	at com.carrotsearch.randomizedtesting.ThreadLeakControl.forkTimeoutingTask(ThreadLeakControl.java:817)
	at com.carrotsearch.randomizedtesting.ThreadLeakControl$3.evaluate(ThreadLeakControl.java:468)
	at com.carrotsearch.randomizedtesting.RandomizedRunner.runSingleTest(RandomizedRunner.java:947)
	at com.carrotsearch.randomizedtesting.RandomizedRunner$5.evaluate(RandomizedRunner.java:832)
	at com.carrotsearch.randomizedtesting.RandomizedRunner$6.evaluate(RandomizedRunner.java:883)
	at com.carrotsearch.randomizedtesting.RandomizedRunner$7.evaluate(RandomizedRunner.java:894)
	at com.carrotsearch.randomizedtesting.rules.StatementAdapter.evaluate(StatementAdapter.java:36)
	at com.carrotsearch.randomizedtesting.rules.SystemPropertiesRestoreRule$1.evaluate(SystemPropertiesRestoreRule.java:57)
	at org.apache.lucene.util.AbstractBeforeAfterRule$1.evaluate(AbstractBeforeAfterRule.java:45)
	at com.carrotsearch.randomizedtesting.rules.StatementAdapter.evaluate(StatementAdapter.java:36)
	at org.apache.lucene.util.TestRuleStoreClassName$1.evaluate(TestRuleStoreClassName.java:41)
	at com.carrotsearch.randomizedtesting.rules.NoShadowingOrOverridesOnMethodsRule$1.evaluate(NoShadowingOrOverridesOnMethodsRule.java:40)
	at com.carrotsearch.randomizedtesting.rules.NoShadowingOrOverridesOnMethodsRule$1.evaluate(NoShadowingOrOverridesOnMethodsRule.java:40)
	at com.carrotsearch.randomizedtesting.rules.StatementAdapter.evaluate(StatementAdapter.java:36)
	at com.carrotsearch.randomizedtesting.rules.StatementAdapter.evaluate(StatementAdapter.java:36)
	at org.apache.lucene.util.TestRuleAssertionsRequired$1.evaluate(TestRuleAssertionsRequired.java:53)
	at org.apache.lucene.util.TestRuleMarkFailure$1.evaluate(TestRuleMarkFailure.java:47)
	at org.apache.lucene.util.TestRuleIgnoreAfterMaxFailures$1.evaluate(TestRuleIgnoreAfterMaxFailures.java:64)
	at org.apache.lucene.util.TestRuleIgnoreTestSuites$1.evaluate(TestRuleIgnoreTestSuites.java:54)
	at com.carrotsearch.randomizedtesting.rules.StatementAdapter.evaluate(StatementAdapter.java:36)
	at com.carrotsearch.randomizedtesting.ThreadLeakControl$StatementRunner.run(ThreadLeakControl.java:368)
	at java.base/java.lang.Thread.run(Thread.java:834)




Build Log:
[...truncated 15425 lines...]
   [junit4] Suite: org.apache.solr.handler.export.TestExportWriter
   [junit4]   2> Creating dataDir: /home/jenkins/workspace/Lucene-Solr-8.x-Linux/solr/build/solr-core/test/J2/temp/solr.handler.export.TestExportWriter_DB51704BFD0EEEBB-001/init-core-data-001
   [junit4]   2> 2018174 INFO  (SUITE-TestExportWriter-seed#[DB51704BFD0EEEBB]-worker) [     ] o.a.s.c.SolrResourceLoader [null] Added 2 libs to classloader, from paths: [/home/jenkins/workspace/Lucene-Solr-8.x-Linux/solr/core/src/test-files/solr/collection1/lib, /home/jenkins/workspace/Lucene-Solr-8.x-Linux/solr/core/src/test-files/solr/collection1/lib/classes]
   [junit4]   2> 2018181 INFO  (SUITE-TestExportWriter-seed#[DB51704BFD0EEEBB]-worker) [     ] o.a.s.c.SolrConfig Using Lucene MatchVersion: 8.3.0
   [junit4]   2> 2018185 INFO  (SUITE-TestExportWriter-seed#[DB51704BFD0EEEBB]-worker) [     ] o.a.s.s.IndexSchema [null] Schema name=schema-docValuesMulti
   [junit4]   2> 2018191 INFO  (SUITE-TestExportWriter-seed#[DB51704BFD0EEEBB]-worker) [     ] o.a.s.s.IndexSchema Loaded schema schema-docValuesMulti/1.6 with uniqueid field id
   [junit4]   2> 2018242 INFO  (SUITE-TestExportWriter-seed#[DB51704BFD0EEEBB]-worker) [     ] o.a.s.h.c.HttpShardHandlerFactory Host whitelist initialized: WhitelistHostChecker [whitelistHosts=null, whitelistHostCheckingEnabled=true]
   [junit4]   2> 2018243 WARN  (SUITE-TestExportWriter-seed#[DB51704BFD0EEEBB]-worker) [     ] o.e.j.u.s.S.config Trusting all certificates configured for Client@66821b2c[provider=null,keyStore=null,trustStore=null]
   [junit4]   2> 2018243 WARN  (SUITE-TestExportWriter-seed#[DB51704BFD0EEEBB]-worker) [     ] o.e.j.u.s.S.config No Client EndPointIdentificationAlgorithm configured for Client@66821b2c[provider=null,keyStore=null,trustStore=null]
   [junit4]   2> 2018244 WARN  (SUITE-TestExportWriter-seed#[DB51704BFD0EEEBB]-worker) [     ] o.e.j.u.s.S.config Trusting all certificates configured for Client@f4d16b5[provider=null,keyStore=null,trustStore=null]
   [junit4]   2> 2018244 WARN  (SUITE-TestExportWriter-seed#[DB51704BFD0EEEBB]-worker) [     ] o.e.j.u.s.S.config No Client EndPointIdentificationAlgorithm configured for Client@f4d16b5[provider=null,keyStore=null,trustStore=null]
   [junit4]   2> 2018253 INFO  (SUITE-TestExportWriter-seed#[DB51704BFD0EEEBB]-worker) [     ] o.a.s.c.TransientSolrCoreCacheDefault Allocating transient cache for 2147483647 transient cores
   [junit4]   2> 2018253 INFO  (SUITE-TestExportWriter-seed#[DB51704BFD0EEEBB]-worker) [     ] o.a.s.h.a.MetricsHistoryHandler No .system collection, keeping metrics history in memory.
   [junit4]   2> 2018260 INFO  (SUITE-TestExportWriter-seed#[DB51704BFD0EEEBB]-worker) [     ] o.a.s.m.r.SolrJmxReporter JMX monitoring for 'solr.node' (registry 'solr.node') enabled at server: com.sun.jmx.mbeanserver.JmxMBeanServer@4574c04a
   [junit4]   2> 2018265 INFO  (SUITE-TestExportWriter-seed#[DB51704BFD0EEEBB]-worker) [     ] o.a.s.m.r.SolrJmxReporter JMX monitoring for 'solr.jvm' (registry 'solr.jvm') enabled at server: com.sun.jmx.mbeanserver.JmxMBeanServer@4574c04a
   [junit4]   2> 2018265 INFO  (SUITE-TestExportWriter-seed#[DB51704BFD0EEEBB]-worker) [     ] o.a.s.m.r.SolrJmxReporter JMX monitoring for 'solr.jetty' (registry 'solr.jetty') enabled at server: com.sun.jmx.mbeanserver.JmxMBeanServer@4574c04a
   [junit4]   2> 2018266 INFO  (coreLoadExecutor-12983-thread-1) [    x:collection1 ] o.a.s.c.SolrResourceLoader [null] Added 2 libs to classloader, from paths: [/home/jenkins/workspace/Lucene-Solr-8.x-Linux/solr/core/src/test-files/solr/collection1/lib, /home/jenkins/workspace/Lucene-Solr-8.x-Linux/solr/core/src/test-files/solr/collection1/lib/classes]
   [junit4]   2> 2018274 INFO  (coreLoadExecutor-12983-thread-1) [    x:collection1 ] o.a.s.c.SolrConfig Using Lucene MatchVersion: 8.3.0
   [junit4]   2> 2018278 INFO  (coreLoadExecutor-12983-thread-1) [    x:collection1 ] o.a.s.s.IndexSchema [collection1] Schema name=schema-docValuesMulti
   [junit4]   2> 2018281 INFO  (coreLoadExecutor-12983-thread-1) [    x:collection1 ] o.a.s.s.IndexSchema Loaded schema schema-docValuesMulti/1.6 with uniqueid field id
   [junit4]   2> 2018281 INFO  (coreLoadExecutor-12983-thread-1) [    x:collection1 ] o.a.s.c.CoreContainer Creating SolrCore 'collection1' using configuration from instancedir /home/jenkins/workspace/Lucene-Solr-8.x-Linux/solr/core/src/test-files/solr/collection1, trusted=true
   [junit4]   2> 2018281 INFO  (coreLoadExecutor-12983-thread-1) [    x:collection1 ] o.a.s.m.r.SolrJmxReporter JMX monitoring for 'solr.core.collection1' (registry 'solr.core.collection1') enabled at server: com.sun.jmx.mbeanserver.JmxMBeanServer@4574c04a
   [junit4]   2> 2018281 INFO  (coreLoadExecutor-12983-thread-1) [    x:collection1 ] o.a.s.c.SolrCore [[collection1] ] Opening new SolrCore at [/home/jenkins/workspace/Lucene-Solr-8.x-Linux/solr/core/src/test-files/solr/collection1], dataDir=[/home/jenkins/workspace/Lucene-Solr-8.x-Linux/solr/build/solr-core/test/J2/temp/solr.handler.export.TestExportWriter_DB51704BFD0EEEBB-001/init-core-data-001/]
   [junit4]   2> 2018282 INFO  (coreLoadExecutor-12983-thread-1) [    x:collection1 ] o.a.s.u.RandomMergePolicy RandomMergePolicy wrapping class org.apache.lucene.index.TieredMergePolicy: [TieredMergePolicy: maxMergeAtOnce=26, maxMergeAtOnceExplicit=10, maxMergedSegmentMB=97.93359375, floorSegmentMB=0.7392578125, forceMergeDeletesPctAllowed=4.2042465075605975, segmentsPerTier=40.0, maxCFSSegmentSizeMB=8.796093022207999E12, noCFSRatio=1.0, deletesPctAllowed=45.50133032192623
   [junit4]   2> 2018301 INFO  (coreLoadExecutor-12983-thread-1) [    x:collection1 ] o.a.s.u.CommitTracker Hard AutoCommit: disabled
   [junit4]   2> 2018301 INFO  (coreLoadExecutor-12983-thread-1) [    x:collection1 ] o.a.s.u.CommitTracker Soft AutoCommit: disabled
   [junit4]   2> 2018301 INFO  (coreLoadExecutor-12983-thread-1) [    x:collection1 ] o.a.s.u.RandomMergePolicy RandomMergePolicy wrapping class org.apache.lucene.index.MockRandomMergePolicy: org.apache.lucene.index.MockRandomMergePolicy@2ac27070
   [junit4]   2> 2018302 INFO  (coreLoadExecutor-12983-thread-1) [    x:collection1 ] o.a.s.s.SolrIndexSearcher Opening [Searcher@6b0aaae5[collection1] main]
   [junit4]   2> 2018302 WARN  (coreLoadExecutor-12983-thread-1) [    x:collection1 ] o.a.s.r.ManagedResourceStorage Cannot write to config directory /home/jenkins/workspace/Lucene-Solr-8.x-Linux/solr/core/src/test-files/solr/collection1/conf; switching to use InMemory storage instead.
   [junit4]   2> 2018302 INFO  (coreLoadExecutor-12983-thread-1) [    x:collection1 ] o.a.s.h.ReplicationHandler Commits will be reserved for 10000ms.
   [junit4]   2> 2018302 INFO  (searcherExecutor-12984-thread-1-processing-x:collection1) [    x:collection1 ] o.a.s.c.SolrCore [collection1] Registered new searcher Searcher@6b0aaae5[collection1] main{ExitableDirectoryReader(UninvertingDirectoryReader())}
   [junit4]   2> 2018305 INFO  (TEST-TestExportWriter.testEmptyValues-seed#[DB51704BFD0EEEBB]) [     ] o.a.s.u.DirectUpdateHandler2 [collection1] REMOVING ALL DOCUMENTS FROM INDEX
   [junit4]   2> 2018305 INFO  (TEST-TestExportWriter.testEmptyValues-seed#[DB51704BFD0EEEBB]) [     ] o.a.s.u.p.LogUpdateProcessorFactory [collection1]  webapp=null path=null params={}{deleteByQuery=*:*} 0 0
   [junit4]   2> 2018305 INFO  (TEST-TestExportWriter.testEmptyValues-seed#[DB51704BFD0EEEBB]) [     ] o.a.s.u.DirectUpdateHandler2 start commit{,optimize=false,openSearcher=true,waitSearcher=true,expungeDeletes=false,softCommit=false,prepareCommit=false}
   [junit4]   2> 2018305 INFO  (TEST-TestExportWriter.testEmptyValues-seed#[DB51704BFD0EEEBB]) [     ] o.a.s.u.SolrIndexWriter Calling setCommitData with IW:org.apache.solr.update.SolrIndexWriter@7f7003c4 commitCommandVersion:0
   [junit4]   2> 2018306 INFO  (TEST-TestExportWriter.testEmptyValues-seed#[DB51704BFD0EEEBB]) [     ] o.a.s.s.SolrIndexSearcher Opening [Searcher@2308ef89[collection1] main]
   [junit4]   2> 2018306 INFO  (TEST-TestExportWriter.testEmptyValues-seed#[DB51704BFD0EEEBB]) [     ] o.a.s.u.DirectUpdateHandler2 end_commit_flush
   [junit4]   2> 2018306 INFO  (searcherExecutor-12984-thread-1) [     ] o.a.s.c.SolrCore [collection1] Registered new searcher Searcher@2308ef89[collection1] main{ExitableDirectoryReader(UninvertingDirectoryReader())}
   [junit4]   2> 2018307 INFO  (TEST-TestExportWriter.testEmptyValues-seed#[DB51704BFD0EEEBB]) [     ] o.a.s.u.p.LogUpdateProcessorFactory [collection1]  webapp=null path=null params={}{commit=} 0 1
   [junit4]   2> 2018307 INFO  (TEST-TestExportWriter.testEmptyValues-seed#[DB51704BFD0EEEBB]) [     ] o.a.s.u.DirectUpdateHandler2 [collection1] REMOVING ALL DOCUMENTS FROM INDEX
   [junit4]   2> 2018307 INFO  (TEST-TestExportWriter.testEmptyValues-seed#[DB51704BFD0EEEBB]) [     ] o.a.s.u.p.LogUpdateProcessorFactory [collection1]  webapp=null path=null params={}{deleteByQuery=*:*} 0 0
   [junit4]   2> 2018307 INFO  (TEST-TestExportWriter.testEmptyValues-seed#[DB51704BFD0EEEBB]) [     ] o.a.s.u.DirectUpdateHandler2 start commit{,optimize=false,openSearcher=true,waitSearcher=true,expungeDeletes=false,softCommit=false,prepareCommit=false}
   [junit4]   2> 2018307 INFO  (TEST-TestExportWriter.testEmptyValues-seed#[DB51704BFD0EEEBB]) [     ] o.a.s.u.SolrIndexWriter Calling setCommitData with IW:org.apache.solr.update.SolrIndexWriter@7f7003c4 commitCommandVersion:0
   [junit4]   2> 2018307 INFO  (TEST-TestExportWriter.testEmptyValues-seed#[DB51704BFD0EEEBB]) [     ] o.a.s.s.SolrIndexSearcher Opening [Searcher@7febab6d[collection1] main]
   [junit4]   2> 2018307 INFO  (TEST-TestExportWriter.testEmptyValues-seed#[DB51704BFD0EEEBB]) [     ] o.a.s.u.DirectUpdateHandler2 end_commit_flush
   [junit4]   2> 2018308 INFO  (searcherExecutor-12984-thread-1) [     ] o.a.s.c.SolrCore [collection1] Registered new searcher Searcher@7febab6d[collection1] main{ExitableDirectoryReader(UninvertingDirectoryReader())}
   [junit4]   2> 2018308 INFO  (TEST-TestExportWriter.testEmptyValues-seed#[DB51704BFD0EEEBB]) [     ] o.a.s.u.p.LogUpdateProcessorFactory [collection1]  webapp=null path=null params={}{commit=} 0 0
   [junit4]   2> 2018308 INFO  (TEST-TestExportWriter.testEmptyValues-seed#[DB51704BFD0EEEBB]) [     ] o.a.s.u.p.LogUpdateProcessorFactory [collection1]  webapp=null path=null params={}{add=[1]} 0 0
   [junit4]   2> 2018308 INFO  (TEST-TestExportWriter.testEmptyValues-seed#[DB51704BFD0EEEBB]) [     ] o.a.s.u.p.LogUpdateProcessorFactory [collection1]  webapp=null path=null params={}{add=[2]} 0 0
   [junit4]   2> 2018308 INFO  (TEST-TestExportWriter.testEmptyValues-seed#[DB51704BFD0EEEBB]) [     ] o.a.s.u.DirectUpdateHandler2 start commit{,optimize=false,openSearcher=true,waitSearcher=true,expungeDeletes=false,softCommit=false,prepareCommit=false}
   [junit4]   2> 2018308 INFO  (TEST-TestExportWriter.testEmptyValues-seed#[DB51704BFD0EEEBB]) [     ] o.a.s.u.SolrIndexWriter Calling setCommitData with IW:org.apache.solr.update.SolrIndexWriter@7f7003c4 commitCommandVersion:0
   [junit4]   2> 2018309 INFO  (TEST-TestExportWriter.testEmptyValues-seed#[DB51704BFD0EEEBB]) [     ] o.a.s.s.SolrIndexSearcher Opening [Searcher@177e0364[collection1] main]
   [junit4]   2> 2018309 INFO  (TEST-TestExportWriter.testEmptyValues-seed#[DB51704BFD0EEEBB]) [     ] o.a.s.u.DirectUpdateHandler2 end_commit_flush
   [junit4]   2> 2018310 INFO  (searcherExecutor-12984-thread-1) [     ] o.a.s.c.SolrCore [collection1] Registered new searcher Searcher@177e0364[collection1] main{ExitableDirectoryReader(UninvertingDirectoryReader(_0(8.3.0):C2:[diagnostics={os=Linux, java.vendor=AdoptOpenJDK, java.version=11.0.3, java.vm.version=11.0.3+7, lucene.version=8.3.0, os.arch=amd64, java.runtime.version=11.0.3+7, source=flush, os.version=4.18.0-25-generic, timestamp=1564344309008}]:[attributes={Lucene50StoredFieldsFormat.mode=BEST_SPEED}]))}
   [junit4]   2> 2018310 INFO  (TEST-TestExportWriter.testEmptyValues-seed#[DB51704BFD0EEEBB]) [     ] o.a.s.u.p.LogUpdateProcessorFactory [collection1]  webapp=null path=null params={}{commit=} 0 1
   [junit4]   2> 2018310 INFO  (TEST-TestExportWriter.testEmptyValues-seed#[DB51704BFD0EEEBB]) [     ] o.a.s.c.S.Request [collection1]  webapp=null path=null params={q=*:*&qt=/export&fl=id,field2_i_p&sort=field2_i_p+asc&wt=xml} hits=2 status=0 QTime=0
   [junit4]   2> 2018313 INFO  (TEST-TestExportWriter.testIndexOrder-seed#[DB51704BFD0EEEBB]) [     ] o.a.s.u.DirectUpdateHandler2 [collection1] REMOVING ALL DOCUMENTS FROM INDEX
   [junit4]   2> 2018313 INFO  (TEST-TestExportWriter.testIndexOrder-seed#[DB51704BFD0EEEBB]) [     ] o.a.s.u.p.LogUpdateProcessorFactory [collection1]  webapp=null path=null params={}{deleteByQuery=*:*} 0 0
   [junit4]   2> 2018313 INFO  (TEST-TestExportWriter.testIndexOrder-seed#[DB51704BFD0EEEBB]) [     ] o.a.s.u.DirectUpdateHandler2 start commit{,optimize=false,openSearcher=true,waitSearcher=true,expungeDeletes=false,softCommit=false,prepareCommit=false}
   [junit4]   2> 2018313 INFO  (TEST-TestExportWriter.testIndexOrder-seed#[DB51704BFD0EEEBB]) [     ] o.a.s.u.SolrIndexWriter Calling setCommitData with IW:org.apache.solr.update.SolrIndexWriter@7f7003c4 commitCommandVersion:0
   [junit4]   2> 2018313 INFO  (TEST-TestExportWriter.testIndexOrder-seed#[DB51704BFD0EEEBB]) [     ] o.a.s.s.SolrIndexSearcher Opening [Searcher@71152ec6[collection1] main]
   [junit4]   2> 2018313 INFO  (TEST-TestExportWriter.testIndexOrder-seed#[DB51704BFD0EEEBB]) [     ] o.a.s.u.DirectUpdateHandler2 end_commit_flush
   [junit4]   2> 2018314 INFO  (searcherExecutor-12984-thread-1) [     ] o.a.s.c.SolrCore [collection1] Registered new searcher Searcher@71152ec6[collection1] main{ExitableDirectoryReader(UninvertingDirectoryReader())}
   [junit4]   2> 2018314 INFO  (TEST-TestExportWriter.testIndexOrder-seed#[DB51704BFD0EEEBB]) [     ] o.a.s.u.p.LogUpdateProcessorFactory [collection1]  webapp=null path=null params={}{commit=} 0 0
   [junit4]   2> 2018314 INFO  (TEST-TestExportWriter.testIndexOrder-seed#[DB51704BFD0EEEBB]) [     ] o.a.s.u.DirectUpdateHandler2 [collection1] REMOVING ALL DOCUMENTS FROM INDEX
   [junit4]   2> 2018314 INFO  (TEST-TestExportWriter.testIndexOrder-seed#[DB51704BFD0EEEBB]) [     ] o.a.s.u.p.LogUpdateProcessorFactory [collection1]  webapp=null path=null params={_version_=-9223372036854775807&update.distrib=FROMLEADER&versions=true&wt=json&indent=true}{deleteByQuery=*:*} 0 0
   [junit4]   2> 2018314 INFO  (TEST-TestExportWriter.testIndexOrder-seed#[DB51704BFD0EEEBB]) [     ] o.a.s.u.p.LogUpdateProcessorFactory [collection1]  webapp=null path=null params={}{add=[1]} 0 0
   [junit4]   2> 2018314 INFO  (TEST-TestExportWriter.testIndexOrder-seed#[DB51704BFD0EEEBB]) [     ] o.a.s.u.p.LogUpdateProcessorFactory [collection1]  webapp=null path=null params={}{add=[2]} 0 0
   [junit4]   2> 2018315 INFO  (TEST-TestExportWriter.testIndexOrder-seed#[DB51704BFD0EEEBB]) [     ] o.a.s.u.DirectUpdateHandler2 start commit{,optimize=false,openSearcher=true,waitSearcher=true,expungeDeletes=false,softCommit=false,prepareCommit=false}
   [junit4]   2> 2018315 INFO  (TEST-TestExportWriter.testIndexOrder-seed#[DB51704BFD0EEEBB]) [     ] o.a.s.u.SolrIndexWriter Calling setCommitData with IW:org.apache.solr.update.SolrIndexWriter@7f7003c4 commitCommandVersion:0
   [junit4]   2> 2018315 INFO  (TEST-TestExportWriter.testIndexOrder-seed#[DB51704BFD0EEEBB]) [     ] o.a.s.s.SolrIndexSearcher Opening [Searcher@25bce7c5[collection1] main]
   [junit4]   2> 2018315 INFO  (TEST-TestExportWriter.testIndexOrder-seed#[DB51704BFD0EEEBB]) [     ] o.a.s.u.DirectUpdateHandler2 end_commit_flush
   [junit4]   2> 2018316 INFO  (searcherExecutor-12984-thread-1) [     ] o.a.s.c.SolrCore [collection1] Registered new searcher Searcher@25bce7c5[collection1] main{ExitableDirectoryReader(UninvertingDirectoryReader(_1(8.3.0):C2:[diagnostics={os=Linux, java.vendor=AdoptOpenJDK, java.version=11.0.3, java.vm.version=11.0.3+7, lucene.version=8.3.0, os.arch=amd64, java.runtime.version=11.0.3+7, source=flush, os.version=4.18.0-25-generic, timestamp=1564344309015}]:[attributes={Lucene50StoredFieldsFormat.mode=BEST_SPEED}]))}
   [junit4]   2> 2018316 INFO  (TEST-TestExportWriter.testIndexOrder-seed#[DB51704BFD0EEEBB]) [     ] o.a.s.u.p.LogUpdateProcessorFactory [collection1]  webapp=null path=null params={}{commit=} 0 1
   [junit4]   2> 2018316 INFO  (TEST-TestExportWriter.testIndexOrder-seed#[DB51704BFD0EEEBB]) [     ] o.a.s.u.p.LogUpdateProcessorFactory [collection1]  webapp=null path=null params={}{add=[3]} 0 0
   [junit4]   2> 2018316 INFO  (TEST-TestExportWriter.testIndexOrder-seed#[DB51704BFD0EEEBB]) [     ] o.a.s.u.p.LogUpdateProcessorFactory [collection1]  webapp=null path=null params={}{add=[4]} 0 0
   [junit4]   2> 2018316 INFO  (TEST-TestExportWriter.testIndexOrder-seed#[DB51704BFD0EEEBB]) [     ] o.a.s.u.DirectUpdateHandler2 start commit{,optimize=false,openSearcher=true,waitSearcher=true,expungeDeletes=false,softCommit=false,prepareCommit=false}
   [junit4]   2> 2018316 INFO  (TEST-TestExportWriter.testIndexOrder-seed#[DB51704BFD0EEEBB]) [     ] o.a.s.u.SolrIndexWriter Calling setCommitData with IW:org.apache.solr.update.SolrIndexWriter@7f7003c4 commitCommandVersion:0
   [junit4]   2> 2018317 INFO  (TEST-TestExportWriter.testIndexOrder-seed#[DB51704BFD0EEEBB]) [     ] o.a.s.s.SolrIndexSearcher Opening [Searcher@69041c8a[collection1] main]
   [junit4]   2> 2018317 INFO  (TEST-TestExportWriter.testIndexOrder-seed#[DB51704BFD0EEEBB]) [     ] o.a.s.u.DirectUpdateHandler2 end_commit_flush
   [junit4]   2> 2018318 INFO  (searcherExecutor-12984-thread-1) [     ] o.a.s.c.SolrCore [collection1] Registered new searcher Searcher@69041c8a[collection1] main{ExitableDirectoryReader(UninvertingDirectoryReader(_1(8.3.0):C2:[diagnostics={os=Linux, java.vendor=AdoptOpenJDK, java.version=11.0.3, java.vm.version=11.0.3+7, lucene.version=8.3.0, os.arch=amd64, java.runtime.version=11.0.3+7, source=flush, os.version=4.18.0-25-generic, timestamp=1564344309015}]:[attributes={Lucene50StoredFieldsFormat.mode=BEST_SPEED}] _2(8.3.0):C2:[diagnostics={os=Linux, java.vendor=AdoptOpenJDK, java.version=11.0.3, java.vm.version=11.0.3+7, lucene.version=8.3.0, os.arch=amd64, java.runtime.version=11.0.3+7, source=flush, os.version=4.18.0-25-generic, timestamp=1564344309016}]:[attributes={Lucene50StoredFieldsFormat.mode=BEST_SPEED}]))}
   [junit4]   2> 2018318 INFO  (TEST-TestExportWriter.testIndexOrder-seed#[DB51704BFD0EEEBB]) [     ] o.a.s.u.p.LogUpdateProcessorFactory [collection1]  webapp=null path=null params={}{commit=} 0 1
   [junit4]   2> 2018318 INFO  (TEST-TestExportWriter.testIndexOrder-seed#[DB51704BFD0EEEBB]) [     ] o.a.s.c.S.Request [collection1]  webapp=null path=null params={q=*:*&qt=/export&fl=id&sort=stringdv+asc&wt=xml} hits=4 status=0 QTime=0
   [junit4]   2> 2018318 INFO  (TEST-TestExportWriter.testIndexOrder-seed#[DB51704BFD0EEEBB]) [     ] o.a.s.c.S.Request [collection1]  webapp=null path=null params={q=*:*&qt=/export&fl=id&sort=stringdv+desc&wt=xml} hits=4 status=0 QTime=0
   [junit4]   2> 2018321 INFO  (TEST-TestExportWriter.testMultipleSorts-seed#[DB51704BFD0EEEBB]) [     ] o.a.s.u.DirectUpdateHandler2 [collection1] REMOVING ALL DOCUMENTS FROM INDEX
   [junit4]   2> 2018321 INFO  (TEST-TestExportWriter.testMultipleSorts-seed#[DB51704BFD0EEEBB]) [     ] o.a.s.u.p.LogUpdateProcessorFactory [collection1]  webapp=null path=null params={}{deleteByQuery=*:*} 0 0
   [junit4]   2> 2018321 INFO  (TEST-TestExportWriter.testMultipleSorts-seed#[DB51704BFD0EEEBB]) [     ] o.a.s.u.DirectUpdateHandler2 start commit{,optimize=false,openSearcher=true,waitSearcher=true,expungeDeletes=false,softCommit=false,prepareCommit=false}
   [junit4]   2> 2018321 INFO  (TEST-TestExportWriter.testMultipleSorts-seed#[DB51704BFD0EEEBB]) [     ] o.a.s.u.SolrIndexWriter Calling setCommitData with IW:org.apache.solr.update.SolrIndexWriter@7f7003c4 commitCommandVersion:0
   [junit4]   2> 2018321 INFO  (TEST-TestExportWriter.testMultipleSorts-seed#[DB51704BFD0EEEBB]) [     ] o.a.s.s.SolrIndexSearcher Opening [Searcher@74567be7[collection1] main]
   [junit4]   2> 2018321 INFO  (TEST-TestExportWriter.testMultipleSorts-seed#[DB51704BFD0EEEBB]) [     ] o.a.s.u.DirectUpdateHandler2 end_commit_flush
   [junit4]   2> 2018322 INFO  (searcherExecutor-12984-thread-1) [     ] o.a.s.c.SolrCore [collection1] Registered new searcher Searcher@74567be7[collection1] main{ExitableDirectoryReader(UninvertingDirectoryReader())}
   [junit4]   2> 2018322 INFO  (TEST-TestExportWriter.testMultipleSorts-seed#[DB51704BFD0EEEBB]) [     ] o.a.s.u.p.LogUpdateProcessorFactory [collection1]  webapp=null path=null params={}{commit=} 0 1
   [junit4]   2> 2018322 INFO  (TEST-TestExportWriter.testMultipleSorts-seed#[DB51704BFD0EEEBB]) [     ] o.a.s.u.DirectUpdateHandler2 [collection1] REMOVING ALL DOCUMENTS FROM INDEX
   [junit4]   2> 2018322 INFO  (TEST-TestExportWriter.testMultipleSorts-seed#[DB51704BFD0EEEBB]) [     ] o.a.s.u.p.LogUpdateProcessorFactory [collection1]  webapp=null path=null params={}{deleteByQuery=*:*} 0 0
   [junit4]   2> 2018322 INFO  (TEST-TestExportWriter.testMultipleSorts-seed#[DB51704BFD0EEEBB]) [     ] o.a.s.u.DirectUpdateHandler2 start commit{,optimize=false,openSearcher=true,waitSearcher=true,expungeDeletes=false,softCommit=false,prepareCommit=false}
   [junit4]   2> 2018322 INFO  (TEST-TestExportWriter.testMultipleSorts-seed#[DB51704BFD0EEEBB]) [     ] o.a.s.u.SolrIndexWriter Calling setCommitData with IW:org.apache.solr.update.SolrIndexWriter@7f7003c4 commitCommandVersion:0
   [junit4]   2> 2018322 INFO  (TEST-TestExportWriter.testMultipleSorts-seed#[DB51704BFD0EEEBB]) [     ] o.a.s.s.SolrIndexSearcher Opening [Searcher@33d2248b[collection1] main]
   [junit4]   2> 2018323 INFO  (TEST-TestExportWriter.testMultipleSorts-seed#[DB51704BFD0EEEBB]) [     ] o.a.s.u.DirectUpdateHandler2 end_commit_flush
   [junit4]   2> 2018323 INFO  (searcherExecutor-12984-thread-1) [     ] o.a.s.c.SolrCore [collection1] Registered new searcher Searcher@33d2248b[collection1] main{ExitableDirectoryReader(UninvertingDirectoryReader())}
   [junit4]   2> 2018323 INFO  (TEST-TestExportWriter.testMultipleSorts-seed#[DB51704BFD0EEEBB]) [     ] o.a.s.u.p.LogUpdateProcessorFactory [collection1]  webapp=null path=null params={}{commit=} 0 0
   [junit4]   2> 2018324 INFO  (TEST-TestExportWriter.testMultipleSorts-seed#[DB51704BFD0EEEBB]) [     ] o.a.s.u.p.LogUpdateProcessorFactory [collection1]  webapp=null path=null params={}{add=[0]} 0 0
   [junit4]   2> 2018324 INFO  (TEST-TestExportWriter.testMultipleSorts-seed#[DB51704BFD0EEEBB]) [     ] o.a.s.u.p.LogUpdateProcessorFactory [collection1]  webapp=null path=null params={}{add=[1]} 0 0
   [junit4]   2> 2018324 INFO  (TEST-TestExportWriter.testMultipleSorts-seed#[DB51704BFD0EEEBB]) [     ] o.a.s.u.p.LogUpdateProcessorFactory [collection1]  webapp=null path=null params={}{add=[2]} 0 0
   [junit4]   2> 2018324 INFO  (TEST-TestExportWriter.testMultipleSorts-seed#[DB51704BFD0EEEBB]) [     ] o.a.s.u.p.LogUpdateProcessorFactory [collection1]  webapp=null path=null params={}{add=[3]} 0 0
   [junit4]   2> 2018324 INFO  (TEST-TestExportWriter.testMultipleSorts-seed#[DB51704BFD0EEEBB]) [     ] o.a.s.u.p.LogUpdateProcessorFactory [collection1]  webapp=null path=null params={}{add=[4]} 0 0
   [junit4]   2> 2018325 INFO  (TEST-TestExportWriter.testMultipleSorts-seed#[DB51704BFD0EEEBB]) [     ] o.a.s.u.p.LogUpdateProcessorFactory [collection1]  webapp=null path=null params={}{add=[5]} 0 0
   [junit4]   2> 2018325 INFO  (TEST-TestExportWriter.testMultipleSorts-seed#[DB51704BFD0EEEBB]) [     ] o.a.s.u.p.LogUpdateProcessorFactory [collection1]  webapp=null path=null params={}{add=[6]} 0 0
   [junit4]   2> 2018325 INFO  (TEST-TestExportWriter.testMultipleSorts-seed#[DB51704BFD0EEEBB]) [     ] o.a.s.u.p.LogUpdateProcessorFactory [collection1]  webapp=null path=null params={}{add=[7]} 0 0
   [junit4]   2> 2018325 INFO  (TEST-TestExportWriter.testMultipleSorts-seed#[DB51704BFD0EEEBB]) [     ] o.a.s.u.p.LogUpdateProcessorFactory [collection1]  webapp=null path=null params={}{add=[8]} 0 0
   [junit4]   2> 2018325 INFO  (TEST-TestExportWriter.testMultipleSorts-seed#[DB51704BFD0EEEBB]) [     ] o.a.s.u.p.LogUpdateProcessorFactory [collection1]  webapp=null path=null params={}{add=[9]} 0 0
   [junit4]   2> 2018325 INFO  (TEST-TestExportWriter.testMultipleSorts-seed#[DB51704BFD0EEEBB]) [     ] o.a.s.u.p.LogUpdateProcessorFactory [collection1]  webapp=null path=null params={}{add=[10]} 0 0
   [junit4]   2> 2018326 INFO  (TEST-TestExportWriter.testMultipleSorts-seed#[DB51704BFD0EEEBB]) [     ] o.a.s.u.p.LogUpdateProcessorFactory [collection1]  webapp=null path=null params={}{add=[11]} 0 0
   [junit4]   2> 2018326 INFO  (TEST-TestExportWriter.testMultipleSorts-seed#[DB51704BFD0EEEBB]) [     ] o.a.s.u.p.LogUpdateProcessorFactory [collection1]  webapp=null path=null params={}{add=[12]} 0 0
   [junit4]   2> 2018326 INFO  (TEST-TestExportWriter.testMultipleSorts-seed#[DB51704BFD0EEEBB]) [     ] o.a.s.u.p.LogUpdateProcessorFactory [collection1]  webapp=null path=null params={}{add=[13]} 0 0
   [junit4]   2> 2018326 INFO  (TEST-TestExportWriter.testMultipleSorts-seed#[DB51704BFD0EEEBB]) [     ] o.a.s.u.p.LogUpdateProcessorFactory [collection1]  webapp=null path=null params={}{add=[14]} 0 0
   [junit4]   2> 2018326 INFO  (TEST-TestExportWriter.testMultipleSorts-seed#[DB51704BFD0EEEBB]) [     ] o.a.s.u.p.LogUpdateProcessorFactory [collection1]  webapp=null path=null params={}{add=[15]} 0 0
   [junit4]   2> 2018326 INFO  (TEST-TestExportWriter.testMultipleSorts-seed#[DB51704BFD0EEEBB]) [     ] o.a.s.u.p.LogUpdateProcessorFactory [collection1]  webapp=null path=null params={}{add=[16]} 0 0
   [junit4]   2> 2018327 INFO  (TEST-TestExportWriter.testMultipleSorts-seed#[DB51704BFD0EEEBB]) [     ] o.a.s.u.p.LogUpdateProcessorFactory [collection1]  webapp=null path=null params={}{add=[17]} 0 0
   [junit4]   2> 2018327 INFO  (TEST-TestExportWriter.testMultipleSorts-seed#[DB51704BFD0EEEBB]) [     ] o.a.s.u.p.LogUpdateProcessorFactory [collection1]  webapp=null path=null params={}{add=[18]} 0 0
   [junit4]   2> 2018327 INFO  (TEST-TestExportWriter.testMultipleSorts-seed#[DB51704BFD0EEEBB]) [     ] o.a.s.u.p.LogUpdateProcessorFactory [collection1]  webapp=null path=null params={}{add=[19]} 0 0
   [junit4]   2> 2018327 INFO  (TEST-TestExportWriter.testMultipleSorts-seed#[DB51704BFD0EEEBB]) [     ] o.a.s.u.p.LogUpdateProcessorFactory [collection1]  webapp=null path=null params={}{add=[20]} 0 0
   [junit4]   2> 2018327 INFO  (TEST-TestExportWriter.testMultipleSorts-seed#[DB51704BFD0EEEBB]) [     ] o.a.s.u.p.LogUpdateProcessorFactory [collection1]  webapp=null path=null params={}{add=[21]} 0 0
   [junit4]   2> 2018327 INFO  (TEST-TestExportWriter.testMultipleSorts-seed#[DB51704BFD0EEEBB]) [     ] o.a.s.u.p.LogUpdateProcessorFactory [collection1]  webapp=null path=null params={}{add=[22]} 0 0
   [junit4]   2> 2018328 INFO  (TEST-TestExportWriter.testMultipleSorts-seed#[DB51704BFD0EEEBB]) [     ] o.a.s.u.p.LogUpdateProcessorFactory [collection1]  webapp=null path=null params={}{add=[23]} 0 0
   [junit4]   2> 2018328 INFO  (TEST-TestExportWriter.testMultipleSorts-seed#[DB51704BFD0EEEBB]) [     ] o.a.s.u.p.LogUpdateProcessorFactory [collection1]  webapp=null path=null params={}{add=[24]} 0 0
   [junit4]   2> 2018328 INFO  (TEST-TestExportWriter.testMultipleSorts-seed#[DB51704BFD0EEEBB]) [     ] o.a.s.u.p.LogUpdateProcessorFactory [collection1]  webapp=null path=null params={}{add=[25]} 0 0
   [junit4]   2> 2018328 INFO  (TEST-TestExportWriter.testMultipleSorts-seed#[DB51704BFD0EEEBB]) [     ] o.a.s.u.p.LogUpdateProcessorFactory [collection1]  webapp=null path=null params={}{add=[26]} 0 0
   [junit4]   2> 2018328 INFO  (TEST-TestExportWriter.testMultipleSorts-seed#[DB51704BFD0EEEBB]) [     ] o.a.s.u.p.LogUpdateProcessorFactory [collection1]  webapp=null path=null params={}{add=[27]} 0 0
   [junit4]   2> 2018328 INFO  (TEST-TestExportWriter.testMultipleSorts-seed#[DB51704BFD0EEEBB]) [     ] o.a.s.u.p.LogUpdateProcessorFactory [collection1]  webapp=null path=null params={}{add=[28]} 0 0
   [junit4]   2> 2018329 INFO  (TEST-TestExportWriter.testMultipleSorts-seed#[DB51704BFD0EEEBB]) [     ] o.a.s.u.p.LogUpdateProcessorFactory [collection1]  webapp=null path=null params={}{add=[29]} 0 0
   [junit4]   2> 2018329 INFO  (TEST-TestExportWriter.testMultipleSorts-seed#[DB51704BFD0EEEBB]) [     ] o.a.s.u.p.LogUpdateProcessorFactory [collection1]  webapp=null path=null params={}{add=[30]} 0 0
   [junit4]   2> 2018329 INFO  (TEST-TestExportWriter.testMultipleSorts-seed#[DB51704BFD0EEEBB]) [     ] o.a.s.u.p.LogUpdateProcessorFactory [collection1]  webapp=null path=null params={}{add=[31]} 0 0
   [junit4]   2> 2018329 INFO  (TEST-TestExportWriter.testMultipleSorts-seed#[DB51704BFD0EEEBB]) [     ] o.a.s.u.p.LogUpdateProcessorFactory [collection1]  webapp=null path=null params={}{add=[32]} 0 0
   [junit4]   2> 2018329 INFO  (TEST-TestExportWriter.testMultipleSorts-seed#[DB51704BFD0EEEBB]) [     ] o.a.s.u.p.LogUpdateProcessorFactory [collection1]  webapp=null path=null params={}{add=[33]} 0 0
   [junit4]   2> 2018329 INFO  (TEST-TestExportWriter.testMultipleSorts-seed#[DB51704BFD0EEEBB]) [     ] o.a.s.u.p.LogUpdateProcessorFactory [collection1]  webapp=null path=null params={}{add=[34]} 0 0
   [junit4]   2> 2018329 INFO  (TEST-TestExportWriter.testMultipleSorts-seed#[DB51704BFD0EEEBB]) [     ] o.a.s.u.p.LogUpdateProcessorFactory [collection1]  webapp=null path=null params={}{add=[35]} 0 0
   [junit4]   2> 2018330 INFO  (TEST-TestExportWriter.testMultipleSorts-seed#[DB51704BFD0EEEBB]) [     ] o.a.s.u.p.LogUpdateProcessorFactory [collection1]  webapp=null path=null params={}{add=[36]} 0 0
   [junit4]   2> 2018330 INFO  (TEST-TestExportWriter.testMultipleSorts-seed#[DB51704BFD0EEEBB]) [     ] o.a.s.u.p.LogUpdateProcessorFactory [collection1]  webapp=null path=null params={}{add=[37]} 0 0
   [junit4]   2> 2018330 INFO  (TEST-TestExportWriter.testMultipleSorts-seed#[DB51704BFD0EEEBB]) [     ] o.a.s.u.p.LogUpdateProcessorFactory [collection1]  webapp=null path=null params={}{add=[38]} 0 0
   [junit4]   2> 2018330 INFO  (TEST-TestExportWriter.testMultipleSorts-seed#[DB51704BFD0EEEBB]) [     ] o.a.s.u.p.LogUpdateProcessorFactory [collection1]  webapp=null path=null params={}{add=[39]} 0 0
   [junit4]   2> 2018334 INFO  (TEST-TestExportWriter.testMultipleSorts-seed#[DB51704BFD0EEEBB]) [     ] o.a.s.u.p.LogUpdateProcessorFactory [collection1]  webapp=null path=null params={}{add=[40]} 0 0
   [junit4]   2> 2018334 INFO  (TEST-TestExportWriter.testMultipleSorts-seed#[DB51704BFD0EEEBB]) [     ] o.a.s.u.p.LogUpdateProcessorFactory [collection1]  webapp=null path=null params={}{add=[41]} 0 0
   [junit4]   2> 2018334 INFO  (TEST-TestExportWriter.testMultipleSorts-seed#[DB51704BFD0EEEBB]) [     ] o.a.s.u.p.LogUpdateProcessorFactory [collection1]  webapp=null path=null params={}{add=[42]} 0 0
   [junit4]   2> 2018334 INFO  (TEST-TestExportWriter.testMultipleSorts-seed#[DB51704BFD0EEEBB]) [     ] o.a.s.u.p.LogUpdateProcessorFactory [collection1]  webapp=null path=null params={}{add=[43]} 0 0
   [junit4]   2> 2018335 INFO  (TEST-TestExportWriter.testMultipleSorts-seed#[DB51704BFD0EEEBB]) [     ] o.a.s.u.p.LogUpdateProcessorFactory [collection1]  webapp=null path=null params={}{add=[44]} 0 0
   [junit4]   2> 2018335 INFO  (TEST-TestExportWriter.testMultipleSorts-seed#[DB51704BFD0EEEBB]) [     ] o.a.s.u.p.LogUpdateProcessorFactory [collection1]  webapp=null path=null params={}{add=[45]} 0 0
   [junit4]   2> 2018335 INFO  (TEST-TestExportWriter.testMultipleSorts-seed#[DB51704BFD0EEEBB]) [     ] o.a.s.u.p.LogUpdateProcessorFactory [collection1]  webapp=null path=null params={}{add=[46]} 0 0
   [junit4]   2> 2018335 INFO  (TEST-TestExportWriter.testMultipleSorts-seed#[DB51704BFD0EEEBB]) [     ] o.a.s.u.p.LogUpdateProcessorFactory [collection1]  webapp=null path=null params={}{add=[47]} 0 0
   [junit4]   2> 2018335 INFO  (TEST-TestExportWriter.testMultipleSorts-seed#[DB51704BFD0EEEBB]) [     ] o.a.s.u.p.LogUpdateProcessorFactory [collection1]  webapp=null path=null params={}{add=[48]} 0 0
   [junit4]   2> 2018335 INFO  (TEST-TestExportWriter.testMultipleSorts-seed#[DB51704BFD0EEEBB]) [     ] o.a.s.u.p.LogUpdateProcessorFactory [collection1]  webapp=null path=null params={}{add=[49]} 0 0
   [junit4]   2> 2018335 INFO  (TEST-TestExportWriter.testMultipleSorts-seed#[DB51704BFD0EEEBB]) [     ] o.a.s.u.p.LogUpdateProcessorFactory [collection1]  webapp=null path=null params={}{add=[50]} 0 0
   [junit4]   2> 2018335 INFO  (TEST-TestExportWriter.testMultipleSorts-seed#[DB51704BFD0EEEBB]) [     ] o.a.s.u.p.LogUpdateProcessorFactory [collection1]  webapp=null path=null params={}{add=[51]} 0 0
   [junit4]   2> 2018335 INFO  (TEST-TestExportWriter.testMultipleSorts-seed#[DB51704BFD0EEEBB]) [     ] o.a.s.u.p.LogUpdateProcessorFactory [collection1]  webapp=null path=null params={}{add=[52]} 0 0
   [junit4]   2> 2018335 INFO  (TEST-TestExportWriter.testMultipleSorts-seed#[DB51704BFD0EEEBB]) [     ] o.a.s.u.p.LogUpdateProcessorFactory [collection1]  webapp=null path=null params={}{add=[53]} 0 0
   [junit4]   2> 2018336 INFO  (TEST-TestExportWriter.testMultipleSorts-seed#[DB51704BFD0EEEBB]) [     ] o.a.s.u.p.LogUpdateProcessorFactory [collection1]  webapp=null path=null params={}{add=[54]} 0 0
   [junit4]   2> 2018336 INFO  (TEST-TestExportWriter.testMultipleSorts-seed#[DB51704BFD0EEEBB]) [     ] o.a.s.u.p.LogUpdateProcessorFactory [collection1]  webapp=null path=null params={}{add=[55]} 0 0
   [junit4]   2> 2018336 INFO  (TEST-TestExportWriter.testMultipleSorts-seed#[DB51704BFD0EEEBB]) [     ] o.a.s.u.p.LogUpdateProcessorFactory [collection1]  webapp=null path=null params={}{add=[56]} 0 0
   [junit4]   2> 2018336 INFO  (TEST-TestExportWriter.testMultipleSorts-seed#[DB51704BFD0EEEBB]) [     ] o.a.s.u.p.LogUpdateProcessorFactory [collection1]  webapp=null path=null params={}{add=[57]} 0 0
   [junit4]   2> 2018336 INFO  (TEST-TestExportWriter.testMultipleSorts-seed#[DB51704BFD0EEEBB]) [     ] o.a.s.u.p.LogUpdateProcessorFactory [collection1]  webapp=null path=null params={}{add=[58]} 0 0
   [junit4]   2> 2018336 INFO  (TEST-TestExportWriter.testMultipleSorts-seed#[DB51704BFD0EEEBB]) [     ] o.a.s.u.p.LogUpdateProcessorFactory [collection1]  webapp=null path=null params={}{add=[59]} 0 0
   [junit4]   2> 2018336 INFO  (TEST-TestExportWriter.testMultipleSorts-seed#[DB51704BFD0EEEBB]) [     ] o.a.s.u.p.LogUpdateProcessorFactory [collection1]  webapp=null path=null params={}{add=[60]} 0 0
   [junit4]   2> 2018336 INFO  (TEST-TestExportWriter.testMultipleSorts-seed#[DB51704BFD0EEEBB]) [     ] o.a.s.u.p.LogUpdateProcessorFactory [collection1]  webapp=null path=null params={}{add=[61]} 0 0
   [junit4]   2> 2018336 INFO  (TEST-TestExportWriter.testMultipleSorts-seed#[DB51704BFD0EEEBB]) [     ] o.a.s.u.p.LogUpdateProcessorFactory [collection1]  webapp=null path=null params={}{add=[62]} 0 0
   [junit4]   2> 2018336 INFO  (TEST-TestExportWriter.testMultipleSorts-seed#[DB51704BFD0EEEBB]) [     ] o.a.s.u.p.LogUpdateProcessorFactory [collection1]  webapp=null path=null params={}{add=[63]} 0 0
   [junit4]   2> 2018337 INFO  (TEST-TestExportWriter.testMultipleSorts-seed#[DB51704BFD0EEEBB]) [     ] o.a.s.u.p.LogUpdateProcessorFactory [collection1]  webapp=null path=null params={}{add=[64]} 0 0
   [junit4]   2> 2018337 INFO  (TEST-TestExportWriter.testMultipleSorts-seed#[DB51704BFD0EEEBB]) [     ] o.a.s.u.p.LogUpdateProcessorFactory [collection1]  webapp=null path=null params={}{add=[65]} 0 0
   [junit4]   2> 2018337 INFO  (TEST-TestExportWriter.testMultipleSorts-seed#[DB51704BFD0EEEBB]) [     ] o.a.s.u.p.LogUpdateProcessorFactory [collection1]  webapp=null path=null params={}{add=[66]} 0 0
   [junit4]   2> 2018337 INFO  (TEST-TestExportWriter.testMultipleSorts-seed#[DB51704BFD0EEEBB]) [     ] o.a.s.u.p.LogUpdateProcessorFactory [collection1]  webapp=null path=null params={}{add=[67]} 0 0
   [junit4]   2> 2018337 INFO  (TEST-TestExportWriter.testMultipleSorts-seed#[DB51704BFD0EEEBB]) [     ] o.a.s.u.p.LogUpdateProcessorFactory [collection1]  webapp=null path=null params={}{add=[68]} 0 0
   [junit4]   2> 2018337 INFO  (TEST-TestExportWriter.testMultipleSorts-seed#[DB51704BFD0EEEBB]) [     ] o.a.s.u.p.LogUpdateProcessorFactory [collection1]  webapp=null path=null params={}{add=[69]} 0 0
   [junit4]   2> 2018337 INFO  (TEST-TestExportWriter.testMultipleSorts-seed#[DB51704BFD0EEEBB]) [     ] o.a.s.u.p.LogUpdateProcessorFactory [collection1]  webapp=null path=null params={}{add=[70]} 0 0
   [junit4]   2> 2018337 INFO  (TEST-TestExportWriter.testMultipleSorts-seed#[DB51704BFD0EEEBB]) [     ] o.a.s.u.p.LogUpdateProcessorFactory [collection1]  webapp=null path=null params={}{add=[71]} 0 0
   [junit4]   2> 2018337 INFO  (TEST-TestExportWriter.testMultipleSorts-seed#[DB51704BFD0EEEBB]) [     ] o.a.s.u.p.LogUpdateProcessorFactory [collection1]  webapp=null path=null params={}{add=[72]} 0 0
   [junit4]   2> 2018337 INFO  (TEST-TestExportWriter.testMultipleSorts-seed#[DB51704BFD0EEEBB]) [     ] o.a.s.u.p.LogUpdateProcessorFactory [collection1]  webapp=null path=null params={}{add=[73]} 0 0
   [junit4]   2> 2018338 INFO  (TEST-TestExportWriter.testMultipleSorts-seed#[DB51704BFD0EEEBB]) [     ] o.a.s.u.p.LogUpdateProcessorFactory [collection1]  webapp=null path=null params={}{add=[74]} 0 0
   [junit4]   2> 2018338 INFO  (TEST-TestExportWriter.testMultipleSorts-seed#[DB51704BFD0EEEBB]) [     ] o.a.s.u.p.LogUpdateProcessorFactory [collection1]  webapp=null path=null params={}{add=[75]} 0 0
   [junit4]   2> 2018338 INFO  (TEST-TestExportWriter.testMultipleSorts-seed#[DB51704BFD0EEEBB]) [     ] o.a.s.u.p.LogUpdateProcessorFactory [collection1]  webapp=null path=null params={}{add=[76]} 0 0
   [junit4]   2> 2018338 INFO  (TEST-TestExportWriter.testMultipleSorts-seed#[DB51704BFD0EEEBB]) [     ] o.a.s.u.p.LogUpdateProcessorFactory [collection1]  webapp=null path=null params={}{add=[77]} 0 0
   [junit4]   2> 2018338 INFO  (TEST-TestExportWriter.testMultipleSorts-seed#[DB51704BFD0EEEBB]) [     ] o.a.s.u.p.LogUpdateProcessorFactory [collection1]  webapp=null path=null params={}{add=[78]} 0 0
   [junit4]   2> 2018338 INFO  (TEST-TestExportWriter.testMultipleSorts-seed#[DB51704BFD0EEEBB]) [     ] o.a.s.u.p.LogUpdateProcessorFactory [collection1]  webapp=null path=null params={}{add=[79]} 0 0
   [junit4]   2> 2018338 INFO  (TEST-TestExportWriter.testMultipleSorts-seed#[DB51704BFD0EEEBB]) [     ] o.a.s.u.p.LogUpdateProcessorFactory [collection1]  webapp=null path=null params={}{add=[80]} 0 0
   [junit4]   2> 2018338 INFO  (TEST-TestExportWriter.testMultipleSorts-seed#[DB51704BFD0EEEBB]) [     ] o.a.s.u.p.LogUpdateProcessorFactory [collection1]  webapp=null path=null params={}{add=[81]} 0 0
   [junit4]   2> 2018338 INFO  (TEST-TestExportWriter.testMultipleSorts-seed#[DB51704BFD0EEEBB]) [     ] o.a.s.u.p.LogUpdateProcessorFactory [collection1]  webapp=null path=null params={}{add=[82]} 0 0
   [junit4]   2> 2018338 INFO  (TEST-TestExportWriter.testMultipleSorts-seed#[DB51704BFD0EEEBB]) [     ] o.a.s.u.p.LogUpdateProcessorFactory [collection1]  webapp=null path=null params={}{add=[83]} 0 0
   [junit4]   2> 2018339 INFO  (TEST-TestExportWriter.testMultipleSorts-seed#[DB51704BFD0EEEBB]) [     ] o.a.s.u.p.LogUpdateProcessorFactory [collection1]  webapp=null path=null params={}{add=[84]} 0 0
   [junit4]   2> 2018339 INFO  (TEST-TestExportWriter.testMultipleSorts-seed#[DB51704BFD0EEEBB]) [     ] o.a.s.u.p.LogUpdateProcessorFactory [collection1]  webapp=null path=null params={}{add=[85]} 0 0
   [junit4]   2> 2018339 INFO  (TEST-TestExportWriter.testMultipleSorts-seed#[DB51704BFD0EEEBB]) [     ] o.a.s.u.p.LogUpdateProcessorFactory [collection1]  webapp=null path=null params={}{add=[86]} 0 0
   [junit4]   2> 2018339 INFO  (TEST-TestExportWriter.testMultipleSorts-seed#[DB51704BFD0EEEBB]) [     ] o.a.s.u.p.LogUpdateProcessorFactory [collection1]  webapp=null path=null params={}{add=[87]} 0 0
   [junit4]   2> 2018339 INFO  (TEST-TestExportWriter.testMultipleSorts-seed#[DB51704BFD0EEEBB]) [     ] o.a.s.u.p.LogUpdateProcessorFactory [collection1]  webapp=null path=null params={}{add=[88]} 0 0
   [junit4]   2> 2018339 INFO  (TEST-TestExportWriter.testMultipleSorts-seed#[DB51704BFD0EEEBB]) [     ] o.a.s.u.p.LogUpdateProcessorFactory [collection1]  webapp=null path=null params={}{add=[89]} 0 0
   [junit4]   2> 2018339 INFO  (TEST-TestExportWriter.testMultipleSorts-seed#[DB51704BFD0EEEBB]) [     ] o.a.s.u.p.LogUpdateProcessorFactory [collection1]  webapp=null path=null params={}{add=[90]} 0 0
   [junit4]   2> 2018339 INFO  (TEST-TestExportWriter.testMultipleSorts-seed#[DB51704BFD0EEEBB]) [     ] o.a.s.u.p.LogUpdateProcessorFactory [collection1]  webapp=null path=null params={}{add=[91]} 0 0
   [junit4]   2> 2018339 INFO  (TEST-TestExportWriter.testMultipleSorts-seed#[DB51704BFD0EEEBB]) [     ] o.a.s.u.p.LogUpdateProcessorFactory [collection1]  webapp=null path=null params={}{add=[92]} 0 0
   [junit4]   2> 2018339 INFO  (TEST-TestExportWriter.testMultipleSorts-seed#[DB51704BFD0EEEBB]) [     ] o.a.s.u.p.LogUpdateProcessorFactory [collection1]  webapp=null path=null params={}{add=[93]} 0 0
   [junit4]   2> 2018340 INFO  (TEST-TestExportWriter.testMultipleSorts-seed#[DB51704BFD0EEEBB]) [     ] o.a.s.u.p.LogUpdateProcessorFactory [collection1]  webapp=null path=null params={}{add=[94]} 0 0
   [junit4]   2> 2018340 INFO  (TEST-TestExportWriter.testMultipleSorts-seed#[DB51704BFD0EEEBB]) [     ] o.a.s.u.p.LogUpdateProcessorFactory [collection1]  webapp=null path=null params={}{add=[95]} 0 0
   [junit4]   2> 2018340 INFO  (TEST-TestExportWriter.testMultipleSorts-seed#[DB51704BFD0EEEBB]) [     ] o.a.s.u.p.LogUpdateProcessorFactory [collection1]  webapp=null path=null params={}{add=[96]} 0 0
   [junit4]   2> 2018340 INFO  (TEST-TestExportWriter.testMultipleSorts-seed#[DB51704BFD0EEEBB]) [     ] o.a.s.u.p.LogUpdateProcessorFactory [collection1]  webapp=null path=null params={}{add=[97]} 0 0
   [junit4]   2> 2018340 INFO  (TEST-TestExportWriter.testMultipleSorts-seed#[DB51704BFD0EEEBB]) [     ] o.a.s.u.p.LogUpdateProcessorFactory [collection1]  webapp=null path=null params={}{add=[98]} 0 0
   [junit4]   2> 2018340 INFO  (TEST-TestExportWriter.testMultipleSorts-seed#[DB51704BFD0EEEBB]) [     ] o.a.s.u.p.LogUpdateProcessorFactory [collection1]  webapp=null path=null params={}{add=[99]} 0 0
   [junit4]   2> 2018340 INFO  (TEST-TestExportWriter.testMultipleSorts-seed#[DB51704BFD0EEEBB]) [     ] o.a.s.u.p.LogUpdateProcessorFactory [collection1]  webapp=null path=null params={}{add=[100]} 0 0
   [junit4]   2> 2018340 INFO  (TEST-TestExportWriter.testMultipleSorts-seed#[DB51704BFD0EEEBB]) [     ] o.a.s.u.p.LogUpdateProcessorFactory [collection1]  webapp=null path=null params={}{add=[101]} 0 0
   [junit4]   2> 2018340 INFO  (TEST-TestExportWriter.testMultipleSorts-seed#[DB51704BFD0EEEBB]) [     ] o.a.s.u.p.LogUpdateProcessorFactory [collection1]  webapp=null path=null params={}{add=[102]} 0 0
   [junit4]   2> 2018340 INFO  (TEST-TestExportWriter.testMultipleSorts-seed#[DB51704BFD0EEEBB]) [     ] o.a.s.u.p.LogUpdateProcessorFactory [collection1]  webapp=null path=null params={}{add=[103]} 0 0
   [junit4]   2> 2018341 INFO  (TEST-TestExportWriter.testMultipleSorts-seed#[DB51704BFD0EEEBB]) [     ] o.a.s.u.p.LogUpdateProcessorFactory [collection1]  webapp=null path=null params={}{add=[104]} 0 0
   [junit4]   2> 2018341 INFO  (TEST-TestExportWriter.testMultipleSorts-seed#[DB51704BFD0EEEBB]) [     ] o.a.s.u.p.LogUpdateProcessorFactory [collection1]  webapp=null path=null params={}{add=[105]} 0 0
   [junit4]   2> 2018341 INFO  (TEST-TestExportWriter.testMultipleSorts-seed#[DB51704BFD0EEEBB]) [     ] o.a.s.u.p.LogUpdateProcessorFactory [collection1]  webapp=null path=null params={}{add=[106]} 0 0
   [junit4]   2> 2018341 INFO  (TEST-TestExportWriter.testMultipleSorts-seed#[DB51704BFD0EEEBB]) [     ] o.a.s.u.p.LogUpdateProcessorFactory [collection1]  webapp=null path=null params={}{add=[107]} 0 0
   [junit4]   2> 2018341 INFO  (TEST-TestExportWriter.testMultipleSorts-seed#[DB51704BFD0EEEBB]) [     ] o.a.s.u.p.LogUpdateProcessorFactory [collection1]  webapp=null path=null params={}{add=[108]} 0 0
   [junit4]   2> 2018341 INFO  (TEST-TestExportWriter.testMultipleSorts-seed#[DB51704BFD0EEEBB]) [     ] o.a.s.u.p.LogUpdateProcessorFactory [collection1]  webapp=null path=null params={}{add=[109]} 0 0
   [junit4]   2> 2018341 INFO  (TEST-TestExportWriter.testMultipleSorts-seed#[DB51704BFD0EEEBB]) [     ] o.a.s.u.p.LogUpdateProcessorFactory [collection1]  webapp=null path=null params={}{add=[110]} 0 0
   [junit4]   2> 2018341 INFO  (TEST-TestExportWriter.testMultipleSorts-seed#[DB51704BFD0EEEBB]) [     ] o.a.s.u.p.LogUpdateProcessorFactory [collection1]  webapp=null path=null params={}{add=[111]} 0 0
   [junit4]   2> 2018341 INFO  (TEST-TestExportWriter.testMultipleSorts-seed#[DB51704BFD0EEEBB]) [     ] o.a.s.u.p.LogUpdateProcessorFactory [collection1]  webapp=null path=null params={}{add=[112]} 0 0
   [junit4]   2> 2018342 INFO  (TEST-TestExportWriter.testMultipleSorts-seed#[DB51704BFD0EEEBB]) [     ] o.a.s.u.p.LogUpdateProcessorFactory [collection1]  webapp=null path=null params={}{add=[113]} 0 0
   [junit4]   2> 2018342 INFO  (TEST-TestExportWriter.testMultipleSorts-seed#[DB51704BFD0EEEBB]) [     ] o.a.s.u.p.LogUpdateProcessorFactory [collection1]  webapp=null path=null params={}{add=[114]} 0 0
   [junit4]   2> 2018342 INFO  (TEST-TestExportWriter.testMultipleSorts-seed#[DB51704BFD0EEEBB]) [     ] o.a.s.u.p.LogUpdateProcessorFactory [collection1]  webapp=null path=null params={}{add=[115]} 0 0
   [junit4]   2> 2018342 INFO  (TEST-TestExportWriter.testMultipleSorts-seed#[DB51704BFD0EEEBB]) [     ] o.a.s.u.p.LogUpdateProcessorFactory [collection1]  webapp=null path=null params={}{add=[116]} 0 0
   [junit4]   2> 2018342 INFO  (TEST-TestExportWriter.testMultipleSorts-seed#[DB51704BFD0EEEBB]) [     ] o.a.s.u.p.LogUpdateProcessorFactory [collection1]  webapp=null path=null params={}{add=[117]} 0 0
   [junit4]   2> 2018342 INFO  (TEST-TestExportWriter.testMultipleSorts-seed#[DB51704BFD0EEEBB]) [     ] o.a.s.u.p.LogUpdateProcessorFactory [collection1]  webapp=null path=null params={}{add=[118]} 0 0
   [junit4]   2> 2018342 INFO  (TEST-TestExportWriter.testMultipleSorts-seed#[DB51704BFD0EEEBB]) [     ] o.a.s.u.p.LogUpdateProcessorFactory [collection1]  webapp=null path=null params={}{add=[119]} 0 0
   [junit4]   2> 2018342 INFO  (TEST-TestExportWriter.testMultipleSorts-seed#[DB51704BFD0EEEBB]) [     ] o.a.s.u.p.LogUpdateProcessorFactory [collection1]  webapp=null path=null params={}{add=[120]} 0 0
   [junit4]   2> 2018342 INFO  (TEST-TestExportWriter.testMultipleSorts-seed#[DB51704BFD0EEEBB]) [     ] o.a.s.u.p.LogUpdateProcessorFactory [collection1]  webapp=null path=null params={}{add=[121]} 0 0
   [junit4]   2> 2018343 INFO  (TEST-TestExportWriter.testMultipleSorts-seed#[DB51704BFD0EEEBB]) [     ] o.a.s.u.p.LogUpdateProcessorFactory [collection1]  webapp=null path=null params={}{add=[122]} 0 0
   [junit4]   2> 2018343 INFO  (TEST-TestExportWriter.testMultipleSorts-seed#[DB51704BFD0EEEBB]) [     ] o.a.s.u.p.LogUpdateProcessorFactory [collection1]  webapp=null path=null params={}{add=[123]} 0 0
   [junit4]   2> 2018343 INFO  (TEST-TestExportWriter.testMultipleSorts-seed#[DB51704BFD0EEEBB]) [     ] o.a.s.u.p.LogUpdateProcessorFactory [collection1]  webapp=null path=null params={}{add=[124]} 0 0
   [junit4]   2> 2018343 INFO  (TEST-TestExportWriter.testMultipleSorts-seed#[DB51704BFD0EEEBB]) [     ] o.a.s.u.p.LogUpdateProcessorFactory [collection1]  webapp=null path=null params={}{add=[125]} 0 0
   [junit4]   2> 2018343 INFO  (TEST-TestExportWriter.testMultipleSorts-seed#[DB51704BFD0EEEBB]) [     ] o.a.s.u.p.LogUpdateProcessorFactory [collection1]  webapp=null path=null params={}{add=[126]} 0 0
   [junit4]   2> 2018343 INFO  (TEST-TestExportWriter.testMultipleSorts-seed#[DB51704BFD0EEEBB]) [     ] o.a.s.u.p.LogUpdateProcessorFactory [collection1]  webapp=null path=null params={}{add=[127]} 0 0
   [junit4]   2> 2018343 INFO  (TEST-TestExportWriter.testMultipleSorts-seed#[DB51704BFD0EEEBB]) [     ] o.a.s.u.p.LogUpdateProcessorFactory [collection1]  webapp=null path=null params={}{add=[128]} 0 0
   [junit4]   2> 2018343 INFO  (TEST-TestExportWriter.testMultipleSorts-seed#[DB51704BFD0EEEBB]) [     ] o.a.s.u.p.LogUpdateProcessorFactory [collection1]  webapp=null path=null params={}{add=[129]} 0 0
   [junit4]   2> 2018344 INFO  (TEST-TestExportWriter.testMultipleSorts-seed#[DB51704BFD0EEEBB]) [     ] o.a.s.u.p.LogUpdateProcessorFactory [collection1]  webapp=null path=null params={}{add=[130]} 0 0
   [junit4]   2> 2018344 INFO  (TEST-TestExportWriter.testMultipleSorts-seed#[DB51704BFD0EEEBB]) [     ] o.a.s.u.p.LogUpdateProcessorFactory [collection1]  webapp=null path=null params={}{add=[131]} 0 0
   [junit4]   2> 2018344 INFO  (TEST-TestExportWriter.testMultipleSorts-seed#[DB51704BFD0EEEBB]) [     ] o.a.s.u.p.LogUpdateProcessorFactory [collection1]  webapp=null path=null params={}{add=[132]} 0 0
   [junit4]   2> 2018344 INFO  (TEST-TestExportWriter.testMultipleSorts-seed#[DB51704BFD0EEEBB]) [     ] o.a.s.u.p.LogUpdateProcessorFactory [collection1]  webapp=null path=null params={}{add=[133]} 0 0
   [junit4]   2> 2018344 INFO  (TEST-TestExportWriter.testMultipleSorts-seed#[DB51704BFD0EEEBB]) [     ] o.a.s.u.p.LogUpdateProcessorFactory [collection1]  webapp=null path=null params={}{add=[134]} 0 0
   [junit4]   2> 2018344 INFO  (TEST-TestExportWriter.testMultipleSorts-seed#[DB51704BFD0EEEBB]) [     ] o.a.s.u.p.LogUpdateProcessorFactory [collection1]  webapp=null path=null params={}{add=[135]} 0 0
   [junit4]   2> 2018344 INFO  (TEST-TestExportWriter.testMultipleSorts-seed#[DB51704BFD0EEEBB]) [     ] o.a.s.u.p.LogUpdateProcessorFactory [collection1]  webapp=null path=null params={}{add=[136]} 0 0
   [junit4]   2> 2018345 INFO  (TEST-TestExportWriter.testMultipleSorts-seed#[DB51704BFD0EEEBB]) [     ] o.a.s.u.p.LogUpdateProcessorFactory [collection1]  webapp=null path=null params={}{add=[137]} 0 0
   [junit4]   2> 2018345 INFO  (TEST-TestExportWriter.testMultipleSorts-seed#[DB51704BFD0EEEBB]) [     ] o.a.s.u.p.LogUpdateProcessorFactory [collection1]  webapp=null path=null params={}{add=[138]} 0 0
   [junit4]   2> 2018345 INFO  (TEST-TestExportWriter.testMultipleSorts-seed#[DB51704BFD0EEEBB]) [     ] o.a.s.u.p.LogUpdateProcessorFactory [collection1]  webapp=null path=null params={}{add=[139]} 0 0
   [junit4]   2> 2018345 INFO  (TEST-TestExportWriter.testMultipleSorts-seed#[DB51704BFD0EEEBB]) [     ] o.a.s.u.p.LogUpdateProcessorFactory [collection1]  webapp=null path=null params={}{add=[140]} 0 0
   [junit4]   2> 2018345 INFO  (TEST-TestExportWriter.testMultipleSorts-seed#[DB51704BFD0EEEBB]) [     ] o.a.s.u.p.LogUpdateProcessorFactory [collection1]  webapp=null path=null params={}{add=[141]} 0 0
   [junit4]   2> 2018345 INFO  (TEST-TestExportWriter.testMultipleSorts-seed#[DB51704BFD0EEEBB]) [     ] o.a.s.u.p.LogUpdateProcessorFactory [collection1]  webapp=null path=null params={}{add=[142]} 0 0
   [junit4]   2> 2018345 INFO  (TEST-TestExportWriter.testMultipleSorts-seed#[DB51704BFD0EEEBB]) [     ] o.a.s.u.p.LogUpdateProcessorFactory [collection1]  webapp=null path=null params={}{add=[143]} 0 0
   [junit4]   2> 2018345 INFO  (TEST-TestExportWriter.testMultipleSorts-seed#[DB51704BFD0EEEBB]) [     ] o.a.s.u.p.LogUpdateProcessorFactory [collection1]  webapp=null path=null params={}{add=[144]} 0 0
   [junit4]   2> 2018345 INFO  (TEST-TestExportWriter.testMultipleSorts-seed#[DB51704BFD0EEEBB]) [     ] o.a.s.u.p.LogUpdateProcessorFactory [collection1]  webapp=null path=null params={}{add=[145]} 0 0
   [junit4]   2> 2018345 INFO  (TEST-TestExportWriter.testMultipleSorts-seed#[DB51704BFD0EEEBB]) [     ] o.a.s.u.p.LogUpdateProcessorFactory [collection1]  webapp=null path=null params={}{add=[146]} 0 0
   [junit4]   2> 2018346 INFO  (TEST-TestExportWriter.testMultipleSorts-seed#[DB51704BFD0EEEBB]) [     ] o.a.s.u.p.LogUpdateProcessorFactory [collection1]  webapp=null path=null params={}{add=[147]} 0 0
   [junit4]   2> 2018346 INFO  (TEST-TestExportWriter.testMultipleSorts-seed#[DB51704BFD0EEEBB]) [     ] o.a.s.u.p.LogUpdateProcessorFactory [collection1]  webapp=null path=null params={}{add=[148]} 0 0
   [junit4]   2> 2018346 INFO  (TEST-TestExportWriter.testMultipleSorts-seed#[DB51704BFD0EEEBB]) [     ] o.a.s.u.p.LogUpdateProcessorFactory [collection1]  webapp=null path=null params={}{add=[149]} 0 0
   [junit4]   2> 2018346 INFO  (TEST-TestExportWriter.testMultipleSorts-seed#[DB51704BFD0EEEBB]) [     ] o.a.s.u.p.LogUpdateProcessorFactory [collection1]  webapp=null path=null params={}{add=[150]} 0 0
   [junit4]   2> 2018346 INFO  (TEST-TestExportWriter.testMultipleSorts-seed#[DB51704BFD0EEEBB]) [     ] o.a.s.u.p.LogUpdateProcessorFactory [collection1]  webapp=null path=null params={}{add=[151]} 0 0
   [junit4]   2> 2018346 INFO  (TEST-TestExportWriter.testMultipleSorts-seed#[DB51704BFD0EEEBB]) [     ] o.a.s.u.p.LogUpdateProcessorFactory [collection1]  webapp=null path=null params={}{add=[152]} 0 0
   [junit4]   2> 2018346 INFO  (TEST-TestExportWriter.testMultipleSorts-seed#[DB51704BFD0EEEBB]) [     ] o.a.s.u.p.LogUpdateProcessorFactory [collection1]  webapp=null path=null params={}{add=[153]} 0 0
   [junit4]   2> 2018346 INFO  (TEST-TestExportWriter.testMultipleSorts-seed#[DB51704BFD0EEEBB]) [     ] o.a.s.u.p.LogUpdateProcessorFactory [collection1]  webapp=null path=null params={}{add=[154]} 0 0
   [junit4]   2> 2018346 INFO  (TEST-TestExportWriter.testMultipleSorts-seed#[DB51704BFD0EEEBB]) [     ] o.a.s.u.p.LogUpdateProcessorFactory [collection1]  webapp=null path=null params={}{add=[155]} 0 0
   [junit4]   2> 2018347 INFO  (TEST-TestExportWriter.testMultipleSorts-seed#[DB51704BFD0EEEBB]) [     ] o.a.s.u.p.LogUpdateProcessorFactory [collection1]  webapp=null path=null params={}{add=[156]} 0 0
   [junit4]   2> 2018347 INFO  (TEST-TestExportWriter.testMultipleSorts-seed#[DB51704BFD0EEEBB]) [     ] o.a.s.u.p.LogUpdateProcessorFactory [collection1]  webapp=null path=null params={}{add=[157]} 0 0
   [junit4]   2> 2018347 INFO  (TEST-TestExportWriter.testMultipleSorts-seed#[DB51704BFD0EEEBB]) [     ] o.a.s.u.p.LogUpdateProcessorFactory [collection1]  webapp=null path=null params={}{add=[158]} 0 0
   [junit4]   2> 2018347 INFO  (TEST-TestExportWriter.testMultipleSorts-seed#[DB51704BFD0EEEBB]) [     ] o.a.s.u.p.LogUpdateProcessorFactory [collection1]  webapp=null path=null params={}{add=[159]} 0 0
   [junit4]   2> 2018347 INFO  (TEST-TestExportWriter.testMultipleSorts-seed#[DB51704BFD0EEEBB]) [     ] o.a.s.u.p.LogUpdateProcessorFactory [collection1]  webapp=null path=null params={}{add=[160]} 0 0
   [junit4]   2> 2018347 INFO  (TEST-TestExportWriter.testMultipleSorts-seed#[DB51704BFD0EEEBB]) [     ] o.a.s.u.p.LogUpdateProcessorFactory [collection1]  webapp=null path=null params={}{add=[161]} 0 0
   [junit4]   2> 2018347 INFO  (TEST-TestExportWriter.testMultipleSorts-seed#[DB51704BFD0EEEBB]) [     ] o.a.s.u.p.LogUpdateProcessorFactory [collection1]  webapp=null path=null params={}{add=[162]} 0 0
   [junit4]   2> 2018347 INFO  (TEST-TestExportWriter.testMultipleSorts-seed#[DB51704BFD0EEEBB]) [     ] o.a.s.u.p.LogUpdateProcessorFactory [collection1]  webapp=null path=null params={}{add=[163]} 0 0
   [junit4]   2> 2018347 INFO  (TEST-TestExportWriter.testMultipleSorts-seed#[DB51704BFD0EEEBB]) [     ] o.a.s.u.p.LogUpdateProcessorFactory [collection1]  webapp=null path=null params={}{add=[164]} 0 0
   [junit4]   2> 2018348 INFO  (TEST-TestExportWriter.testMultipleSorts-seed#[DB51704BFD0EEEBB]) [     ] o.a.s.u.p.LogUpdateProcessorFactory [collection1]  webapp=null path=null params={}{add=[165]} 0 0
   [junit4]   2> 2018348 INFO  (TEST-TestExportWriter.testMultipleSorts-seed#[DB51704BFD0EEEBB]) [     ] o.a.s.u.p.LogUpdateProcessorFactory [collection1]  webapp=null path=null params={}{add=[166]} 0 0
   [junit4]   2> 2018348 INFO  (TEST-TestExportWriter.testMultipleSorts-seed#[DB51704BFD0EEEBB]) [     ] o.a.s.u.p.LogUpdateProcessorFactory [collection1]  webapp=null path=null params={}{add=[167]} 0 0
   [junit4]   2> 2018348 INFO  (TEST-TestExportWriter.testMultipleSorts-seed#[DB51704BFD0EEEBB]) [     ] o.a.s.u.p.LogUpdateProcessorFactory [collection1]  webapp=null path=null params={}{add=[168]} 0 0
   [junit4]   2> 2018348 INFO  (TEST-TestExportWriter.testMultipleSorts-seed#[DB51704BFD0EEEBB]) [     ] o.a.s.u.p.LogUpdateProcessorFactory [collection1]  webapp=null path=null params={}{add=[169]} 0 0
   [junit4]   2> 2018348 INFO  (TEST-TestExportWriter.testMultipleSorts-seed#[DB51704BFD0EEEBB]) [     ] o.a.s.u.p.LogUpdateProcessorFactory [collection1]  webapp=null path=null params={}{add=[170]} 0 0
   [junit4]   2> 2018348 INFO  (TEST-TestExportWriter.testMultipleSorts-seed#[DB51704BFD0EEEBB]) [     ] o.a.s.u.p.LogUpdateProcessorFactory [collection1]  webapp=null path=null params={}{add=[171]} 0 0
   [junit4]   2> 2018348 INFO  (TEST-TestExportWriter.testMultipleSorts-seed#[DB51704BFD0EEEBB]) [     ] o.a.s.u.p.LogUpdateProcessorFactory [collection1]  webapp=null path=null params={}{add=[172]} 0 0
   [junit4]   2> 2018348 INFO  (TEST-TestExportWriter.testMultipleSorts-seed#[DB51704BFD0EEEBB]) [     ] o.a.s.u.p.LogUpdateProcessorFactory [collection1]  webapp=null path=null params={}{add=[173]} 0 0
   [junit4]   2> 2018348 INFO  (TEST-TestExportWriter.testMultipleSorts-seed#[DB51704BFD0EEEBB]) [     ] o.a.s.u.p.LogUpdateProcessorFactory [collection1]  webapp=null path=null params={}{add=[174]} 0 0
   [junit4]   2> 2018349 INFO  (TEST-TestExportWriter.testMultipleSorts-seed#[DB51704BFD0EEEBB]) [     ] o.a.s.u.p.LogUpdateProcessorFactory [collection1]  webapp=null path=null params={}{add=[175]} 0 0
   [junit4]   2> 2018349 INFO  (TEST-TestExportWriter.testMultipleSorts-seed#[DB51704BFD0EEEBB]) [     ] o.a.s.u.p.LogUpdateProcessorFactory [collection1]  webapp=null path=null params={}{add=[176]} 0 0
   [junit4]   2> 2018349 INFO  (TEST-TestExportWriter.testMultipleSorts-seed#[DB51704BFD0EEEBB]) [     ] o.a.s.u.p.LogUpdateProcessorFactory [collection1]  webapp=null path=null params={}{add=[177]} 0 0
   [junit4]   2> 2018349 INFO  (TEST-TestExportWriter.testMultipleSorts-seed#[DB51704BFD0EEEBB]) [     ] o.a.s.u.p.LogUpdateProcessorFactory [collection1]  webapp=null path=null params={}{add=[178]} 0 0
   [junit4]   2> 2018349 INFO  (TEST-TestExportWriter.testMultipleSorts-seed#[DB51704BFD0EEEBB]) [     ] o.a.s.u.p.LogUpdateProcessorFactory [collection1]  webapp=null path=null params={}{add=[179]} 0 0
   [junit4]   2> 2018349 INFO  (TEST-TestExportWriter.testMultipleSorts-seed#[DB51704BFD0EEEBB]) [     ] o.a.s.u.p.LogUpdateProcessorFactory [collection1]  webapp=null path=null params={}{add=[180]} 0 0
   [junit4]   2> 2018349 INFO  (TEST-TestExportWriter.testMultipleSorts-seed#[DB51704BFD0EEEBB]) [     ] o.a.s.u.p.LogUpdateProcessorFactory [collection1]  webapp=null path=null params={}{add=[181]} 0 0
   [junit4]   2> 2018349 INFO  (TEST-TestExportWriter.testMultipleSorts-seed#[DB51704BFD0EEEBB]) [     ] o.a.s.u.p.LogUpdateProcessorFactory [collection1]  webapp=null path=null params={}{add=[182]} 0 0
   [junit4]   2> 2018349 INFO  (TEST-TestExportWriter.testMultipleSorts-seed#[DB51704BFD0EEEBB]) [     ] o.a.s.u.p.LogUpdateProcessorFactory [collection1]  webapp=null path=null params={}{add=[183]} 0 0
   [junit4]   2> 2018349 INFO  (TEST-TestExportWriter.testMultipleSorts-seed#[DB51704BFD0EEEBB]) [     ] o.a.s.u.p.LogUpdateProcessorFactory [collection1]  webapp=null path=null params={}{add=[184]} 0 0
   [junit4]   2> 2018350 INFO  (TEST-TestExportWriter.testMultipleSorts-seed#[DB51704BFD0EEEBB]) [     ] o.a.s.u.p.LogUpdateProcessorFactory [collection1]  webapp=null path=null params={}{add=[185]} 0 0
   [junit4]   2> 2018350 INFO  (TEST-TestExportWriter.testMultipleSorts-seed#[DB51704BFD0EEEBB]) [     ] o.a.s.u.p.LogUpdateProcessorFactory [collection1]  webapp=null path=null params={}{add=[186]} 0 0
   [junit4]   2> 2018350 INFO  (TEST-TestExportWriter.testMultipleSorts-seed#[DB51704BFD0EEEBB]) [     ] o.a.s.u.p.LogUpdateProcessorFactory [collection1]  webapp=null path=null params={}{add=[187]} 0 0
   [junit4]   2> 2018350 INFO  (TEST-TestExportWriter.testMultipleSorts-seed#[DB51704BFD0EEEBB]) [     ] o.a.s.u.p.LogUpdateProcessorFactory [collection1]  webapp=null path=null params={}{add=[188]} 0 0
   [junit4]   2> 2018350 INFO  (TEST-TestExportWriter.testMultipleSorts-seed#[DB51704BFD0EEEBB]) [     ] o.a.s.u.p.LogUpdateProcessorFactory [collection1]  webapp=null path=null params={}{add=[189]} 0 0
   [junit4]   2> 2018350 INFO  (TEST-TestExportWriter.testMultipleSorts-seed#[DB51704BFD0EEEBB]) [     ] o.a.s.u.p.LogUpdateProcessorFactory [collection1]  webapp=null path=null params={}{add=[190]} 0 0
   [junit4]   2> 2018350 INFO  (TEST-TestExportWriter.testMultipleSorts-seed#[DB51704BFD0EEEBB]) [     ] o.a.s.u.p.LogUpdateProcessorFactory [collection1]  webapp=null path=null params={}{add=[191]} 0 0
   [junit4]   2> 2018350 INFO  (TEST-TestExportWriter.testMultipleSorts-seed#[DB51704BFD0EEEBB]) [     ] o.a.s.u.p.LogUpdateProcessorFactory [collection1]  webapp=null path=null params={}{add=[192]} 0 0
   [junit4]   2> 2018350 INFO  (TEST-TestExportWriter.testMultipleSorts-seed#[DB51704BFD0EEEBB]) [     ] o.a.s.u.p.LogUpdateProcessorFactory [collection1]  webapp=null path=null params={}{add=[193]} 0 0
   [junit4]   2> 2018350 INFO  (TEST-TestExportWriter.testMultipleSorts-seed#[DB51704BFD0EEEBB]) [     ] o.a.s.u.p.LogUpdateProcessorFactory [collection1]  webapp=null path=null params={}{add=[194]} 0 0
   [junit4]   2> 2018351 INFO  (TEST-TestExportWriter.testMultipleSorts-seed#[DB51704BFD0EEEBB]) [     ] o.a.s.u.p.LogUpdateProcessorFactory [collection1]  webapp=null path=null params={}{add=[195]} 0 0
   [junit4]   2> 2018351 INFO  (TEST-TestExportWriter.testMultipleSorts-seed#[DB51704BFD0EEEBB]) [     ] o.a.s.u.p.LogUpdateProcessorFactory [collection1]  webapp=null path=null params={}{add=[196]} 0 0
   [junit4]   2> 2018351 INFO  (TEST-TestExportWriter.testMultipleSorts-seed#[DB51704BFD0EEEBB]) [     ] o.a.s.u.p.LogUpdateProcessorFactory [collection1]  webapp=null path=null params={}{add=[197]} 0 0
   [junit4]   2> 2018351 INFO  (TEST-TestExportWriter.testMultipleSorts-seed#[DB51704BFD0EEEBB]) [     ] o.a.s.u.p.LogUpdateProcessorFactory [collection1]  webapp=null path=null params={}{add=[198]} 0 0
   [junit4]   2> 2018351 INFO  (TEST-TestExportWriter.testMultipleSorts-seed#[DB51704BFD0EEEBB]) [     ] o.a.s.u.p.LogUpdateProcessorFactory [collection1]  webapp=null path=null params={}{add=[199]} 0 0
   [junit4]   2> 2018351 INFO  (TEST-TestExportWriter.testMultipleSorts-seed#[DB51704BFD0EEEBB]) [     ] o.a.s.u.p.LogUpdateProcessorFactory [collection1]  webapp=null path=null params={}{add=[200]} 0 0
   [junit4]   2> 2018351 INFO  (TEST-TestExportWriter.testMultipleSorts-seed#[DB51704BFD0EEEBB]) [     ] o.a.s.u.p.LogUpdateProcessorFactory [collection1]  webapp=null path=null params={}{add=[201]} 0 0
   [junit4]   2> 2018351 INFO  (TEST-TestExportWriter.testMultipleSorts-seed#[DB51704BFD0EEEBB]) [     ] o.a.s.u.p.LogUpdateProcessorFactory [collection1]  webapp=null path=null params={}{add=[202]} 0 0
   [junit4]   2> 2018351 INFO  (TEST-TestExportWriter.testMultipleSorts-seed#[DB51704BFD0EEEBB]) [     ] o.a.s.u.p.LogUpdateProcessorFactory [collection1]  webapp=null path=null params={}{add=[203]} 0 0
   [junit4]   2> 2018352 INFO  (TEST-TestExportWriter.testMultipleSorts-seed#[DB51704BFD0EEEBB]) [     ] o.a.s.u.p.LogUpdateProcessorFactory [collection1]  webapp=null path=null params={}{add=[204]} 0 0
   [junit4]   2> 2018352 INFO  (TEST-TestExportWriter.testMultipleSorts-seed#[DB51704BFD0EEEBB]) [     ] o.a.s.u.p.LogUpdateProcessorFactory [collection1]  webapp=null path=null params={}{add=[205]} 0 0
   [junit4]   2> 2018352 INFO  (TEST-TestExportWriter.testMultipleSorts-seed#[DB51704BFD0EEEBB]) [     ] o.a.s.u.p.LogUpdateProcessorFactory [collection1]  webapp=null path=null params={}{add=[206]} 0 0
   [junit4]   2> 2018352 INFO  (TEST-TestExportWriter.testMultipleSorts-seed#[DB51704BFD0EEEBB]) [     ] o.a.s.u.p.LogUpdateProcessorFactory [collection1]  webapp=null path=null params={}{add=[207]} 0 0
   [junit4]   2> 2018352 INFO  (TEST-TestExportWriter.testMultipleSorts-seed#[DB51704BFD0EEEBB]) [     ] o.a.s.u.p.LogUpdateProcessorFactory [collection1]  webapp=null path=null params={}{add=[208]} 0 0
   [junit4]   2> 2018352 INFO  (TEST-TestExportWriter.testMultipleSorts-seed#[DB51704BFD0EEEBB]) [     ] o.a.s.u.p.LogUpdateProcessorFactory [collection1]  webapp=null path=null params={}{add=[209]} 0 0
   [junit4]   2> 2018352 INFO  (TEST-TestExportWriter.testMultipleSorts-seed#[DB51704BFD0EEEBB]) [     ] o.a.s.u.p.LogUpdateProcessorFactory [collection1]  webapp=null path=null params={}{add=[210]} 0 0
   [junit4]   2> 2018352 INFO  (TEST-TestExportWriter.testMultipleSorts-seed#[DB51704BFD0EEEBB]) [     ] o.a.s.u.p.LogUpdateProcessorFactory [collection1]  webapp=null path=null params={}{add=[211]} 0 0
   [junit4]   2> 2018352 INFO  (TEST-TestExportWriter.testMultipleSorts-seed#[DB51704BFD0EEEBB]) [     ] o.a.s.u.p.LogUpdateProcessorFactory [collection1]  webapp=null path=null params={}{add=[212]} 0 0
   [junit4]   2> 2018352 INFO  (TEST-TestExportWriter.testMultipleSorts-seed#[DB51704BFD0EEEBB]) [     ] o.a.s.u.p.LogUpdateProcessorFactory [collection1]  webapp=null path=null params={}{add=[213]} 0 0
   [junit4]   2> 2018352 INFO  (TEST-TestExportWriter.testMultipleSorts-seed#[DB51704BFD0EEEBB]) [     ] o.a.s.u.p.LogUpdateProcessorFactory [collection1]  webapp=null path=null params={}{add=[214]} 0 0
   [junit4]   2> 2018353 INFO  (TEST-TestExportWriter.testMultipleSorts-seed#[DB51704BFD0EEEBB]) [     ] o.a.s.u.p.LogUpdateProcessorFactory [collection1]  webapp=null path=null params={}{add=[215]} 0 0
   [junit4]   2> 2018353 INFO  (TEST-TestExportWriter.testMultipleSorts-seed#[DB51704BFD0EEEBB]) [     ] o.a.s.u.p.LogUpdateProcessorFactory [collection1]  webapp=null path=null params={}{add=[216]} 0 0
   [junit4]   2> 2018353 INFO  (TEST-TestExportWriter.testMultipleSorts-seed#[DB51704BFD0EEEBB]) [     ] o.a.s.u.p.LogUpdateProcessorFactory [collection1]  webapp=null path=null params={}{add=[217]} 0 0
   [junit4]   2> 2018353 INFO  (TEST-TestExportWriter.testMultipleSorts-seed#[DB51704BFD0EEEBB]) [     ] o.a.s.u.p.LogUpdateProcessorFactory [collection1]  webapp=null path=null params={}{add=[218]} 0 0
   [junit4]   2> 2018353 INFO  (TEST-TestExportWriter.testMultipleSorts-seed#[DB51704BFD0EEEBB]) [     ] o.a.s.u.p.LogUpdateProcessorFactory [collection1]  webapp=null path=null params={}{add=[219]} 0 0
   [junit4]   2> 2018353 INFO  (TEST-TestExportWriter.testMultipleSorts-seed#[DB51704BFD0EEEBB]) [     ] o.a.s.u.p.LogUpdateProcessorFactory [collection1]  webapp=null path=null params={}{add=[220]} 0 0
   [junit4]   2> 2018353 INFO  (TEST-TestExportWriter.testMultipleSorts-seed#[DB51704BFD0EEEBB]) [     ] o.a.s.u.p.LogUpdateProcessorFactory [collection1]  webapp=null path=null params={}{add=[221]} 0 0
   [junit4]   2> 2018353 INFO  (TEST-TestExportWriter.testMultipleSorts-seed#[DB51704BFD0EEEBB]) [     ] o.a.s.u.p.LogUpdateProcessorFactory [collection1]  webapp=null path=null params={}{add=[222]} 0 0
   [junit4]   2> 2018353 INFO  (TEST-TestExportWriter.testMultipleSorts-seed#[DB51704BFD0EEEBB]) [     ] o.a.s.u.p.LogUpdateProcessorFactory [collection1]  webapp=null path=null params={}{add=[223]} 0 0
   [junit4]   2> 2018353 INFO  (TEST-TestExportWriter.testMultipleSorts-seed#[DB51704BFD0EEEBB]) [     ] o.a.s.u.p.LogUpdateProcessorFactory [collection1]  webapp=null path=null params={}{add=[224]} 0 0
   [junit4]   2> 2018354 INFO  (TEST-TestExportWriter.testMultipleSorts-seed#[DB51704BFD0EEEBB]) [     ] o.a.s.u.p.LogUpdateProcessorFactory [collection1]  webapp=null path=null params={}{add=[225]} 0 0
   [junit4]   2> 2018354 INFO  (TEST-TestExportWriter.testMultipleSorts-seed#[DB51704BFD0EEEBB]) [     ] o.a.s.u.p.LogUpdateProcessorFactory [collection1]  webapp=null path=null params={}{add=[226]} 0 0
   [junit4]   2> 2018354 INFO  (TEST-TestExportWriter.testMultipleSorts-seed#[DB51704BFD0EEEBB]) [     ] o.a.s.u.p.LogUpdateProcessorFactory [collection1]  webapp=null path=null params={}{add=[227]} 0 0
   [junit4]   2> 2018354 INFO  (TEST-TestExportWriter.testMultipleSorts-seed#[DB51704BFD0EEEBB]) [     ] o.a.s.u.p.LogUpdateProcessorFactory [collection1]  webapp=null path=null params={}{add=[228]} 0 0
   [junit4]   2> 2018354 INFO  (TEST-TestExportWriter.testMultipleSorts-seed#[DB51704BFD0EEEBB]) [     ] o.a.s.u.p.LogUpdateProcessorFactory [collection1]  webapp=null path=null params={}{add=[229]} 0 0
   [junit4]   2> 2018354 INFO  (TEST-TestExportWriter.testMultipleSorts-seed#[DB51704BFD0EEEBB]) [     ] o.a.s.u.p.LogUpdateProcessorFactory [collection1]  webapp=null path=null params={}{add=[230]} 0 0
   [junit4]   2> 2018354 INFO  (TEST-TestExportWriter.testMultipleSorts-seed#[DB51704BFD0EEEBB]) [     ] o.a.s.u.p.LogUpdateProcessorFactory [collection1]  webapp=null path=null params={}{add=[231]} 0 0
   [junit4]   2> 2018354 INFO  (TEST-TestExportWriter.testMultipleSorts-seed#[DB51704BFD0EEEBB]) [     ] o.a.s.u.p.LogUpdateProcessorFactory [collection1]  webapp=null path=null params={}{add=[232]} 0 0
   [junit4]   2> 2018354 INFO  (TEST-TestExportWriter.testMultipleSorts-seed#[DB51704BFD0EEEBB]) [     ] o.a.s.u.p.LogUpdateProcessorFactory [collection1]  webapp=null path=null params={}{add=[233]} 0 0
   [junit4]   2> 2018355 INFO  (TEST-TestExportWriter.testMultipleSorts-seed#[DB51704BFD0EEEBB]) [     ] o.a.s.u.p.LogUpdateProcessorFactory [collection1]  webapp=null path=null params={}{add=[234]} 0 0
   [junit4]   2> 2018355 INFO  (TEST-TestExportWriter.testMultipleSorts-seed#[DB51704BFD0EEEBB]) [     ] o.a.s.u.p.LogUpdateProcessorFactory [collection1]  webapp=null path=null params={}{add=[235]} 0 0
   [junit4]   2> 2018355 INFO  (TEST-TestExportWriter.testMultipleSorts-seed#[DB51704BFD0EEEBB]) [     ] o.a.s.u.p.LogUpdateProcessorFactory [collection1]  webapp=null path=null params={}{add=[236]} 0 0
   [junit4]   2> 2018355 INFO  (TEST-TestExportWriter.testMultipleSorts-seed#[DB51704BFD0EEEBB]) [     ] o.a.s.u.p.LogUpdateProcessorFactory [collection1]  webapp=null path=null params={}{add=[237]} 0 0
   [junit4]   2> 2018355 INFO  (TEST-TestExportWriter.testMultipleSorts-seed#[DB51704BFD0EEEBB]) [     ] o.a.s.u.p.LogUpdateProcessorFactory [collection1]  webapp=null path=null params={}{add=[238]} 0 0
   [junit4]   2> 2018355 INFO  (TEST-TestExportWriter.testMultipleSorts-seed#[DB51704BFD0EEEBB]) [     ] o.a.s.u.p.LogUpdateProcessorFactory [collection1]  webapp=null path=null params={}{add=[239]} 0 0
   [junit4]   2> 2018355 INFO  (TEST-TestExportWriter.testMultipleSorts-seed#[DB51704BFD0EEEBB]) [     ] o.a.s.u.p.LogUpdateProcessorFactory [collection1]  webapp=null path=null params={}{add=[240]} 0 0
   [junit4]   2> 2018355 INFO  (TEST-TestExportWriter.testMultipleSorts-seed#[DB51704BFD0EEEBB]) [     ] o.a.s.u.p.LogUpdateProcessorFactory [collection1]  webapp=null path=null params={}{add=[241]} 0 0
   [junit4]   2> 2018355 INFO  (TEST-TestExportWriter.testMultipleSorts-seed#[DB51704BFD0EEEBB]) [     ] o.a.s.u.p.LogUpdateProcessorFactory [collection1]  webapp=null path=null params={}

[...truncated too long message...]

x -Dtests.asserts=true -Dtests.file.encoding=UTF-8
   [junit4] FAILURE 0.04s J1 | TestExportWriter.testStringWithCase <<<
   [junit4]    > Throwable #1: org.junit.ComparisonFailure: expected:<...:"3"},
   [junit4]    >       {"id":"[1"},
   [junit4]    >       {"id":"4]"},
   [junit4]    >       {"id":"2"}...> but was:<...:"3"},
   [junit4]    >       {"id":"[4"},
   [junit4]    >       {"id":"1]"},
   [junit4]    >       {"id":"2"}...>
   [junit4]    > 	at __randomizedtesting.SeedInfo.seed([DB51704BFD0EEEBB:BF1A8CCD6483EEDE]:0)
   [junit4]    > 	at org.apache.solr.handler.export.TestExportWriter.assertJsonEquals(TestExportWriter.java:540)
   [junit4]    > 	at org.apache.solr.handler.export.TestExportWriter.testStringWithCase(TestExportWriter.java:365)
   [junit4]    > 	at java.base/jdk.internal.reflect.NativeMethodAccessorImpl.invoke0(Native Method)
   [junit4]    > 	at java.base/jdk.internal.reflect.NativeMethodAccessorImpl.invoke(NativeMethodAccessorImpl.java:62)
   [junit4]    > 	at java.base/jdk.internal.reflect.DelegatingMethodAccessorImpl.invoke(DelegatingMethodAccessorImpl.java:43)
   [junit4]    > 	at java.base/java.lang.reflect.Method.invoke(Method.java:566)
   [junit4]    > 	at java.base/java.lang.Thread.run(Thread.java:834)
   [junit4]   2> 16028 INFO  (SUITE-TestExportWriter-seed#[DB51704BFD0EEEBB]-worker) [     ] o.a.s.SolrTestCaseJ4 ###deleteCore
   [junit4]   2> 16028 INFO  (SUITE-TestExportWriter-seed#[DB51704BFD0EEEBB]-worker) [     ] o.a.s.c.CoreContainer Shutting down CoreContainer instance=580974787
   [junit4]   2> 16037 INFO  (coreCloseExecutor-29-thread-1) [    x:collection1 ] o.a.s.c.SolrCore [collection1]  CLOSING SolrCore org.apache.solr.core.SolrCore@1102683
   [junit4]   2> 16037 INFO  (coreCloseExecutor-29-thread-1) [    x:collection1 ] o.a.s.m.SolrMetricManager Closing metric reporters for registry=solr.core.collection1, tag=1102683
   [junit4]   2> 16037 INFO  (coreCloseExecutor-29-thread-1) [    x:collection1 ] o.a.s.m.r.SolrJmxReporter Closing reporter [org.apache.solr.metrics.reporters.SolrJmxReporter@1dee8214: rootName = null, domain = solr.core.collection1, service url = null, agent id = null] for registry solr.core.collection1 / com.codahale.metrics.MetricRegistry@4b7f1e86
   [junit4]   2> 16068 INFO  (SUITE-TestExportWriter-seed#[DB51704BFD0EEEBB]-worker) [     ] o.a.s.m.SolrMetricManager Closing metric reporters for registry=solr.node, tag=null
   [junit4]   2> 16068 INFO  (SUITE-TestExportWriter-seed#[DB51704BFD0EEEBB]-worker) [     ] o.a.s.m.r.SolrJmxReporter Closing reporter [org.apache.solr.metrics.reporters.SolrJmxReporter@6051857c: rootName = null, domain = solr.node, service url = null, agent id = null] for registry solr.node / com.codahale.metrics.MetricRegistry@3cfd6c90
   [junit4]   2> 16074 INFO  (SUITE-TestExportWriter-seed#[DB51704BFD0EEEBB]-worker) [     ] o.a.s.m.SolrMetricManager Closing metric reporters for registry=solr.jvm, tag=null
   [junit4]   2> 16074 INFO  (SUITE-TestExportWriter-seed#[DB51704BFD0EEEBB]-worker) [     ] o.a.s.m.r.SolrJmxReporter Closing reporter [org.apache.solr.metrics.reporters.SolrJmxReporter@72b1b796: rootName = null, domain = solr.jvm, service url = null, agent id = null] for registry solr.jvm / com.codahale.metrics.MetricRegistry@529c6533
   [junit4]   2> 16074 INFO  (SUITE-TestExportWriter-seed#[DB51704BFD0EEEBB]-worker) [     ] o.a.s.m.SolrMetricManager Closing metric reporters for registry=solr.jetty, tag=null
   [junit4]   2> 16074 INFO  (SUITE-TestExportWriter-seed#[DB51704BFD0EEEBB]-worker) [     ] o.a.s.m.r.SolrJmxReporter Closing reporter [org.apache.solr.metrics.reporters.SolrJmxReporter@7d485d69: rootName = null, domain = solr.jetty, service url = null, agent id = null] for registry solr.jetty / com.codahale.metrics.MetricRegistry@1b9436ff
   [junit4]   2> NOTE: leaving temporary files on disk at: /home/jenkins/workspace/Lucene-Solr-8.x-Linux/solr/build/solr-core/test/J1/temp/solr.handler.export.TestExportWriter_DB51704BFD0EEEBB-002
   [junit4]   2> NOTE: test params are: codec=Asserting(Lucene80): {sortabledv_udvas=PostingsFormat(name=Asserting), sortabledv_m=PostingsFormat(name=Asserting), sortabledv=PostingsFormat(name=Asserting), id=PostingsFormat(name=Direct), field1_s_dv=PostingsFormat(name=Asserting), sortabledv_m_udvas=PostingsFormat(name=Asserting)}, docValues:{number_i_p=DocValuesFormat(name=Lucene80), field1_i_p=DocValuesFormat(name=Lucene80), number_ls_ni_p=DocValuesFormat(name=Lucene80), number_ls_t=DocValuesFormat(name=Lucene80), number_ds_p=DocValuesFormat(name=Lucene80), number_ds_t=DocValuesFormat(name=Lucene80), booleandv=DocValuesFormat(name=Lucene80), number_i_t=DocValuesFormat(name=Lucene80), field2_i_p=DocValuesFormat(name=Direct), number_is_ni_p=DocValuesFormat(name=Direct), number_is_ni_t=DocValuesFormat(name=Direct), longdv=DocValuesFormat(name=Asserting), number_ls_p=DocValuesFormat(name=Lucene80), id=DocValuesFormat(name=Direct), field1_s_dv=DocValuesFormat(name=Asserting), number_dts_p=DocValuesFormat(name=Lucene80), stringdv=DocValuesFormat(name=Direct), longdv_m=DocValuesFormat(name=Lucene80), number_ls_ni_t=DocValuesFormat(name=Lucene80), number_is_t=DocValuesFormat(name=Lucene80), number_dts_t=DocValuesFormat(name=Lucene80), doubledv_m=DocValuesFormat(name=Lucene80), doubledv=DocValuesFormat(name=Direct), number_is_p=DocValuesFormat(name=Lucene80), field4_i_p=DocValuesFormat(name=Lucene80), sortabledv_udvas=DocValuesFormat(name=Asserting), number_dts_ni_t=DocValuesFormat(name=Lucene80), field3_i_p=DocValuesFormat(name=Asserting), intdv=DocValuesFormat(name=Lucene80), floatdv=DocValuesFormat(name=Asserting), number_fs_p=DocValuesFormat(name=Asserting), field6_i_p=DocValuesFormat(name=Direct), number_f_t=DocValuesFormat(name=Lucene80), number_l_p=DocValuesFormat(name=Direct), number_dt_p=DocValuesFormat(name=Direct), number_f_p=DocValuesFormat(name=Lucene80), number_d_t=DocValuesFormat(name=Direct), number_dt_t=DocValuesFormat(name=Direct), int_is_t=DocValuesFormat(name=Direct), number_dts_ni_p=DocValuesFormat(name=Lucene80), number_fs_t=DocValuesFormat(name=Asserting), datedv_m=DocValuesFormat(name=Lucene80), int_is_p=DocValuesFormat(name=Direct), number_l_t=DocValuesFormat(name=Direct), sortabledv_m_udvas=DocValuesFormat(name=Asserting), number_ds_ni_t=DocValuesFormat(name=Asserting), sortabledv_m=DocValuesFormat(name=Asserting), stringdv_m=DocValuesFormat(name=Lucene80), intdv_m=DocValuesFormat(name=Direct), number_ds_ni_p=DocValuesFormat(name=Asserting), field5_i_p=DocValuesFormat(name=Lucene80), number_d_ni_p=DocValuesFormat(name=Lucene80), number_fs_ni_p=DocValuesFormat(name=Asserting), number_d_ni_t=DocValuesFormat(name=Lucene80), number_fs_ni_t=DocValuesFormat(name=Asserting), sortabledv=DocValuesFormat(name=Asserting), field8_i_p=DocValuesFormat(name=Lucene80), datedv=DocValuesFormat(name=Lucene80), number_f_ni_t=DocValuesFormat(name=Direct), floatdv_m=DocValuesFormat(name=Lucene80), number_l_ni_t=DocValuesFormat(name=Lucene80), number_i_ni_p=DocValuesFormat(name=Asserting), number_dt_ni_p=DocValuesFormat(name=Lucene80), number_f_ni_p=DocValuesFormat(name=Direct), number_i_ni_t=DocValuesFormat(name=Asserting), number_dt_ni_t=DocValuesFormat(name=Lucene80), field3_l_p=DocValuesFormat(name=Direct), number_d_p=DocValuesFormat(name=Direct), field7_i_p=DocValuesFormat(name=Asserting), number_l_ni_p=DocValuesFormat(name=Lucene80)}, maxPointsInLeafNode=607, maxMBSortInHeap=7.3333593126983745, sim=Asserting(org.apache.lucene.search.similarities.AssertingSimilarity@1cd431ec), locale=en-SC, timezone=America/Indiana/Knox
   [junit4]   2> NOTE: Linux 4.18.0-25-generic amd64/AdoptOpenJDK 11.0.3 (64-bit)/cpus=8,threads=1,free=475885800,total=523763712
   [junit4]   2> NOTE: All tests run in this JVM: [TestExportWriter, TestExportWriter]
   [junit4] Completed [5/5 (5!)] on J1 in 3.28s, 9 tests, 1 failure <<< FAILURES!

[...truncated 15 lines...]
BUILD FAILED
/home/jenkins/workspace/Lucene-Solr-8.x-Linux/lucene/common-build.xml:1572: The following error occurred while executing this line:
/home/jenkins/workspace/Lucene-Solr-8.x-Linux/lucene/common-build.xml:1099: There were test failures: 5 suites, 45 tests, 5 failures [seed: DB51704BFD0EEEBB]

Total time: 18 seconds

[repro] Setting last failure code to 256

[repro] Failures:
[repro]   5/5 failed: org.apache.solr.handler.export.TestExportWriter
[repro] Exiting with code 256
+ mv lucene/build lucene/build.repro
+ mv solr/build solr/build.repro
+ mv lucene/build.orig lucene/build
+ mv solr/build.orig solr/build
Archiving artifacts
Setting ANT_1_8_2_HOME=/home/jenkins/tools/hudson.tasks.Ant_AntInstallation/ANT_1.8.2
[WARNINGS] Parsing warnings in console log with parser Java Compiler (javac)
Setting ANT_1_8_2_HOME=/home/jenkins/tools/hudson.tasks.Ant_AntInstallation/ANT_1.8.2
No credentials specified
Setting ANT_1_8_2_HOME=/home/jenkins/tools/hudson.tasks.Ant_AntInstallation/ANT_1.8.2
<Git Blamer> Using GitBlamer to create author and commit information for all warnings.
<Git Blamer> GIT_COMMIT=a229e711cabb6027eecd06e2c9ec92002d2b6949, workspace=/home/jenkins/workspace/Lucene-Solr-8.x-Linux
[WARNINGS] Computing warning deltas based on reference build #934
Recording test results
Setting ANT_1_8_2_HOME=/home/jenkins/tools/hudson.tasks.Ant_AntInstallation/ANT_1.8.2
Build step 'Publish JUnit test result report' changed build result to UNSTABLE
Email was triggered for: Unstable (Test Failures)
Sending email for trigger: Unstable (Test Failures)
Setting ANT_1_8_2_HOME=/home/jenkins/tools/hudson.tasks.Ant_AntInstallation/ANT_1.8.2
Setting ANT_1_8_2_HOME=/home/jenkins/tools/hudson.tasks.Ant_AntInstallation/ANT_1.8.2
Setting ANT_1_8_2_HOME=/home/jenkins/tools/hudson.tasks.Ant_AntInstallation/ANT_1.8.2
Setting ANT_1_8_2_HOME=/home/jenkins/tools/hudson.tasks.Ant_AntInstallation/ANT_1.8.2
Setting ANT_1_8_2_HOME=/home/jenkins/tools/hudson.tasks.Ant_AntInstallation/ANT_1.8.2
Setting ANT_1_8_2_HOME=/home/jenkins/tools/hudson.tasks.Ant_AntInstallation/ANT_1.8.2

Mime
View raw message