lucene-dev mailing list archives

Site index · List index
Message view « Date » · « Thread »
Top « Date » · « Thread »
From Apache Jenkins Server <jenk...@builds.apache.org>
Subject [JENKINS] Lucene-Solr-NightlyTests-master - Build # 1887 - Still Unstable
Date Tue, 02 Jul 2019 19:38:13 GMT
Build: https://builds.apache.org/job/Lucene-Solr-NightlyTests-master/1887/

4 tests failed.
FAILED:  org.apache.lucene.search.TestDocValuesRewriteMethod.testRegexps

Error Message:
Hit 9 docnumbers don't match Hits length1=12 length2=12 hit=0: doc128=1.0 shardIndex=0,  doc128=1.0 shardIndex=0 hit=1: doc229=1.0 shardIndex=0,  doc229=1.0 shardIndex=0 hit=2: doc277=1.0 shardIndex=0,  doc277=1.0 shardIndex=0 hit=3: doc349=1.0 shardIndex=0,  doc349=1.0 shardIndex=0 hit=4: doc513=1.0 shardIndex=0,  doc513=1.0 shardIndex=0 hit=5: doc519=1.0 shardIndex=0,  doc519=1.0 shardIndex=0 hit=6: doc559=1.0 shardIndex=0,  doc559=1.0 shardIndex=0 hit=7: doc569=1.0 shardIndex=0,  doc569=1.0 shardIndex=0 hit=8: doc614=1.0 shardIndex=0,  doc614=1.0 shardIndex=0 hit=9: doc798=1.0 shardIndex=0,  doc860=1.0 shardIndex=0 hit=10: doc811=1.0 shardIndex=0,  doc798=1.0 shardIndex=1 hit=11: doc860=1.0 shardIndex=0,  doc811=1.0 shardIndex=1 for query:/.[])-|.ʳ[c)󈔐]/

Stack Trace:
junit.framework.AssertionFailedError: Hit 9 docnumbers don't match
Hits length1=12	length2=12
hit=0: doc128=1.0 shardIndex=0,	 doc128=1.0 shardIndex=0
hit=1: doc229=1.0 shardIndex=0,	 doc229=1.0 shardIndex=0
hit=2: doc277=1.0 shardIndex=0,	 doc277=1.0 shardIndex=0
hit=3: doc349=1.0 shardIndex=0,	 doc349=1.0 shardIndex=0
hit=4: doc513=1.0 shardIndex=0,	 doc513=1.0 shardIndex=0
hit=5: doc519=1.0 shardIndex=0,	 doc519=1.0 shardIndex=0
hit=6: doc559=1.0 shardIndex=0,	 doc559=1.0 shardIndex=0
hit=7: doc569=1.0 shardIndex=0,	 doc569=1.0 shardIndex=0
hit=8: doc614=1.0 shardIndex=0,	 doc614=1.0 shardIndex=0
hit=9: doc798=1.0 shardIndex=0,	 doc860=1.0 shardIndex=0
hit=10: doc811=1.0 shardIndex=0,	 doc798=1.0 shardIndex=1
hit=11: doc860=1.0 shardIndex=0,	 doc811=1.0 shardIndex=1
for query:/.[])-|.ʳ[c)󈔐]/
	at __randomizedtesting.SeedInfo.seed([7D502B21292D7EEA:9C0C6A30F7872962]:0)
	at junit.framework.Assert.fail(Assert.java:57)
	at org.apache.lucene.search.CheckHits.checkEqual(CheckHits.java:205)
	at org.apache.lucene.search.TestDocValuesRewriteMethod.assertSame(TestDocValuesRewriteMethod.java:124)
	at org.apache.lucene.search.TestDocValuesRewriteMethod.testRegexps(TestDocValuesRewriteMethod.java:109)
	at java.base/jdk.internal.reflect.NativeMethodAccessorImpl.invoke0(Native Method)
	at java.base/jdk.internal.reflect.NativeMethodAccessorImpl.invoke(NativeMethodAccessorImpl.java:62)
	at java.base/jdk.internal.reflect.DelegatingMethodAccessorImpl.invoke(DelegatingMethodAccessorImpl.java:43)
	at java.base/java.lang.reflect.Method.invoke(Method.java:566)
	at com.carrotsearch.randomizedtesting.RandomizedRunner.invoke(RandomizedRunner.java:1750)
	at com.carrotsearch.randomizedtesting.RandomizedRunner$8.evaluate(RandomizedRunner.java:938)
	at com.carrotsearch.randomizedtesting.RandomizedRunner$9.evaluate(RandomizedRunner.java:974)
	at com.carrotsearch.randomizedtesting.RandomizedRunner$10.evaluate(RandomizedRunner.java:988)
	at org.apache.lucene.util.TestRuleSetupTeardownChained$1.evaluate(TestRuleSetupTeardownChained.java:49)
	at org.apache.lucene.util.AbstractBeforeAfterRule$1.evaluate(AbstractBeforeAfterRule.java:45)
	at org.apache.lucene.util.TestRuleThreadAndTestName$1.evaluate(TestRuleThreadAndTestName.java:48)
	at org.apache.lucene.util.TestRuleIgnoreAfterMaxFailures$1.evaluate(TestRuleIgnoreAfterMaxFailures.java:64)
	at org.apache.lucene.util.TestRuleMarkFailure$1.evaluate(TestRuleMarkFailure.java:47)
	at com.carrotsearch.randomizedtesting.rules.StatementAdapter.evaluate(StatementAdapter.java:36)
	at com.carrotsearch.randomizedtesting.ThreadLeakControl$StatementRunner.run(ThreadLeakControl.java:368)
	at com.carrotsearch.randomizedtesting.ThreadLeakControl.forkTimeoutingTask(ThreadLeakControl.java:817)
	at com.carrotsearch.randomizedtesting.ThreadLeakControl$3.evaluate(ThreadLeakControl.java:468)
	at com.carrotsearch.randomizedtesting.RandomizedRunner.runSingleTest(RandomizedRunner.java:947)
	at com.carrotsearch.randomizedtesting.RandomizedRunner$5.evaluate(RandomizedRunner.java:832)
	at com.carrotsearch.randomizedtesting.RandomizedRunner$6.evaluate(RandomizedRunner.java:883)
	at com.carrotsearch.randomizedtesting.RandomizedRunner$7.evaluate(RandomizedRunner.java:894)
	at org.apache.lucene.util.AbstractBeforeAfterRule$1.evaluate(AbstractBeforeAfterRule.java:45)
	at com.carrotsearch.randomizedtesting.rules.StatementAdapter.evaluate(StatementAdapter.java:36)
	at org.apache.lucene.util.TestRuleStoreClassName$1.evaluate(TestRuleStoreClassName.java:41)
	at com.carrotsearch.randomizedtesting.rules.NoShadowingOrOverridesOnMethodsRule$1.evaluate(NoShadowingOrOverridesOnMethodsRule.java:40)
	at com.carrotsearch.randomizedtesting.rules.NoShadowingOrOverridesOnMethodsRule$1.evaluate(NoShadowingOrOverridesOnMethodsRule.java:40)
	at com.carrotsearch.randomizedtesting.rules.StatementAdapter.evaluate(StatementAdapter.java:36)
	at com.carrotsearch.randomizedtesting.rules.StatementAdapter.evaluate(StatementAdapter.java:36)
	at org.apache.lucene.util.TestRuleAssertionsRequired$1.evaluate(TestRuleAssertionsRequired.java:53)
	at org.apache.lucene.util.TestRuleMarkFailure$1.evaluate(TestRuleMarkFailure.java:47)
	at org.apache.lucene.util.TestRuleIgnoreAfterMaxFailures$1.evaluate(TestRuleIgnoreAfterMaxFailures.java:64)
	at org.apache.lucene.util.TestRuleIgnoreTestSuites$1.evaluate(TestRuleIgnoreTestSuites.java:54)
	at com.carrotsearch.randomizedtesting.rules.StatementAdapter.evaluate(StatementAdapter.java:36)
	at com.carrotsearch.randomizedtesting.ThreadLeakControl$StatementRunner.run(ThreadLeakControl.java:368)
	at java.base/java.lang.Thread.run(Thread.java:834)


FAILED:  org.apache.solr.cloud.api.collections.ShardSplitTest.testSplitWithChaosMonkey

Error Message:
Address already in use

Stack Trace:
java.net.BindException: Address already in use
	at __randomizedtesting.SeedInfo.seed([138729404C1FE31:8A1FA14545C755B5]:0)
	at java.base/sun.nio.ch.Net.bind0(Native Method)
	at java.base/sun.nio.ch.Net.bind(Net.java:461)
	at java.base/sun.nio.ch.Net.bind(Net.java:453)
	at java.base/sun.nio.ch.ServerSocketChannelImpl.bind(ServerSocketChannelImpl.java:227)
	at java.base/sun.nio.ch.ServerSocketAdaptor.bind(ServerSocketAdaptor.java:80)
	at org.eclipse.jetty.server.ServerConnector.openAcceptChannel(ServerConnector.java:342)
	at org.eclipse.jetty.server.ServerConnector.open(ServerConnector.java:308)
	at org.eclipse.jetty.server.AbstractNetworkConnector.doStart(AbstractNetworkConnector.java:80)
	at org.eclipse.jetty.server.ServerConnector.doStart(ServerConnector.java:236)
	at org.eclipse.jetty.util.component.AbstractLifeCycle.start(AbstractLifeCycle.java:68)
	at org.eclipse.jetty.server.Server.doStart(Server.java:396)
	at org.eclipse.jetty.util.component.AbstractLifeCycle.start(AbstractLifeCycle.java:68)
	at org.apache.solr.client.solrj.embedded.JettySolrRunner.retryOnPortBindFailure(JettySolrRunner.java:558)
	at org.apache.solr.client.solrj.embedded.JettySolrRunner.start(JettySolrRunner.java:497)
	at org.apache.solr.client.solrj.embedded.JettySolrRunner.start(JettySolrRunner.java:465)
	at org.apache.solr.cloud.api.collections.ShardSplitTest.testSplitWithChaosMonkey(ShardSplitTest.java:499)
	at java.base/jdk.internal.reflect.NativeMethodAccessorImpl.invoke0(Native Method)
	at java.base/jdk.internal.reflect.NativeMethodAccessorImpl.invoke(NativeMethodAccessorImpl.java:62)
	at java.base/jdk.internal.reflect.DelegatingMethodAccessorImpl.invoke(DelegatingMethodAccessorImpl.java:43)
	at java.base/java.lang.reflect.Method.invoke(Method.java:566)
	at com.carrotsearch.randomizedtesting.RandomizedRunner.invoke(RandomizedRunner.java:1750)
	at com.carrotsearch.randomizedtesting.RandomizedRunner$8.evaluate(RandomizedRunner.java:938)
	at com.carrotsearch.randomizedtesting.RandomizedRunner$9.evaluate(RandomizedRunner.java:974)
	at com.carrotsearch.randomizedtesting.RandomizedRunner$10.evaluate(RandomizedRunner.java:988)
	at org.apache.solr.BaseDistributedSearchTestCase$ShardsRepeatRule$ShardsFixedStatement.callStatement(BaseDistributedSearchTestCase.java:1082)
	at org.apache.solr.BaseDistributedSearchTestCase$ShardsRepeatRule$ShardsStatement.evaluate(BaseDistributedSearchTestCase.java:1054)
	at com.carrotsearch.randomizedtesting.rules.SystemPropertiesRestoreRule$1.evaluate(SystemPropertiesRestoreRule.java:57)
	at org.apache.lucene.util.TestRuleSetupTeardownChained$1.evaluate(TestRuleSetupTeardownChained.java:49)
	at org.apache.lucene.util.AbstractBeforeAfterRule$1.evaluate(AbstractBeforeAfterRule.java:45)
	at org.apache.lucene.util.TestRuleThreadAndTestName$1.evaluate(TestRuleThreadAndTestName.java:48)
	at org.apache.lucene.util.TestRuleIgnoreAfterMaxFailures$1.evaluate(TestRuleIgnoreAfterMaxFailures.java:64)
	at org.apache.lucene.util.TestRuleMarkFailure$1.evaluate(TestRuleMarkFailure.java:47)
	at com.carrotsearch.randomizedtesting.rules.StatementAdapter.evaluate(StatementAdapter.java:36)
	at com.carrotsearch.randomizedtesting.ThreadLeakControl$StatementRunner.run(ThreadLeakControl.java:368)
	at com.carrotsearch.randomizedtesting.ThreadLeakControl.forkTimeoutingTask(ThreadLeakControl.java:817)
	at com.carrotsearch.randomizedtesting.ThreadLeakControl$3.evaluate(ThreadLeakControl.java:468)
	at com.carrotsearch.randomizedtesting.RandomizedRunner.runSingleTest(RandomizedRunner.java:947)
	at com.carrotsearch.randomizedtesting.RandomizedRunner$5.evaluate(RandomizedRunner.java:832)
	at com.carrotsearch.randomizedtesting.RandomizedRunner$6.evaluate(RandomizedRunner.java:883)
	at com.carrotsearch.randomizedtesting.RandomizedRunner$7.evaluate(RandomizedRunner.java:894)
	at com.carrotsearch.randomizedtesting.rules.StatementAdapter.evaluate(StatementAdapter.java:36)
	at com.carrotsearch.randomizedtesting.rules.SystemPropertiesRestoreRule$1.evaluate(SystemPropertiesRestoreRule.java:57)
	at org.apache.lucene.util.AbstractBeforeAfterRule$1.evaluate(AbstractBeforeAfterRule.java:45)
	at com.carrotsearch.randomizedtesting.rules.StatementAdapter.evaluate(StatementAdapter.java:36)
	at org.apache.lucene.util.TestRuleStoreClassName$1.evaluate(TestRuleStoreClassName.java:41)
	at com.carrotsearch.randomizedtesting.rules.NoShadowingOrOverridesOnMethodsRule$1.evaluate(NoShadowingOrOverridesOnMethodsRule.java:40)
	at com.carrotsearch.randomizedtesting.rules.NoShadowingOrOverridesOnMethodsRule$1.evaluate(NoShadowingOrOverridesOnMethodsRule.java:40)
	at com.carrotsearch.randomizedtesting.rules.StatementAdapter.evaluate(StatementAdapter.java:36)
	at com.carrotsearch.randomizedtesting.rules.StatementAdapter.evaluate(StatementAdapter.java:36)
	at org.apache.lucene.util.TestRuleAssertionsRequired$1.evaluate(TestRuleAssertionsRequired.java:53)
	at org.apache.lucene.util.TestRuleMarkFailure$1.evaluate(TestRuleMarkFailure.java:47)
	at org.apache.lucene.util.TestRuleIgnoreAfterMaxFailures$1.evaluate(TestRuleIgnoreAfterMaxFailures.java:64)
	at org.apache.lucene.util.TestRuleIgnoreTestSuites$1.evaluate(TestRuleIgnoreTestSuites.java:54)
	at com.carrotsearch.randomizedtesting.rules.StatementAdapter.evaluate(StatementAdapter.java:36)
	at com.carrotsearch.randomizedtesting.ThreadLeakControl$StatementRunner.run(ThreadLeakControl.java:368)
	at java.base/java.lang.Thread.run(Thread.java:834)


FAILED:  junit.framework.TestSuite.org.apache.solr.cloud.api.collections.ShardSplitTest

Error Message:
10 threads leaked from SUITE scope at org.apache.solr.cloud.api.collections.ShardSplitTest:     1) Thread[id=80055, name=qtp1756965306-80055, state=TIMED_WAITING, group=TGRP-ShardSplitTest]         at java.base@11.0.1/jdk.internal.misc.Unsafe.park(Native Method)         at java.base@11.0.1/java.util.concurrent.locks.LockSupport.parkNanos(LockSupport.java:234)         at java.base@11.0.1/java.util.concurrent.locks.AbstractQueuedSynchronizer$ConditionObject.awaitNanos(AbstractQueuedSynchronizer.java:2123)         at app//org.eclipse.jetty.util.BlockingArrayQueue.poll(BlockingArrayQueue.java:392)         at app//org.eclipse.jetty.util.thread.QueuedThreadPool$Runner.idleJobPoll(QueuedThreadPool.java:850)         at app//org.eclipse.jetty.util.thread.QueuedThreadPool$Runner.run(QueuedThreadPool.java:889)         at java.base@11.0.1/java.lang.Thread.run(Thread.java:834)    2) Thread[id=80051, name=qtp1756965306-80051, state=RUNNABLE, group=TGRP-ShardSplitTest]         at java.base@11.0.1/sun.nio.ch.EPoll.wait(Native Method)         at java.base@11.0.1/sun.nio.ch.EPollSelectorImpl.doSelect(EPollSelectorImpl.java:120)         at java.base@11.0.1/sun.nio.ch.SelectorImpl.lockAndDoSelect(SelectorImpl.java:124)         at java.base@11.0.1/sun.nio.ch.SelectorImpl.select(SelectorImpl.java:141)         at app//org.eclipse.jetty.io.ManagedSelector$SelectorProducer.select(ManagedSelector.java:464)         at app//org.eclipse.jetty.io.ManagedSelector$SelectorProducer.produce(ManagedSelector.java:401)         at app//org.eclipse.jetty.util.thread.strategy.EatWhatYouKill.produceTask(EatWhatYouKill.java:357)         at app//org.eclipse.jetty.util.thread.strategy.EatWhatYouKill.doProduce(EatWhatYouKill.java:181)         at app//org.eclipse.jetty.util.thread.strategy.EatWhatYouKill.tryProduce(EatWhatYouKill.java:168)         at app//org.eclipse.jetty.util.thread.strategy.EatWhatYouKill.produce(EatWhatYouKill.java:132)         at app//org.eclipse.jetty.io.ManagedSelector$$Lambda$192/0x0000000100528c40.run(Unknown Source)         at app//org.eclipse.jetty.util.thread.QueuedThreadPool.runJob(QueuedThreadPool.java:781)         at app//org.eclipse.jetty.util.thread.QueuedThreadPool$Runner.run(QueuedThreadPool.java:917)         at java.base@11.0.1/java.lang.Thread.run(Thread.java:834)    3) Thread[id=80056, name=qtp1756965306-80056, state=TIMED_WAITING, group=TGRP-ShardSplitTest]         at java.base@11.0.1/jdk.internal.misc.Unsafe.park(Native Method)         at java.base@11.0.1/java.util.concurrent.locks.LockSupport.parkNanos(LockSupport.java:234)         at java.base@11.0.1/java.util.concurrent.locks.AbstractQueuedSynchronizer$ConditionObject.awaitNanos(AbstractQueuedSynchronizer.java:2123)         at app//org.eclipse.jetty.util.BlockingArrayQueue.poll(BlockingArrayQueue.java:392)         at app//org.eclipse.jetty.util.thread.QueuedThreadPool$Runner.idleJobPoll(QueuedThreadPool.java:850)         at app//org.eclipse.jetty.util.thread.QueuedThreadPool$Runner.run(QueuedThreadPool.java:889)         at java.base@11.0.1/java.lang.Thread.run(Thread.java:834)    4) Thread[id=80176, name=Connector-Scheduler-6c86a075, state=WAITING, group=TGRP-ShardSplitTest]         at java.base@11.0.1/jdk.internal.misc.Unsafe.park(Native Method)         at java.base@11.0.1/java.util.concurrent.locks.LockSupport.park(LockSupport.java:194)         at java.base@11.0.1/java.util.concurrent.locks.AbstractQueuedSynchronizer$ConditionObject.await(AbstractQueuedSynchronizer.java:2081)         at java.base@11.0.1/java.util.concurrent.ScheduledThreadPoolExecutor$DelayedWorkQueue.take(ScheduledThreadPoolExecutor.java:1170)         at java.base@11.0.1/java.util.concurrent.ScheduledThreadPoolExecutor$DelayedWorkQueue.take(ScheduledThreadPoolExecutor.java:899)         at java.base@11.0.1/java.util.concurrent.ThreadPoolExecutor.getTask(ThreadPoolExecutor.java:1054)         at java.base@11.0.1/java.util.concurrent.ThreadPoolExecutor.runWorker(ThreadPoolExecutor.java:1114)         at java.base@11.0.1/java.util.concurrent.ThreadPoolExecutor$Worker.run(ThreadPoolExecutor.java:628)         at java.base@11.0.1/java.lang.Thread.run(Thread.java:834)    5) Thread[id=80058, name=qtp1756965306-80058, state=TIMED_WAITING, group=TGRP-ShardSplitTest]         at java.base@11.0.1/jdk.internal.misc.Unsafe.park(Native Method)         at java.base@11.0.1/java.util.concurrent.locks.LockSupport.parkNanos(LockSupport.java:234)         at java.base@11.0.1/java.util.concurrent.locks.AbstractQueuedSynchronizer$ConditionObject.awaitNanos(AbstractQueuedSynchronizer.java:2123)         at app//org.eclipse.jetty.util.BlockingArrayQueue.poll(BlockingArrayQueue.java:392)         at app//org.eclipse.jetty.util.thread.QueuedThreadPool$Runner.idleJobPoll(QueuedThreadPool.java:850)         at app//org.eclipse.jetty.util.thread.QueuedThreadPool$Runner.run(QueuedThreadPool.java:889)         at java.base@11.0.1/java.lang.Thread.run(Thread.java:834)    6) Thread[id=80052, name=qtp1756965306-80052, state=RUNNABLE, group=TGRP-ShardSplitTest]         at java.base@11.0.1/sun.nio.ch.EPoll.wait(Native Method)         at java.base@11.0.1/sun.nio.ch.EPollSelectorImpl.doSelect(EPollSelectorImpl.java:120)         at java.base@11.0.1/sun.nio.ch.SelectorImpl.lockAndDoSelect(SelectorImpl.java:124)         at java.base@11.0.1/sun.nio.ch.SelectorImpl.select(SelectorImpl.java:141)         at app//org.eclipse.jetty.io.ManagedSelector$SelectorProducer.select(ManagedSelector.java:464)         at app//org.eclipse.jetty.io.ManagedSelector$SelectorProducer.produce(ManagedSelector.java:401)         at app//org.eclipse.jetty.util.thread.strategy.EatWhatYouKill.produceTask(EatWhatYouKill.java:357)         at app//org.eclipse.jetty.util.thread.strategy.EatWhatYouKill.doProduce(EatWhatYouKill.java:181)         at app//org.eclipse.jetty.util.thread.strategy.EatWhatYouKill.tryProduce(EatWhatYouKill.java:168)         at app//org.eclipse.jetty.util.thread.strategy.EatWhatYouKill.produce(EatWhatYouKill.java:132)         at app//org.eclipse.jetty.io.ManagedSelector$$Lambda$192/0x0000000100528c40.run(Unknown Source)         at app//org.eclipse.jetty.util.thread.QueuedThreadPool.runJob(QueuedThreadPool.java:781)         at app//org.eclipse.jetty.util.thread.QueuedThreadPool$Runner.run(QueuedThreadPool.java:917)         at java.base@11.0.1/java.lang.Thread.run(Thread.java:834)    7) Thread[id=80057, name=qtp1756965306-80057, state=TIMED_WAITING, group=TGRP-ShardSplitTest]         at java.base@11.0.1/jdk.internal.misc.Unsafe.park(Native Method)         at java.base@11.0.1/java.util.concurrent.locks.LockSupport.parkNanos(LockSupport.java:234)         at java.base@11.0.1/java.util.concurrent.locks.AbstractQueuedSynchronizer$ConditionObject.awaitNanos(AbstractQueuedSynchronizer.java:2123)         at app//org.eclipse.jetty.util.BlockingArrayQueue.poll(BlockingArrayQueue.java:392)         at app//org.eclipse.jetty.util.thread.QueuedThreadPool$Runner.idleJobPoll(QueuedThreadPool.java:850)         at app//org.eclipse.jetty.util.thread.QueuedThreadPool$Runner.run(QueuedThreadPool.java:889)         at java.base@11.0.1/java.lang.Thread.run(Thread.java:834)    8) Thread[id=80053, name=qtp1756965306-80053-acceptor-0@12fb0ce6-ServerConnector@6c86a075{HTTP/1.1,[http/1.1, h2c]}{127.0.0.1:35132}, state=RUNNABLE, group=TGRP-ShardSplitTest]         at java.base@11.0.1/sun.nio.ch.ServerSocketChannelImpl.accept0(Native Method)         at java.base@11.0.1/sun.nio.ch.ServerSocketChannelImpl.accept(ServerSocketChannelImpl.java:533)         at java.base@11.0.1/sun.nio.ch.ServerSocketChannelImpl.accept(ServerSocketChannelImpl.java:285)         at app//org.eclipse.jetty.server.ServerConnector.accept(ServerConnector.java:385)         at app//org.eclipse.jetty.server.AbstractConnector$Acceptor.run(AbstractConnector.java:648)         at app//org.eclipse.jetty.util.thread.QueuedThreadPool.runJob(QueuedThreadPool.java:781)         at app//org.eclipse.jetty.util.thread.QueuedThreadPool$Runner.run(QueuedThreadPool.java:917)         at java.base@11.0.1/java.lang.Thread.run(Thread.java:834)    9) Thread[id=80054, name=qtp1756965306-80054, state=TIMED_WAITING, group=TGRP-ShardSplitTest]         at java.base@11.0.1/jdk.internal.misc.Unsafe.park(Native Method)         at java.base@11.0.1/java.util.concurrent.locks.LockSupport.parkNanos(LockSupport.java:234)         at java.base@11.0.1/java.util.concurrent.locks.AbstractQueuedSynchronizer$ConditionObject.awaitNanos(AbstractQueuedSynchronizer.java:2123)         at app//org.eclipse.jetty.util.BlockingArrayQueue.poll(BlockingArrayQueue.java:392)         at app//org.eclipse.jetty.util.thread.QueuedThreadPool$Runner.idleJobPoll(QueuedThreadPool.java:850)         at app//org.eclipse.jetty.util.thread.QueuedThreadPool$Runner.run(QueuedThreadPool.java:889)         at java.base@11.0.1/java.lang.Thread.run(Thread.java:834)   10) Thread[id=80059, name=Session-HouseKeeper-2c4ebfcb, state=TIMED_WAITING, group=TGRP-ShardSplitTest]         at java.base@11.0.1/jdk.internal.misc.Unsafe.park(Native Method)         at java.base@11.0.1/java.util.concurrent.locks.LockSupport.parkNanos(LockSupport.java:234)         at java.base@11.0.1/java.util.concurrent.locks.AbstractQueuedSynchronizer$ConditionObject.awaitNanos(AbstractQueuedSynchronizer.java:2123)         at java.base@11.0.1/java.util.concurrent.ScheduledThreadPoolExecutor$DelayedWorkQueue.take(ScheduledThreadPoolExecutor.java:1182)         at java.base@11.0.1/java.util.concurrent.ScheduledThreadPoolExecutor$DelayedWorkQueue.take(ScheduledThreadPoolExecutor.java:899)         at java.base@11.0.1/java.util.concurrent.ThreadPoolExecutor.getTask(ThreadPoolExecutor.java:1054)         at java.base@11.0.1/java.util.concurrent.ThreadPoolExecutor.runWorker(ThreadPoolExecutor.java:1114)         at java.base@11.0.1/java.util.concurrent.ThreadPoolExecutor$Worker.run(ThreadPoolExecutor.java:628)         at java.base@11.0.1/java.lang.Thread.run(Thread.java:834)

Stack Trace:
com.carrotsearch.randomizedtesting.ThreadLeakError: 10 threads leaked from SUITE scope at org.apache.solr.cloud.api.collections.ShardSplitTest: 
   1) Thread[id=80055, name=qtp1756965306-80055, state=TIMED_WAITING, group=TGRP-ShardSplitTest]
        at java.base@11.0.1/jdk.internal.misc.Unsafe.park(Native Method)
        at java.base@11.0.1/java.util.concurrent.locks.LockSupport.parkNanos(LockSupport.java:234)
        at java.base@11.0.1/java.util.concurrent.locks.AbstractQueuedSynchronizer$ConditionObject.awaitNanos(AbstractQueuedSynchronizer.java:2123)
        at app//org.eclipse.jetty.util.BlockingArrayQueue.poll(BlockingArrayQueue.java:392)
        at app//org.eclipse.jetty.util.thread.QueuedThreadPool$Runner.idleJobPoll(QueuedThreadPool.java:850)
        at app//org.eclipse.jetty.util.thread.QueuedThreadPool$Runner.run(QueuedThreadPool.java:889)
        at java.base@11.0.1/java.lang.Thread.run(Thread.java:834)
   2) Thread[id=80051, name=qtp1756965306-80051, state=RUNNABLE, group=TGRP-ShardSplitTest]
        at java.base@11.0.1/sun.nio.ch.EPoll.wait(Native Method)
        at java.base@11.0.1/sun.nio.ch.EPollSelectorImpl.doSelect(EPollSelectorImpl.java:120)
        at java.base@11.0.1/sun.nio.ch.SelectorImpl.lockAndDoSelect(SelectorImpl.java:124)
        at java.base@11.0.1/sun.nio.ch.SelectorImpl.select(SelectorImpl.java:141)
        at app//org.eclipse.jetty.io.ManagedSelector$SelectorProducer.select(ManagedSelector.java:464)
        at app//org.eclipse.jetty.io.ManagedSelector$SelectorProducer.produce(ManagedSelector.java:401)
        at app//org.eclipse.jetty.util.thread.strategy.EatWhatYouKill.produceTask(EatWhatYouKill.java:357)
        at app//org.eclipse.jetty.util.thread.strategy.EatWhatYouKill.doProduce(EatWhatYouKill.java:181)
        at app//org.eclipse.jetty.util.thread.strategy.EatWhatYouKill.tryProduce(EatWhatYouKill.java:168)
        at app//org.eclipse.jetty.util.thread.strategy.EatWhatYouKill.produce(EatWhatYouKill.java:132)
        at app//org.eclipse.jetty.io.ManagedSelector$$Lambda$192/0x0000000100528c40.run(Unknown Source)
        at app//org.eclipse.jetty.util.thread.QueuedThreadPool.runJob(QueuedThreadPool.java:781)
        at app//org.eclipse.jetty.util.thread.QueuedThreadPool$Runner.run(QueuedThreadPool.java:917)
        at java.base@11.0.1/java.lang.Thread.run(Thread.java:834)
   3) Thread[id=80056, name=qtp1756965306-80056, state=TIMED_WAITING, group=TGRP-ShardSplitTest]
        at java.base@11.0.1/jdk.internal.misc.Unsafe.park(Native Method)
        at java.base@11.0.1/java.util.concurrent.locks.LockSupport.parkNanos(LockSupport.java:234)
        at java.base@11.0.1/java.util.concurrent.locks.AbstractQueuedSynchronizer$ConditionObject.awaitNanos(AbstractQueuedSynchronizer.java:2123)
        at app//org.eclipse.jetty.util.BlockingArrayQueue.poll(BlockingArrayQueue.java:392)
        at app//org.eclipse.jetty.util.thread.QueuedThreadPool$Runner.idleJobPoll(QueuedThreadPool.java:850)
        at app//org.eclipse.jetty.util.thread.QueuedThreadPool$Runner.run(QueuedThreadPool.java:889)
        at java.base@11.0.1/java.lang.Thread.run(Thread.java:834)
   4) Thread[id=80176, name=Connector-Scheduler-6c86a075, state=WAITING, group=TGRP-ShardSplitTest]
        at java.base@11.0.1/jdk.internal.misc.Unsafe.park(Native Method)
        at java.base@11.0.1/java.util.concurrent.locks.LockSupport.park(LockSupport.java:194)
        at java.base@11.0.1/java.util.concurrent.locks.AbstractQueuedSynchronizer$ConditionObject.await(AbstractQueuedSynchronizer.java:2081)
        at java.base@11.0.1/java.util.concurrent.ScheduledThreadPoolExecutor$DelayedWorkQueue.take(ScheduledThreadPoolExecutor.java:1170)
        at java.base@11.0.1/java.util.concurrent.ScheduledThreadPoolExecutor$DelayedWorkQueue.take(ScheduledThreadPoolExecutor.java:899)
        at java.base@11.0.1/java.util.concurrent.ThreadPoolExecutor.getTask(ThreadPoolExecutor.java:1054)
        at java.base@11.0.1/java.util.concurrent.ThreadPoolExecutor.runWorker(ThreadPoolExecutor.java:1114)
        at java.base@11.0.1/java.util.concurrent.ThreadPoolExecutor$Worker.run(ThreadPoolExecutor.java:628)
        at java.base@11.0.1/java.lang.Thread.run(Thread.java:834)
   5) Thread[id=80058, name=qtp1756965306-80058, state=TIMED_WAITING, group=TGRP-ShardSplitTest]
        at java.base@11.0.1/jdk.internal.misc.Unsafe.park(Native Method)
        at java.base@11.0.1/java.util.concurrent.locks.LockSupport.parkNanos(LockSupport.java:234)
        at java.base@11.0.1/java.util.concurrent.locks.AbstractQueuedSynchronizer$ConditionObject.awaitNanos(AbstractQueuedSynchronizer.java:2123)
        at app//org.eclipse.jetty.util.BlockingArrayQueue.poll(BlockingArrayQueue.java:392)
        at app//org.eclipse.jetty.util.thread.QueuedThreadPool$Runner.idleJobPoll(QueuedThreadPool.java:850)
        at app//org.eclipse.jetty.util.thread.QueuedThreadPool$Runner.run(QueuedThreadPool.java:889)
        at java.base@11.0.1/java.lang.Thread.run(Thread.java:834)
   6) Thread[id=80052, name=qtp1756965306-80052, state=RUNNABLE, group=TGRP-ShardSplitTest]
        at java.base@11.0.1/sun.nio.ch.EPoll.wait(Native Method)
        at java.base@11.0.1/sun.nio.ch.EPollSelectorImpl.doSelect(EPollSelectorImpl.java:120)
        at java.base@11.0.1/sun.nio.ch.SelectorImpl.lockAndDoSelect(SelectorImpl.java:124)
        at java.base@11.0.1/sun.nio.ch.SelectorImpl.select(SelectorImpl.java:141)
        at app//org.eclipse.jetty.io.ManagedSelector$SelectorProducer.select(ManagedSelector.java:464)
        at app//org.eclipse.jetty.io.ManagedSelector$SelectorProducer.produce(ManagedSelector.java:401)
        at app//org.eclipse.jetty.util.thread.strategy.EatWhatYouKill.produceTask(EatWhatYouKill.java:357)
        at app//org.eclipse.jetty.util.thread.strategy.EatWhatYouKill.doProduce(EatWhatYouKill.java:181)
        at app//org.eclipse.jetty.util.thread.strategy.EatWhatYouKill.tryProduce(EatWhatYouKill.java:168)
        at app//org.eclipse.jetty.util.thread.strategy.EatWhatYouKill.produce(EatWhatYouKill.java:132)
        at app//org.eclipse.jetty.io.ManagedSelector$$Lambda$192/0x0000000100528c40.run(Unknown Source)
        at app//org.eclipse.jetty.util.thread.QueuedThreadPool.runJob(QueuedThreadPool.java:781)
        at app//org.eclipse.jetty.util.thread.QueuedThreadPool$Runner.run(QueuedThreadPool.java:917)
        at java.base@11.0.1/java.lang.Thread.run(Thread.java:834)
   7) Thread[id=80057, name=qtp1756965306-80057, state=TIMED_WAITING, group=TGRP-ShardSplitTest]
        at java.base@11.0.1/jdk.internal.misc.Unsafe.park(Native Method)
        at java.base@11.0.1/java.util.concurrent.locks.LockSupport.parkNanos(LockSupport.java:234)
        at java.base@11.0.1/java.util.concurrent.locks.AbstractQueuedSynchronizer$ConditionObject.awaitNanos(AbstractQueuedSynchronizer.java:2123)
        at app//org.eclipse.jetty.util.BlockingArrayQueue.poll(BlockingArrayQueue.java:392)
        at app//org.eclipse.jetty.util.thread.QueuedThreadPool$Runner.idleJobPoll(QueuedThreadPool.java:850)
        at app//org.eclipse.jetty.util.thread.QueuedThreadPool$Runner.run(QueuedThreadPool.java:889)
        at java.base@11.0.1/java.lang.Thread.run(Thread.java:834)
   8) Thread[id=80053, name=qtp1756965306-80053-acceptor-0@12fb0ce6-ServerConnector@6c86a075{HTTP/1.1,[http/1.1, h2c]}{127.0.0.1:35132}, state=RUNNABLE, group=TGRP-ShardSplitTest]
        at java.base@11.0.1/sun.nio.ch.ServerSocketChannelImpl.accept0(Native Method)
        at java.base@11.0.1/sun.nio.ch.ServerSocketChannelImpl.accept(ServerSocketChannelImpl.java:533)
        at java.base@11.0.1/sun.nio.ch.ServerSocketChannelImpl.accept(ServerSocketChannelImpl.java:285)
        at app//org.eclipse.jetty.server.ServerConnector.accept(ServerConnector.java:385)
        at app//org.eclipse.jetty.server.AbstractConnector$Acceptor.run(AbstractConnector.java:648)
        at app//org.eclipse.jetty.util.thread.QueuedThreadPool.runJob(QueuedThreadPool.java:781)
        at app//org.eclipse.jetty.util.thread.QueuedThreadPool$Runner.run(QueuedThreadPool.java:917)
        at java.base@11.0.1/java.lang.Thread.run(Thread.java:834)
   9) Thread[id=80054, name=qtp1756965306-80054, state=TIMED_WAITING, group=TGRP-ShardSplitTest]
        at java.base@11.0.1/jdk.internal.misc.Unsafe.park(Native Method)
        at java.base@11.0.1/java.util.concurrent.locks.LockSupport.parkNanos(LockSupport.java:234)
        at java.base@11.0.1/java.util.concurrent.locks.AbstractQueuedSynchronizer$ConditionObject.awaitNanos(AbstractQueuedSynchronizer.java:2123)
        at app//org.eclipse.jetty.util.BlockingArrayQueue.poll(BlockingArrayQueue.java:392)
        at app//org.eclipse.jetty.util.thread.QueuedThreadPool$Runner.idleJobPoll(QueuedThreadPool.java:850)
        at app//org.eclipse.jetty.util.thread.QueuedThreadPool$Runner.run(QueuedThreadPool.java:889)
        at java.base@11.0.1/java.lang.Thread.run(Thread.java:834)
  10) Thread[id=80059, name=Session-HouseKeeper-2c4ebfcb, state=TIMED_WAITING, group=TGRP-ShardSplitTest]
        at java.base@11.0.1/jdk.internal.misc.Unsafe.park(Native Method)
        at java.base@11.0.1/java.util.concurrent.locks.LockSupport.parkNanos(LockSupport.java:234)
        at java.base@11.0.1/java.util.concurrent.locks.AbstractQueuedSynchronizer$ConditionObject.awaitNanos(AbstractQueuedSynchronizer.java:2123)
        at java.base@11.0.1/java.util.concurrent.ScheduledThreadPoolExecutor$DelayedWorkQueue.take(ScheduledThreadPoolExecutor.java:1182)
        at java.base@11.0.1/java.util.concurrent.ScheduledThreadPoolExecutor$DelayedWorkQueue.take(ScheduledThreadPoolExecutor.java:899)
        at java.base@11.0.1/java.util.concurrent.ThreadPoolExecutor.getTask(ThreadPoolExecutor.java:1054)
        at java.base@11.0.1/java.util.concurrent.ThreadPoolExecutor.runWorker(ThreadPoolExecutor.java:1114)
        at java.base@11.0.1/java.util.concurrent.ThreadPoolExecutor$Worker.run(ThreadPoolExecutor.java:628)
        at java.base@11.0.1/java.lang.Thread.run(Thread.java:834)
	at __randomizedtesting.SeedInfo.seed([138729404C1FE31]:0)


FAILED:  junit.framework.TestSuite.org.apache.solr.cloud.api.collections.ShardSplitTest

Error Message:
There are still zombie threads that couldn't be terminated:    1) Thread[id=80056, name=qtp1756965306-80056, state=TIMED_WAITING, group=TGRP-ShardSplitTest]         at java.base@11.0.1/jdk.internal.misc.Unsafe.park(Native Method)         at java.base@11.0.1/java.util.concurrent.locks.LockSupport.parkNanos(LockSupport.java:234)         at java.base@11.0.1/java.util.concurrent.locks.AbstractQueuedSynchronizer$ConditionObject.awaitNanos(AbstractQueuedSynchronizer.java:2123)         at app//org.eclipse.jetty.util.BlockingArrayQueue.poll(BlockingArrayQueue.java:392)         at app//org.eclipse.jetty.util.thread.QueuedThreadPool$Runner.idleJobPoll(QueuedThreadPool.java:850)         at app//org.eclipse.jetty.util.thread.QueuedThreadPool$Runner.run(QueuedThreadPool.java:889)         at java.base@11.0.1/java.lang.Thread.run(Thread.java:834)    2) Thread[id=80055, name=qtp1756965306-80055, state=TIMED_WAITING, group=TGRP-ShardSplitTest]         at java.base@11.0.1/jdk.internal.misc.Unsafe.park(Native Method)         at java.base@11.0.1/java.util.concurrent.locks.LockSupport.parkNanos(LockSupport.java:234)         at java.base@11.0.1/java.util.concurrent.locks.AbstractQueuedSynchronizer$ConditionObject.awaitNanos(AbstractQueuedSynchronizer.java:2123)         at app//org.eclipse.jetty.util.BlockingArrayQueue.poll(BlockingArrayQueue.java:392)         at app//org.eclipse.jetty.util.thread.QueuedThreadPool$Runner.idleJobPoll(QueuedThreadPool.java:850)         at app//org.eclipse.jetty.util.thread.QueuedThreadPool$Runner.run(QueuedThreadPool.java:889)         at java.base@11.0.1/java.lang.Thread.run(Thread.java:834)    3) Thread[id=80176, name=Connector-Scheduler-6c86a075, state=WAITING, group=TGRP-ShardSplitTest]         at java.base@11.0.1/jdk.internal.misc.Unsafe.park(Native Method)         at java.base@11.0.1/java.util.concurrent.locks.LockSupport.park(LockSupport.java:194)         at java.base@11.0.1/java.util.concurrent.locks.AbstractQueuedSynchronizer$ConditionObject.await(AbstractQueuedSynchronizer.java:2081)         at java.base@11.0.1/java.util.concurrent.ScheduledThreadPoolExecutor$DelayedWorkQueue.take(ScheduledThreadPoolExecutor.java:1170)         at java.base@11.0.1/java.util.concurrent.ScheduledThreadPoolExecutor$DelayedWorkQueue.take(ScheduledThreadPoolExecutor.java:899)         at java.base@11.0.1/java.util.concurrent.ThreadPoolExecutor.getTask(ThreadPoolExecutor.java:1054)         at java.base@11.0.1/java.util.concurrent.ThreadPoolExecutor.runWorker(ThreadPoolExecutor.java:1114)         at java.base@11.0.1/java.util.concurrent.ThreadPoolExecutor$Worker.run(ThreadPoolExecutor.java:628)         at java.base@11.0.1/java.lang.Thread.run(Thread.java:834)    4) Thread[id=80058, name=qtp1756965306-80058, state=TIMED_WAITING, group=TGRP-ShardSplitTest]         at java.base@11.0.1/jdk.internal.misc.Unsafe.park(Native Method)         at java.base@11.0.1/java.util.concurrent.locks.LockSupport.parkNanos(LockSupport.java:234)         at java.base@11.0.1/java.util.concurrent.locks.AbstractQueuedSynchronizer$ConditionObject.awaitNanos(AbstractQueuedSynchronizer.java:2123)         at app//org.eclipse.jetty.util.BlockingArrayQueue.poll(BlockingArrayQueue.java:392)         at app//org.eclipse.jetty.util.thread.QueuedThreadPool$Runner.idleJobPoll(QueuedThreadPool.java:850)         at app//org.eclipse.jetty.util.thread.QueuedThreadPool$Runner.run(QueuedThreadPool.java:889)         at java.base@11.0.1/java.lang.Thread.run(Thread.java:834)    5) Thread[id=80051, name=qtp1756965306-80051, state=RUNNABLE, group=TGRP-ShardSplitTest]         at java.base@11.0.1/sun.nio.ch.EPoll.wait(Native Method)         at java.base@11.0.1/sun.nio.ch.EPollSelectorImpl.doSelect(EPollSelectorImpl.java:120)         at java.base@11.0.1/sun.nio.ch.SelectorImpl.lockAndDoSelect(SelectorImpl.java:124)         at java.base@11.0.1/sun.nio.ch.SelectorImpl.select(SelectorImpl.java:141)         at app//org.eclipse.jetty.io.ManagedSelector$SelectorProducer.select(ManagedSelector.java:464)         at app//org.eclipse.jetty.io.ManagedSelector$SelectorProducer.produce(ManagedSelector.java:401)         at app//org.eclipse.jetty.util.thread.strategy.EatWhatYouKill.produceTask(EatWhatYouKill.java:357)         at app//org.eclipse.jetty.util.thread.strategy.EatWhatYouKill.doProduce(EatWhatYouKill.java:181)         at app//org.eclipse.jetty.util.thread.strategy.EatWhatYouKill.tryProduce(EatWhatYouKill.java:168)         at app//org.eclipse.jetty.util.thread.strategy.EatWhatYouKill.produce(EatWhatYouKill.java:132)         at app//org.eclipse.jetty.io.ManagedSelector$$Lambda$192/0x0000000100528c40.run(Unknown Source)         at app//org.eclipse.jetty.util.thread.QueuedThreadPool.runJob(QueuedThreadPool.java:781)         at app//org.eclipse.jetty.util.thread.QueuedThreadPool$Runner.run(QueuedThreadPool.java:917)         at java.base@11.0.1/java.lang.Thread.run(Thread.java:834)    6) Thread[id=80052, name=qtp1756965306-80052, state=RUNNABLE, group=TGRP-ShardSplitTest]         at java.base@11.0.1/sun.nio.ch.EPoll.wait(Native Method)         at java.base@11.0.1/sun.nio.ch.EPollSelectorImpl.doSelect(EPollSelectorImpl.java:120)         at java.base@11.0.1/sun.nio.ch.SelectorImpl.lockAndDoSelect(SelectorImpl.java:124)         at java.base@11.0.1/sun.nio.ch.SelectorImpl.select(SelectorImpl.java:141)         at app//org.eclipse.jetty.io.ManagedSelector$SelectorProducer.select(ManagedSelector.java:464)         at app//org.eclipse.jetty.io.ManagedSelector$SelectorProducer.produce(ManagedSelector.java:401)         at app//org.eclipse.jetty.util.thread.strategy.EatWhatYouKill.produceTask(EatWhatYouKill.java:357)         at app//org.eclipse.jetty.util.thread.strategy.EatWhatYouKill.doProduce(EatWhatYouKill.java:181)         at app//org.eclipse.jetty.util.thread.strategy.EatWhatYouKill.tryProduce(EatWhatYouKill.java:168)         at app//org.eclipse.jetty.util.thread.strategy.EatWhatYouKill.produce(EatWhatYouKill.java:132)         at app//org.eclipse.jetty.io.ManagedSelector$$Lambda$192/0x0000000100528c40.run(Unknown Source)         at app//org.eclipse.jetty.util.thread.QueuedThreadPool.runJob(QueuedThreadPool.java:781)         at app//org.eclipse.jetty.util.thread.QueuedThreadPool$Runner.run(QueuedThreadPool.java:917)         at java.base@11.0.1/java.lang.Thread.run(Thread.java:834)    7) Thread[id=80057, name=qtp1756965306-80057, state=TIMED_WAITING, group=TGRP-ShardSplitTest]         at java.base@11.0.1/jdk.internal.misc.Unsafe.park(Native Method)         at java.base@11.0.1/java.util.concurrent.locks.LockSupport.parkNanos(LockSupport.java:234)         at java.base@11.0.1/java.util.concurrent.locks.AbstractQueuedSynchronizer$ConditionObject.awaitNanos(AbstractQueuedSynchronizer.java:2123)         at app//org.eclipse.jetty.util.BlockingArrayQueue.poll(BlockingArrayQueue.java:392)         at app//org.eclipse.jetty.util.thread.QueuedThreadPool$Runner.idleJobPoll(QueuedThreadPool.java:850)         at app//org.eclipse.jetty.util.thread.QueuedThreadPool$Runner.run(QueuedThreadPool.java:889)         at java.base@11.0.1/java.lang.Thread.run(Thread.java:834)    8) Thread[id=80053, name=qtp1756965306-80053, state=TIMED_WAITING, group=TGRP-ShardSplitTest]         at java.base@11.0.1/jdk.internal.misc.Unsafe.park(Native Method)         at java.base@11.0.1/java.util.concurrent.locks.LockSupport.parkNanos(LockSupport.java:234)         at java.base@11.0.1/java.util.concurrent.locks.AbstractQueuedSynchronizer$ConditionObject.awaitNanos(AbstractQueuedSynchronizer.java:2123)         at app//org.eclipse.jetty.util.BlockingArrayQueue.poll(BlockingArrayQueue.java:392)         at app//org.eclipse.jetty.util.thread.QueuedThreadPool$Runner.idleJobPoll(QueuedThreadPool.java:850)         at app//org.eclipse.jetty.util.thread.QueuedThreadPool$Runner.run(QueuedThreadPool.java:889)         at java.base@11.0.1/java.lang.Thread.run(Thread.java:834)    9) Thread[id=80054, name=qtp1756965306-80054, state=TIMED_WAITING, group=TGRP-ShardSplitTest]         at java.base@11.0.1/jdk.internal.misc.Unsafe.park(Native Method)         at java.base@11.0.1/java.util.concurrent.locks.LockSupport.parkNanos(LockSupport.java:234)         at java.base@11.0.1/java.util.concurrent.locks.AbstractQueuedSynchronizer$ConditionObject.awaitNanos(AbstractQueuedSynchronizer.java:2123)         at app//org.eclipse.jetty.util.BlockingArrayQueue.poll(BlockingArrayQueue.java:392)         at app//org.eclipse.jetty.util.thread.QueuedThreadPool$Runner.idleJobPoll(QueuedThreadPool.java:850)         at app//org.eclipse.jetty.util.thread.QueuedThreadPool$Runner.run(QueuedThreadPool.java:889)         at java.base@11.0.1/java.lang.Thread.run(Thread.java:834)   10) Thread[id=80059, name=Session-HouseKeeper-2c4ebfcb, state=TIMED_WAITING, group=TGRP-ShardSplitTest]         at java.base@11.0.1/jdk.internal.misc.Unsafe.park(Native Method)         at java.base@11.0.1/java.util.concurrent.locks.LockSupport.parkNanos(LockSupport.java:234)         at java.base@11.0.1/java.util.concurrent.locks.AbstractQueuedSynchronizer$ConditionObject.awaitNanos(AbstractQueuedSynchronizer.java:2123)         at java.base@11.0.1/java.util.concurrent.ScheduledThreadPoolExecutor$DelayedWorkQueue.take(ScheduledThreadPoolExecutor.java:1182)         at java.base@11.0.1/java.util.concurrent.ScheduledThreadPoolExecutor$DelayedWorkQueue.take(ScheduledThreadPoolExecutor.java:899)         at java.base@11.0.1/java.util.concurrent.ThreadPoolExecutor.getTask(ThreadPoolExecutor.java:1054)         at java.base@11.0.1/java.util.concurrent.ThreadPoolExecutor.runWorker(ThreadPoolExecutor.java:1114)         at java.base@11.0.1/java.util.concurrent.ThreadPoolExecutor$Worker.run(ThreadPoolExecutor.java:628)         at java.base@11.0.1/java.lang.Thread.run(Thread.java:834)

Stack Trace:
com.carrotsearch.randomizedtesting.ThreadLeakError: There are still zombie threads that couldn't be terminated:
   1) Thread[id=80056, name=qtp1756965306-80056, state=TIMED_WAITING, group=TGRP-ShardSplitTest]
        at java.base@11.0.1/jdk.internal.misc.Unsafe.park(Native Method)
        at java.base@11.0.1/java.util.concurrent.locks.LockSupport.parkNanos(LockSupport.java:234)
        at java.base@11.0.1/java.util.concurrent.locks.AbstractQueuedSynchronizer$ConditionObject.awaitNanos(AbstractQueuedSynchronizer.java:2123)
        at app//org.eclipse.jetty.util.BlockingArrayQueue.poll(BlockingArrayQueue.java:392)
        at app//org.eclipse.jetty.util.thread.QueuedThreadPool$Runner.idleJobPoll(QueuedThreadPool.java:850)
        at app//org.eclipse.jetty.util.thread.QueuedThreadPool$Runner.run(QueuedThreadPool.java:889)
        at java.base@11.0.1/java.lang.Thread.run(Thread.java:834)
   2) Thread[id=80055, name=qtp1756965306-80055, state=TIMED_WAITING, group=TGRP-ShardSplitTest]
        at java.base@11.0.1/jdk.internal.misc.Unsafe.park(Native Method)
        at java.base@11.0.1/java.util.concurrent.locks.LockSupport.parkNanos(LockSupport.java:234)
        at java.base@11.0.1/java.util.concurrent.locks.AbstractQueuedSynchronizer$ConditionObject.awaitNanos(AbstractQueuedSynchronizer.java:2123)
        at app//org.eclipse.jetty.util.BlockingArrayQueue.poll(BlockingArrayQueue.java:392)
        at app//org.eclipse.jetty.util.thread.QueuedThreadPool$Runner.idleJobPoll(QueuedThreadPool.java:850)
        at app//org.eclipse.jetty.util.thread.QueuedThreadPool$Runner.run(QueuedThreadPool.java:889)
        at java.base@11.0.1/java.lang.Thread.run(Thread.java:834)
   3) Thread[id=80176, name=Connector-Scheduler-6c86a075, state=WAITING, group=TGRP-ShardSplitTest]
        at java.base@11.0.1/jdk.internal.misc.Unsafe.park(Native Method)
        at java.base@11.0.1/java.util.concurrent.locks.LockSupport.park(LockSupport.java:194)
        at java.base@11.0.1/java.util.concurrent.locks.AbstractQueuedSynchronizer$ConditionObject.await(AbstractQueuedSynchronizer.java:2081)
        at java.base@11.0.1/java.util.concurrent.ScheduledThreadPoolExecutor$DelayedWorkQueue.take(ScheduledThreadPoolExecutor.java:1170)
        at java.base@11.0.1/java.util.concurrent.ScheduledThreadPoolExecutor$DelayedWorkQueue.take(ScheduledThreadPoolExecutor.java:899)
        at java.base@11.0.1/java.util.concurrent.ThreadPoolExecutor.getTask(ThreadPoolExecutor.java:1054)
        at java.base@11.0.1/java.util.concurrent.ThreadPoolExecutor.runWorker(ThreadPoolExecutor.java:1114)
        at java.base@11.0.1/java.util.concurrent.ThreadPoolExecutor$Worker.run(ThreadPoolExecutor.java:628)
        at java.base@11.0.1/java.lang.Thread.run(Thread.java:834)
   4) Thread[id=80058, name=qtp1756965306-80058, state=TIMED_WAITING, group=TGRP-ShardSplitTest]
        at java.base@11.0.1/jdk.internal.misc.Unsafe.park(Native Method)
        at java.base@11.0.1/java.util.concurrent.locks.LockSupport.parkNanos(LockSupport.java:234)
        at java.base@11.0.1/java.util.concurrent.locks.AbstractQueuedSynchronizer$ConditionObject.awaitNanos(AbstractQueuedSynchronizer.java:2123)
        at app//org.eclipse.jetty.util.BlockingArrayQueue.poll(BlockingArrayQueue.java:392)
        at app//org.eclipse.jetty.util.thread.QueuedThreadPool$Runner.idleJobPoll(QueuedThreadPool.java:850)
        at app//org.eclipse.jetty.util.thread.QueuedThreadPool$Runner.run(QueuedThreadPool.java:889)
        at java.base@11.0.1/java.lang.Thread.run(Thread.java:834)
   5) Thread[id=80051, name=qtp1756965306-80051, state=RUNNABLE, group=TGRP-ShardSplitTest]
        at java.base@11.0.1/sun.nio.ch.EPoll.wait(Native Method)
        at java.base@11.0.1/sun.nio.ch.EPollSelectorImpl.doSelect(EPollSelectorImpl.java:120)
        at java.base@11.0.1/sun.nio.ch.SelectorImpl.lockAndDoSelect(SelectorImpl.java:124)
        at java.base@11.0.1/sun.nio.ch.SelectorImpl.select(SelectorImpl.java:141)
        at app//org.eclipse.jetty.io.ManagedSelector$SelectorProducer.select(ManagedSelector.java:464)
        at app//org.eclipse.jetty.io.ManagedSelector$SelectorProducer.produce(ManagedSelector.java:401)
        at app//org.eclipse.jetty.util.thread.strategy.EatWhatYouKill.produceTask(EatWhatYouKill.java:357)
        at app//org.eclipse.jetty.util.thread.strategy.EatWhatYouKill.doProduce(EatWhatYouKill.java:181)
        at app//org.eclipse.jetty.util.thread.strategy.EatWhatYouKill.tryProduce(EatWhatYouKill.java:168)
        at app//org.eclipse.jetty.util.thread.strategy.EatWhatYouKill.produce(EatWhatYouKill.java:132)
        at app//org.eclipse.jetty.io.ManagedSelector$$Lambda$192/0x0000000100528c40.run(Unknown Source)
        at app//org.eclipse.jetty.util.thread.QueuedThreadPool.runJob(QueuedThreadPool.java:781)
        at app//org.eclipse.jetty.util.thread.QueuedThreadPool$Runner.run(QueuedThreadPool.java:917)
        at java.base@11.0.1/java.lang.Thread.run(Thread.java:834)
   6) Thread[id=80052, name=qtp1756965306-80052, state=RUNNABLE, group=TGRP-ShardSplitTest]
        at java.base@11.0.1/sun.nio.ch.EPoll.wait(Native Method)
        at java.base@11.0.1/sun.nio.ch.EPollSelectorImpl.doSelect(EPollSelectorImpl.java:120)
        at java.base@11.0.1/sun.nio.ch.SelectorImpl.lockAndDoSelect(SelectorImpl.java:124)
        at java.base@11.0.1/sun.nio.ch.SelectorImpl.select(SelectorImpl.java:141)
        at app//org.eclipse.jetty.io.ManagedSelector$SelectorProducer.select(ManagedSelector.java:464)
        at app//org.eclipse.jetty.io.ManagedSelector$SelectorProducer.produce(ManagedSelector.java:401)
        at app//org.eclipse.jetty.util.thread.strategy.EatWhatYouKill.produceTask(EatWhatYouKill.java:357)
        at app//org.eclipse.jetty.util.thread.strategy.EatWhatYouKill.doProduce(EatWhatYouKill.java:181)
        at app//org.eclipse.jetty.util.thread.strategy.EatWhatYouKill.tryProduce(EatWhatYouKill.java:168)
        at app//org.eclipse.jetty.util.thread.strategy.EatWhatYouKill.produce(EatWhatYouKill.java:132)
        at app//org.eclipse.jetty.io.ManagedSelector$$Lambda$192/0x0000000100528c40.run(Unknown Source)
        at app//org.eclipse.jetty.util.thread.QueuedThreadPool.runJob(QueuedThreadPool.java:781)
        at app//org.eclipse.jetty.util.thread.QueuedThreadPool$Runner.run(QueuedThreadPool.java:917)
        at java.base@11.0.1/java.lang.Thread.run(Thread.java:834)
   7) Thread[id=80057, name=qtp1756965306-80057, state=TIMED_WAITING, group=TGRP-ShardSplitTest]
        at java.base@11.0.1/jdk.internal.misc.Unsafe.park(Native Method)
        at java.base@11.0.1/java.util.concurrent.locks.LockSupport.parkNanos(LockSupport.java:234)
        at java.base@11.0.1/java.util.concurrent.locks.AbstractQueuedSynchronizer$ConditionObject.awaitNanos(AbstractQueuedSynchronizer.java:2123)
        at app//org.eclipse.jetty.util.BlockingArrayQueue.poll(BlockingArrayQueue.java:392)
        at app//org.eclipse.jetty.util.thread.QueuedThreadPool$Runner.idleJobPoll(QueuedThreadPool.java:850)
        at app//org.eclipse.jetty.util.thread.QueuedThreadPool$Runner.run(QueuedThreadPool.java:889)
        at java.base@11.0.1/java.lang.Thread.run(Thread.java:834)
   8) Thread[id=80053, name=qtp1756965306-80053, state=TIMED_WAITING, group=TGRP-ShardSplitTest]
        at java.base@11.0.1/jdk.internal.misc.Unsafe.park(Native Method)
        at java.base@11.0.1/java.util.concurrent.locks.LockSupport.parkNanos(LockSupport.java:234)
        at java.base@11.0.1/java.util.concurrent.locks.AbstractQueuedSynchronizer$ConditionObject.awaitNanos(AbstractQueuedSynchronizer.java:2123)
        at app//org.eclipse.jetty.util.BlockingArrayQueue.poll(BlockingArrayQueue.java:392)
        at app//org.eclipse.jetty.util.thread.QueuedThreadPool$Runner.idleJobPoll(QueuedThreadPool.java:850)
        at app//org.eclipse.jetty.util.thread.QueuedThreadPool$Runner.run(QueuedThreadPool.java:889)
        at java.base@11.0.1/java.lang.Thread.run(Thread.java:834)
   9) Thread[id=80054, name=qtp1756965306-80054, state=TIMED_WAITING, group=TGRP-ShardSplitTest]
        at java.base@11.0.1/jdk.internal.misc.Unsafe.park(Native Method)
        at java.base@11.0.1/java.util.concurrent.locks.LockSupport.parkNanos(LockSupport.java:234)
        at java.base@11.0.1/java.util.concurrent.locks.AbstractQueuedSynchronizer$ConditionObject.awaitNanos(AbstractQueuedSynchronizer.java:2123)
        at app//org.eclipse.jetty.util.BlockingArrayQueue.poll(BlockingArrayQueue.java:392)
        at app//org.eclipse.jetty.util.thread.QueuedThreadPool$Runner.idleJobPoll(QueuedThreadPool.java:850)
        at app//org.eclipse.jetty.util.thread.QueuedThreadPool$Runner.run(QueuedThreadPool.java:889)
        at java.base@11.0.1/java.lang.Thread.run(Thread.java:834)
  10) Thread[id=80059, name=Session-HouseKeeper-2c4ebfcb, state=TIMED_WAITING, group=TGRP-ShardSplitTest]
        at java.base@11.0.1/jdk.internal.misc.Unsafe.park(Native Method)
        at java.base@11.0.1/java.util.concurrent.locks.LockSupport.parkNanos(LockSupport.java:234)
        at java.base@11.0.1/java.util.concurrent.locks.AbstractQueuedSynchronizer$ConditionObject.awaitNanos(AbstractQueuedSynchronizer.java:2123)
        at java.base@11.0.1/java.util.concurrent.ScheduledThreadPoolExecutor$DelayedWorkQueue.take(ScheduledThreadPoolExecutor.java:1182)
        at java.base@11.0.1/java.util.concurrent.ScheduledThreadPoolExecutor$DelayedWorkQueue.take(ScheduledThreadPoolExecutor.java:899)
        at java.base@11.0.1/java.util.concurrent.ThreadPoolExecutor.getTask(ThreadPoolExecutor.java:1054)
        at java.base@11.0.1/java.util.concurrent.ThreadPoolExecutor.runWorker(ThreadPoolExecutor.java:1114)
        at java.base@11.0.1/java.util.concurrent.ThreadPoolExecutor$Worker.run(ThreadPoolExecutor.java:628)
        at java.base@11.0.1/java.lang.Thread.run(Thread.java:834)
	at __randomizedtesting.SeedInfo.seed([138729404C1FE31]:0)




Build Log:
[...truncated 1676 lines...]
   [junit4] Suite: org.apache.lucene.search.TestDocValuesRewriteMethod
   [junit4]   2> NOTE: download the large Jenkins line-docs file by running 'ant get-jenkins-line-docs' in the lucene directory.
   [junit4]   2> NOTE: reproduce with: ant test  -Dtestcase=TestDocValuesRewriteMethod -Dtests.method=testRegexps -Dtests.seed=7D502B21292D7EEA -Dtests.multiplier=2 -Dtests.nightly=true -Dtests.slow=true -Dtests.linedocsfile=/home/jenkins/jenkins-slave/workspace/Lucene-Solr-NightlyTests-master/test-data/enwiki.random.lines.txt -Dtests.locale=jgo -Dtests.timezone=Pacific/Wallis -Dtests.asserts=true -Dtests.file.encoding=US-ASCII
   [junit4] FAILURE 4.00s J0 | TestDocValuesRewriteMethod.testRegexps <<<
   [junit4]    > Throwable #1: junit.framework.AssertionFailedError: Hit 9 docnumbers don't match
   [junit4]    > Hits length1=12	length2=12
   [junit4]    > hit=0: doc128=1.0 shardIndex=0,	 doc128=1.0 shardIndex=0
   [junit4]    > hit=1: doc229=1.0 shardIndex=0,	 doc229=1.0 shardIndex=0
   [junit4]    > hit=2: doc277=1.0 shardIndex=0,	 doc277=1.0 shardIndex=0
   [junit4]    > hit=3: doc349=1.0 shardIndex=0,	 doc349=1.0 shardIndex=0
   [junit4]    > hit=4: doc513=1.0 shardIndex=0,	 doc513=1.0 shardIndex=0
   [junit4]    > hit=5: doc519=1.0 shardIndex=0,	 doc519=1.0 shardIndex=0
   [junit4]    > hit=6: doc559=1.0 shardIndex=0,	 doc559=1.0 shardIndex=0
   [junit4]    > hit=7: doc569=1.0 shardIndex=0,	 doc569=1.0 shardIndex=0
   [junit4]    > hit=8: doc614=1.0 shardIndex=0,	 doc614=1.0 shardIndex=0
   [junit4]    > hit=9: doc798=1.0 shardIndex=0,	 doc860=1.0 shardIndex=0
   [junit4]    > hit=10: doc811=1.0 shardIndex=0,	 doc798=1.0 shardIndex=1
   [junit4]    > hit=11: doc860=1.0 shardIndex=0,	 doc811=1.0 shardIndex=1
   [junit4]    > for query:/.[])-|.ʳ[c)󈔐]/
   [junit4]    > 	at __randomizedtesting.SeedInfo.seed([7D502B21292D7EEA:9C0C6A30F7872962]:0)
   [junit4]    > 	at junit.framework.Assert.fail(Assert.java:57)
   [junit4]    > 	at org.apache.lucene.search.CheckHits.checkEqual(CheckHits.java:205)
   [junit4]    > 	at org.apache.lucene.search.TestDocValuesRewriteMethod.assertSame(TestDocValuesRewriteMethod.java:124)
   [junit4]    > 	at org.apache.lucene.search.TestDocValuesRewriteMethod.testRegexps(TestDocValuesRewriteMethod.java:109)
   [junit4]    > 	at java.base/jdk.internal.reflect.NativeMethodAccessorImpl.invoke0(Native Method)
   [junit4]    > 	at java.base/jdk.internal.reflect.NativeMethodAccessorImpl.invoke(NativeMethodAccessorImpl.java:62)
   [junit4]    > 	at java.base/jdk.internal.reflect.DelegatingMethodAccessorImpl.invoke(DelegatingMethodAccessorImpl.java:43)
   [junit4]    > 	at java.base/java.lang.reflect.Method.invoke(Method.java:566)
   [junit4]    > 	at java.base/java.lang.Thread.run(Thread.java:834)
   [junit4]   2> NOTE: test params are: codec=CheapBastard, sim=Asserting(org.apache.lucene.search.similarities.AssertingSimilarity@48531293), locale=jgo, timezone=Pacific/Wallis
   [junit4]   2> NOTE: Linux 4.4.0-137-generic amd64/Oracle Corporation 11.0.1 (64-bit)/cpus=4,threads=1,free=270942824,total=494927872
   [junit4]   2> NOTE: All tests run in this JVM: [TestFilterLeafReader, TestIntRangeFieldQueries, TestFieldsReader, TestSearcherManager, TestLazyProxSkipping, TestCollectionUtil, TestAtomicUpdate, TestCharsRef, TestSleepingLockWrapper, TestDocsWithFieldSet, TestInfoStream, TestMultiThreadTermVectors, TestDocIdsWriter, TestVirtualMethod, TestSegmentTermDocs, TestSpanMultiTermQueryWrapper, TestBooleanSimilarity, TestConjunctions, TestBytesStore, TestNumericUtils, TestLucene50TermVectorsFormat, TestTimSorterWorstCase, TestRoaringDocIdSet, TestStringHelper, TestTerms, TestDelegatingAnalyzerWrapper, TestRollback, TestMergeSchedulerExternal, TestBooleanQuery, TestSynonymQuery, TestSpans, TestMinShouldMatch2, TestSizeBoundedForceMerge, TestMultiTermsEnum, TestWordlistLoader, TestBlendedTermQuery, TestCharTermAttributeImpl, TestBufferedIndexInput, TestNorms, TestIndexWriter, TestParallelReaderEmptyIndex, TestMmapDirectory, TestIndexWriterDelete, TestPriorityQueue, TestField, TestIndexReaderClose, TestStressNRT, TestTransactionRollback, TestMultiPhraseQuery, TestReqOptSumScorer, TestOrdinalMap, TestPerFieldPostingsFormat, TestDistributionSPL, TestSimpleExplanationsOfNonMatches, TestWANDScorer, TestMergeRateLimiter, TestEarlyTermination, FuzzyTermOnShortTermsTest, TestAxiomaticSimilarity, TestIndexWriterWithThreads, TestDirectPacked, TestMergedIterator, TestCrashCausesCorruptIndex, TestBooleanScorer, TestPrefixQuery, TestManyFields, TestLongRange, TestAxiomaticF2LOG, TestReusableStringReader, Test2BDocs, TestFieldInvertState, TestIntRange, TestNRTThreads, TestRegexpRandom, TestDocumentsWriterStallControl, TestTermVectorsReader, TestOmitPositions, TestSentinelIntSet, TestLevenshteinAutomata, TestNRTCachingDirectory, TestSimpleFSDirectory, TestTerm, TestGraphTokenStreamFiniteStrings, TestBasicModelIF, TestDateTools, TestLucene80NormsFormatMergeInstance, Test2BPostingsBytes, Test2BSortedDocValuesFixedSorted, Test2BSortedDocValuesOrds, Test2BTerms, Test4GBStoredFields, TestBinaryTerms, TestByteSlices, TestCheckIndex, TestCodecHoldsOpenFiles, TestCodecs, TestConcurrentMergeScheduler, TestDeletionPolicy, TestDirectoryReaderReopen, TestDoc, TestDocIDMerger, TestDocInverterPerFieldErrorInfo, TestDocValues, TestDocValuesFieldUpdates, TestDocValuesIndexing, TestDocumentsWriterDeleteQueue, TestDuelingCodecsAtNight, TestIndexWriterReader, TestIndexWriterUnicode, TestIndexingSequenceNumbers, TestCustomSearcherSort, TestDateSort, TestDisjunctionMaxQuery, TestDocIdSetIterator, TestDocValuesRewriteMethod]
   [junit4] Completed [403/521 (1!)] on J0 in 4.69s, 2 tests, 1 failure <<< FAILURES!

[...truncated 13480 lines...]
   [junit4] Suite: org.apache.solr.cloud.api.collections.ShardSplitTest
   [junit4]   2> Creating dataDir: /x1/jenkins/jenkins-slave/workspace/Lucene-Solr-NightlyTests-master/checkout/solr/build/solr-core/test/J1/temp/solr.cloud.api.collections.ShardSplitTest_138729404C1FE31-001/init-core-data-001
   [junit4]   2> 2249028 WARN  (SUITE-ShardSplitTest-seed#[138729404C1FE31]-worker) [     ] o.a.s.SolrTestCaseJ4 startTrackingSearchers: numOpens=1 numCloses=1
   [junit4]   2> 2249028 INFO  (SUITE-ShardSplitTest-seed#[138729404C1FE31]-worker) [     ] o.a.s.SolrTestCaseJ4 Using PointFields (NUMERIC_POINTS_SYSPROP=true) w/NUMERIC_DOCVALUES_SYSPROP=true
   [junit4]   2> 2249029 INFO  (SUITE-ShardSplitTest-seed#[138729404C1FE31]-worker) [     ] o.a.s.SolrTestCaseJ4 Randomized ssl (false) and clientAuth (false) via: @org.apache.solr.SolrTestCaseJ4$SuppressSSL(bugUrl="https://issues.apache.org/jira/browse/SOLR-5776")
   [junit4]   2> 2249029 INFO  (SUITE-ShardSplitTest-seed#[138729404C1FE31]-worker) [     ] o.a.s.SolrTestCaseJ4 SecureRandom sanity checks: test.solr.allowed.securerandom=null & java.security.egd=file:/dev/./urandom
   [junit4]   2> 2249030 INFO  (SUITE-ShardSplitTest-seed#[138729404C1FE31]-worker) [     ] o.a.s.BaseDistributedSearchTestCase Setting hostContext system property: /
   [junit4]   2> 2249035 INFO  (TEST-ShardSplitTest.testSplitStaticIndexReplication-seed#[138729404C1FE31]) [     ] o.a.s.c.ZkTestServer STARTING ZK TEST SERVER
   [junit4]   2> 2249035 INFO  (ZkTestServer Run Thread) [     ] o.a.s.c.ZkTestServer client port:0.0.0.0/0.0.0.0:0
   [junit4]   2> 2249035 INFO  (ZkTestServer Run Thread) [     ] o.a.s.c.ZkTestServer Starting server
   [junit4]   2> 2249135 INFO  (TEST-ShardSplitTest.testSplitStaticIndexReplication-seed#[138729404C1FE31]) [     ] o.a.s.c.ZkTestServer start zk server on port:35048
   [junit4]   2> 2249135 INFO  (TEST-ShardSplitTest.testSplitStaticIndexReplication-seed#[138729404C1FE31]) [     ] o.a.s.c.ZkTestServer parse host and port list: 127.0.0.1:35048
   [junit4]   2> 2249135 INFO  (TEST-ShardSplitTest.testSplitStaticIndexReplication-seed#[138729404C1FE31]) [     ] o.a.s.c.ZkTestServer connecting to 127.0.0.1 35048
   [junit4]   2> 2249137 INFO  (TEST-ShardSplitTest.testSplitStaticIndexReplication-seed#[138729404C1FE31]) [     ] o.a.s.c.c.ConnectionManager Waiting for client to connect to ZooKeeper
   [junit4]   2> 2249140 INFO  (zkConnectionManagerCallback-6078-thread-1) [     ] o.a.s.c.c.ConnectionManager zkClient has connected
   [junit4]   2> 2249140 INFO  (TEST-ShardSplitTest.testSplitStaticIndexReplication-seed#[138729404C1FE31]) [     ] o.a.s.c.c.ConnectionManager Client is connected to ZooKeeper
   [junit4]   2> 2249144 INFO  (TEST-ShardSplitTest.testSplitStaticIndexReplication-seed#[138729404C1FE31]) [     ] o.a.s.c.c.ConnectionManager Waiting for client to connect to ZooKeeper
   [junit4]   2> 2249145 INFO  (zkConnectionManagerCallback-6080-thread-1) [     ] o.a.s.c.c.ConnectionManager zkClient has connected
   [junit4]   2> 2249145 INFO  (TEST-ShardSplitTest.testSplitStaticIndexReplication-seed#[138729404C1FE31]) [     ] o.a.s.c.c.ConnectionManager Client is connected to ZooKeeper
   [junit4]   2> 2249147 INFO  (TEST-ShardSplitTest.testSplitStaticIndexReplication-seed#[138729404C1FE31]) [     ] o.a.s.c.ZkTestServer put /x1/jenkins/jenkins-slave/workspace/Lucene-Solr-NightlyTests-master/checkout/solr/core/src/test-files/solr/collection1/conf/solrconfig-tlog.xml to /configs/conf1/solrconfig.xml
   [junit4]   2> 2249149 INFO  (TEST-ShardSplitTest.testSplitStaticIndexReplication-seed#[138729404C1FE31]) [     ] o.a.s.c.ZkTestServer put /x1/jenkins/jenkins-slave/workspace/Lucene-Solr-NightlyTests-master/checkout/solr/core/src/test-files/solr/collection1/conf/schema15.xml to /configs/conf1/schema.xml
   [junit4]   2> 2249151 INFO  (TEST-ShardSplitTest.testSplitStaticIndexReplication-seed#[138729404C1FE31]) [     ] o.a.s.c.ZkTestServer put /x1/jenkins/jenkins-slave/workspace/Lucene-Solr-NightlyTests-master/checkout/solr/core/src/test-files/solr/collection1/conf/solrconfig.snippet.randomindexconfig.xml to /configs/conf1/solrconfig.snippet.randomindexconfig.xml
   [junit4]   2> 2249153 INFO  (TEST-ShardSplitTest.testSplitStaticIndexReplication-seed#[138729404C1FE31]) [     ] o.a.s.c.ZkTestServer put /x1/jenkins/jenkins-slave/workspace/Lucene-Solr-NightlyTests-master/checkout/solr/core/src/test-files/solr/collection1/conf/stopwords.txt to /configs/conf1/stopwords.txt
   [junit4]   2> 2249155 INFO  (TEST-ShardSplitTest.testSplitStaticIndexReplication-seed#[138729404C1FE31]) [     ] o.a.s.c.ZkTestServer put /x1/jenkins/jenkins-slave/workspace/Lucene-Solr-NightlyTests-master/checkout/solr/core/src/test-files/solr/collection1/conf/protwords.txt to /configs/conf1/protwords.txt
   [junit4]   2> 2249156 INFO  (TEST-ShardSplitTest.testSplitStaticIndexReplication-seed#[138729404C1FE31]) [     ] o.a.s.c.ZkTestServer put /x1/jenkins/jenkins-slave/workspace/Lucene-Solr-NightlyTests-master/checkout/solr/core/src/test-files/solr/collection1/conf/currency.xml to /configs/conf1/currency.xml
   [junit4]   2> 2249158 INFO  (TEST-ShardSplitTest.testSplitStaticIndexReplication-seed#[138729404C1FE31]) [     ] o.a.s.c.ZkTestServer put /x1/jenkins/jenkins-slave/workspace/Lucene-Solr-NightlyTests-master/checkout/solr/core/src/test-files/solr/collection1/conf/enumsConfig.xml to /configs/conf1/enumsConfig.xml
   [junit4]   2> 2249160 INFO  (TEST-ShardSplitTest.testSplitStaticIndexReplication-seed#[138729404C1FE31]) [     ] o.a.s.c.ZkTestServer put /x1/jenkins/jenkins-slave/workspace/Lucene-Solr-NightlyTests-master/checkout/solr/core/src/test-files/solr/collection1/conf/open-exchange-rates.json to /configs/conf1/open-exchange-rates.json
   [junit4]   2> 2249161 INFO  (TEST-ShardSplitTest.testSplitStaticIndexReplication-seed#[138729404C1FE31]) [     ] o.a.s.c.ZkTestServer put /x1/jenkins/jenkins-slave/workspace/Lucene-Solr-NightlyTests-master/checkout/solr/core/src/test-files/solr/collection1/conf/mapping-ISOLatin1Accent.txt to /configs/conf1/mapping-ISOLatin1Accent.txt
   [junit4]   2> 2249163 INFO  (TEST-ShardSplitTest.testSplitStaticIndexReplication-seed#[138729404C1FE31]) [     ] o.a.s.c.ZkTestServer put /x1/jenkins/jenkins-slave/workspace/Lucene-Solr-NightlyTests-master/checkout/solr/core/src/test-files/solr/collection1/conf/old_synonyms.txt to /configs/conf1/old_synonyms.txt
   [junit4]   2> 2249165 INFO  (TEST-ShardSplitTest.testSplitStaticIndexReplication-seed#[138729404C1FE31]) [     ] o.a.s.c.ZkTestServer put /x1/jenkins/jenkins-slave/workspace/Lucene-Solr-NightlyTests-master/checkout/solr/core/src/test-files/solr/collection1/conf/synonyms.txt to /configs/conf1/synonyms.txt
   [junit4]   2> 2249166 INFO  (TEST-ShardSplitTest.testSplitStaticIndexReplication-seed#[138729404C1FE31]) [     ] o.a.s.c.AbstractFullDistribZkTestBase Will use NRT replicas unless explicitly asked otherwise
   [junit4]   2> 2249332 WARN  (TEST-ShardSplitTest.testSplitStaticIndexReplication-seed#[138729404C1FE31]) [     ] o.e.j.s.AbstractConnector Ignoring deprecated socket close linger time
   [junit4]   2> 2249332 INFO  (TEST-ShardSplitTest.testSplitStaticIndexReplication-seed#[138729404C1FE31]) [     ] o.a.s.c.s.e.JettySolrRunner Start Jetty (original configured port=0)
   [junit4]   2> 2249332 INFO  (TEST-ShardSplitTest.testSplitStaticIndexReplication-seed#[138729404C1FE31]) [     ] o.a.s.c.s.e.JettySolrRunner Trying to start Jetty on port 0 try number 1 ...
   [junit4]   2> 2249332 INFO  (TEST-ShardSplitTest.testSplitStaticIndexReplication-seed#[138729404C1FE31]) [     ] o.e.j.s.Server jetty-9.4.19.v20190610; built: 2019-06-10T16:30:51.723Z; git: afcf563148970e98786327af5e07c261fda175d3; jvm 11.0.1+13-LTS
   [junit4]   2> 2249334 INFO  (TEST-ShardSplitTest.testSplitStaticIndexReplication-seed#[138729404C1FE31]) [     ] o.e.j.s.session DefaultSessionIdManager workerName=node0
   [junit4]   2> 2249334 INFO  (TEST-ShardSplitTest.testSplitStaticIndexReplication-seed#[138729404C1FE31]) [     ] o.e.j.s.session No SessionScavenger set, using defaults
   [junit4]   2> 2249334 INFO  (TEST-ShardSplitTest.testSplitStaticIndexReplication-seed#[138729404C1FE31]) [     ] o.e.j.s.session node0 Scavenging every 600000ms
   [junit4]   2> 2249334 INFO  (TEST-ShardSplitTest.testSplitStaticIndexReplication-seed#[138729404C1FE31]) [     ] o.e.j.s.h.ContextHandler Started o.e.j.s.ServletContextHandler@d36dd04{/,null,AVAILABLE}
   [junit4]   2> 2249335 INFO  (TEST-ShardSplitTest.testSplitStaticIndexReplication-seed#[138729404C1FE31]) [     ] o.e.j.s.AbstractConnector Started ServerConnector@7ad5b8e6{HTTP/1.1,[http/1.1, h2c]}{127.0.0.1:44959}
   [junit4]   2> 2249335 INFO  (TEST-ShardSplitTest.testSplitStaticIndexReplication-seed#[138729404C1FE31]) [     ] o.e.j.s.Server Started @2249405ms
   [junit4]   2> 2249335 INFO  (TEST-ShardSplitTest.testSplitStaticIndexReplication-seed#[138729404C1FE31]) [     ] o.a.s.c.s.e.JettySolrRunner Jetty properties: {hostContext=/, solr.data.dir=/x1/jenkins/jenkins-slave/workspace/Lucene-Solr-NightlyTests-master/checkout/solr/build/solr-core/test/J1/temp/solr.cloud.api.collections.ShardSplitTest_138729404C1FE31-001/tempDir-001/control/data, hostPort=44959, coreRootDirectory=/x1/jenkins/jenkins-slave/workspace/Lucene-Solr-NightlyTests-master/checkout/solr/build/solr-core/test/J1/temp/solr.cloud.api.collections.ShardSplitTest_138729404C1FE31-001/control-001/cores, replicaType=NRT}
   [junit4]   2> 2249335 ERROR (TEST-ShardSplitTest.testSplitStaticIndexReplication-seed#[138729404C1FE31]) [     ] o.a.s.u.StartupLoggingUtils Missing Java Option solr.log.dir. Logging may be missing or incomplete.
   [junit4]   2> 2249335 INFO  (TEST-ShardSplitTest.testSplitStaticIndexReplication-seed#[138729404C1FE31]) [     ] o.a.s.s.SolrDispatchFilter Using logger factory org.apache.logging.slf4j.Log4jLoggerFactory
   [junit4]   2> 2249335 INFO  (TEST-ShardSplitTest.testSplitStaticIndexReplication-seed#[138729404C1FE31]) [     ] o.a.s.s.SolrDispatchFilter  ___      _       Welcome to Apache Solr™ version 9.0.0
   [junit4]   2> 2249335 INFO  (TEST-ShardSplitTest.testSplitStaticIndexReplication-seed#[138729404C1FE31]) [     ] o.a.s.s.SolrDispatchFilter / __| ___| |_ _   Starting in cloud mode on port null
   [junit4]   2> 2249335 INFO  (TEST-ShardSplitTest.testSplitStaticIndexReplication-seed#[138729404C1FE31]) [     ] o.a.s.s.SolrDispatchFilter \__ \/ _ \ | '_|  Install dir: null
   [junit4]   2> 2249336 INFO  (TEST-ShardSplitTest.testSplitStaticIndexReplication-seed#[138729404C1FE31]) [     ] o.a.s.s.SolrDispatchFilter |___/\___/_|_|    Start time: 2019-07-02T18:28:43.220987Z
   [junit4]   2> 2249337 INFO  (TEST-ShardSplitTest.testSplitStaticIndexReplication-seed#[138729404C1FE31]) [     ] o.a.s.c.c.ConnectionManager Waiting for client to connect to ZooKeeper
   [junit4]   2> 2249338 INFO  (zkConnectionManagerCallback-6082-thread-1) [     ] o.a.s.c.c.ConnectionManager zkClient has connected
   [junit4]   2> 2249338 INFO  (TEST-ShardSplitTest.testSplitStaticIndexReplication-seed#[138729404C1FE31]) [     ] o.a.s.c.c.ConnectionManager Client is connected to ZooKeeper
   [junit4]   2> 2249440 INFO  (TEST-ShardSplitTest.testSplitStaticIndexReplication-seed#[138729404C1FE31]) [     ] o.a.s.s.SolrDispatchFilter Loading solr.xml from SolrHome (not found in ZooKeeper)
   [junit4]   2> 2249440 INFO  (TEST-ShardSplitTest.testSplitStaticIndexReplication-seed#[138729404C1FE31]) [     ] o.a.s.c.SolrXmlConfig Loading container configuration from /x1/jenkins/jenkins-slave/workspace/Lucene-Solr-NightlyTests-master/checkout/solr/build/solr-core/test/J1/temp/solr.cloud.api.collections.ShardSplitTest_138729404C1FE31-001/control-001/solr.xml
   [junit4]   2> 2249443 INFO  (TEST-ShardSplitTest.testSplitStaticIndexReplication-seed#[138729404C1FE31]) [     ] o.a.s.c.SolrXmlConfig Configuration parameter autoReplicaFailoverWorkLoopDelay is ignored
   [junit4]   2> 2249443 INFO  (TEST-ShardSplitTest.testSplitStaticIndexReplication-seed#[138729404C1FE31]) [     ] o.a.s.c.SolrXmlConfig Configuration parameter autoReplicaFailoverBadNodeExpiration is ignored
   [junit4]   2> 2249445 INFO  (TEST-ShardSplitTest.testSplitStaticIndexReplication-seed#[138729404C1FE31]) [     ] o.a.s.c.SolrXmlConfig MBean server found: com.sun.jmx.mbeanserver.JmxMBeanServer@65dab43f, but no JMX reporters were configured - adding default JMX reporter.
   [junit4]   2> 2249650 INFO  (TEST-ShardSplitTest.testSplitStaticIndexReplication-seed#[138729404C1FE31]) [     ] o.a.s.h.c.HttpShardHandlerFactory Host whitelist initialized: WhitelistHostChecker [whitelistHosts=null, whitelistHostCheckingEnabled=false]
   [junit4]   2> 2249651 WARN  (TEST-ShardSplitTest.testSplitStaticIndexReplication-seed#[138729404C1FE31]) [     ] o.e.j.u.s.S.config Trusting all certificates configured for Client@525eac63[provider=null,keyStore=null,trustStore=null]
   [junit4]   2> 2249651 WARN  (TEST-ShardSplitTest.testSplitStaticIndexReplication-seed#[138729404C1FE31]) [     ] o.e.j.u.s.S.config No Client EndPointIdentificationAlgorithm configured for Client@525eac63[provider=null,keyStore=null,trustStore=null]
   [junit4]   2> 2249655 WARN  (TEST-ShardSplitTest.testSplitStaticIndexReplication-seed#[138729404C1FE31]) [     ] o.e.j.u.s.S.config Trusting all certificates configured for Client@5ce98b1d[provider=null,keyStore=null,trustStore=null]
   [junit4]   2> 2249655 WARN  (TEST-ShardSplitTest.testSplitStaticIndexReplication-seed#[138729404C1FE31]) [     ] o.e.j.u.s.S.config No Client EndPointIdentificationAlgorithm configured for Client@5ce98b1d[provider=null,keyStore=null,trustStore=null]
   [junit4]   2> 2249656 INFO  (TEST-ShardSplitTest.testSplitStaticIndexReplication-seed#[138729404C1FE31]) [     ] o.a.s.c.ZkContainer Zookeeper client=127.0.0.1:35048/solr
   [junit4]   2> 2249662 INFO  (TEST-ShardSplitTest.testSplitStaticIndexReplication-seed#[138729404C1FE31]) [     ] o.a.s.c.c.ConnectionManager Waiting for client to connect to ZooKeeper
   [junit4]   2> 2249662 INFO  (zkConnectionManagerCallback-6089-thread-1) [     ] o.a.s.c.c.ConnectionManager zkClient has connected
   [junit4]   2> 2249662 INFO  (TEST-ShardSplitTest.testSplitStaticIndexReplication-seed#[138729404C1FE31]) [     ] o.a.s.c.c.ConnectionManager Client is connected to ZooKeeper
   [junit4]   2> 2249766 INFO  (TEST-ShardSplitTest.testSplitStaticIndexReplication-seed#[138729404C1FE31]) [n:127.0.0.1:44959_     ] o.a.s.c.c.ConnectionManager Waiting for client to connect to ZooKeeper
   [junit4]   2> 2249767 INFO  (zkConnectionManagerCallback-6091-thread-1) [     ] o.a.s.c.c.ConnectionManager zkClient has connected
   [junit4]   2> 2249767 INFO  (TEST-ShardSplitTest.testSplitStaticIndexReplication-seed#[138729404C1FE31]) [n:127.0.0.1:44959_     ] o.a.s.c.c.ConnectionManager Client is connected to ZooKeeper
   [junit4]   2> 2249876 INFO  (TEST-ShardSplitTest.testSplitStaticIndexReplication-seed#[138729404C1FE31]) [n:127.0.0.1:44959_     ] o.a.s.c.OverseerElectionContext I am going to be the leader 127.0.0.1:44959_
   [junit4]   2> 2249879 INFO  (TEST-ShardSplitTest.testSplitStaticIndexReplication-seed#[138729404C1FE31]) [n:127.0.0.1:44959_     ] o.a.s.c.Overseer Overseer (id=73579790302117892-127.0.0.1:44959_-n_0000000000) starting
   [junit4]   2> 2249887 INFO  (TEST-ShardSplitTest.testSplitStaticIndexReplication-seed#[138729404C1FE31]) [n:127.0.0.1:44959_     ] o.a.s.c.c.ConnectionManager Waiting for client to connect to ZooKeeper
   [junit4]   2> 2249888 INFO  (zkConnectionManagerCallback-6098-thread-1) [     ] o.a.s.c.c.ConnectionManager zkClient has connected
   [junit4]   2> 2249888 INFO  (TEST-ShardSplitTest.testSplitStaticIndexReplication-seed#[138729404C1FE31]) [n:127.0.0.1:44959_     ] o.a.s.c.c.ConnectionManager Client is connected to ZooKeeper
   [junit4]   2> 2249891 INFO  (TEST-ShardSplitTest.testSplitStaticIndexReplication-seed#[138729404C1FE31]) [n:127.0.0.1:44959_     ] o.a.s.c.s.i.ZkClientClusterStateProvider Cluster at 127.0.0.1:35048/solr ready
   [junit4]   2> 2249892 DEBUG (OverseerCollectionConfigSetProcessor-73579790302117892-127.0.0.1:44959_-n_0000000000) [n:127.0.0.1:44959_     ] o.a.s.c.OverseerTaskProcessor Process current queue of overseer operations
   [junit4]   2> 2249892 INFO  (OverseerStateUpdate-73579790302117892-127.0.0.1:44959_-n_0000000000) [n:127.0.0.1:44959_     ] o.a.s.c.Overseer Starting to work on the main queue : 127.0.0.1:44959_
   [junit4]   2> 2249893 INFO  (TEST-ShardSplitTest.testSplitStaticIndexReplication-seed#[138729404C1FE31]) [n:127.0.0.1:44959_     ] o.a.s.c.ZkController Register node as live in ZooKeeper:/live_nodes/127.0.0.1:44959_
   [junit4]   2> 2249894 DEBUG (OverseerCollectionConfigSetProcessor-73579790302117892-127.0.0.1:44959_-n_0000000000) [n:127.0.0.1:44959_     ] o.a.s.c.OverseerTaskProcessor Cleaning up work-queue. #Running tasks: 0 #Completed tasks: 0
   [junit4]   2> 2249894 DEBUG (OverseerCollectionConfigSetProcessor-73579790302117892-127.0.0.1:44959_-n_0000000000) [n:127.0.0.1:44959_     ] o.a.s.c.OverseerTaskProcessor RunningTasks: []
   [junit4]   2> 2249894 DEBUG (OverseerCollectionConfigSetProcessor-73579790302117892-127.0.0.1:44959_-n_0000000000) [n:127.0.0.1:44959_     ] o.a.s.c.OverseerTaskProcessor BlockedTasks: []
   [junit4]   2> 2249895 DEBUG (OverseerCollectionConfigSetProcessor-73579790302117892-127.0.0.1:44959_-n_0000000000) [n:127.0.0.1:44959_     ] o.a.s.c.OverseerTaskProcessor CompletedTasks: []
   [junit4]   2> 2249895 INFO  (OverseerCollectionConfigSetProcessor-73579790302117892-127.0.0.1:44959_-n_0000000000) [n:127.0.0.1:44959_     ] o.a.s.c.OverseerTaskProcessor RunningZKTasks: []
   [junit4]   2> 2249895 INFO  (zkCallback-6090-thread-1) [     ] o.a.s.c.c.ZkStateReader Updated live nodes from ZooKeeper... (0) -> (1)
   [junit4]   2> 2249895 INFO  (zkCallback-6097-thread-1) [     ] o.a.s.c.c.ZkStateReader Updated live nodes from ZooKeeper... (0) -> (1)
   [junit4]   2> 2249918 INFO  (TEST-ShardSplitTest.testSplitStaticIndexReplication-seed#[138729404C1FE31]) [n:127.0.0.1:44959_     ] o.a.s.h.a.MetricsHistoryHandler No .system collection, keeping metrics history in memory.
   [junit4]   2> 2249949 INFO  (TEST-ShardSplitTest.testSplitStaticIndexReplication-seed#[138729404C1FE31]) [n:127.0.0.1:44959_     ] o.a.s.m.r.SolrJmxReporter JMX monitoring for 'solr.node' (registry 'solr.node') enabled at server: com.sun.jmx.mbeanserver.JmxMBeanServer@65dab43f
   [junit4]   2> 2249969 INFO  (TEST-ShardSplitTest.testSplitStaticIndexReplication-seed#[138729404C1FE31]) [n:127.0.0.1:44959_     ] o.a.s.m.r.SolrJmxReporter JMX monitoring for 'solr.jvm' (registry 'solr.jvm') enabled at server: com.sun.jmx.mbeanserver.JmxMBeanServer@65dab43f
   [junit4]   2> 2249969 INFO  (TEST-ShardSplitTest.testSplitStaticIndexReplication-seed#[138729404C1FE31]) [n:127.0.0.1:44959_     ] o.a.s.m.r.SolrJmxReporter JMX monitoring for 'solr.jetty' (registry 'solr.jetty') enabled at server: com.sun.jmx.mbeanserver.JmxMBeanServer@65dab43f
   [junit4]   2> 2249971 INFO  (TEST-ShardSplitTest.testSplitStaticIndexReplication-seed#[138729404C1FE31]) [n:127.0.0.1:44959_     ] o.a.s.c.CorePropertiesLocator Found 0 core definitions underneath /x1/jenkins/jenkins-slave/workspace/Lucene-Solr-NightlyTests-master/checkout/solr/build/solr-core/test/J1/temp/solr.cloud.api.collections.ShardSplitTest_138729404C1FE31-001/control-001/cores
   [junit4]   2> 2250002 INFO  (TEST-ShardSplitTest.testSplitStaticIndexReplication-seed#[138729404C1FE31]) [     ] o.a.s.c.c.ConnectionManager Waiting for client to connect to ZooKeeper
   [junit4]   2> 2250004 INFO  (zkConnectionManagerCallback-6104-thread-1) [     ] o.a.s.c.c.ConnectionManager zkClient has connected
   [junit4]   2> 2250004 INFO  (TEST-ShardSplitTest.testSplitStaticIndexReplication-seed#[138729404C1FE31]) [     ] o.a.s.c.c.ConnectionManager Client is connected to ZooKeeper
   [junit4]   2> 2250005 INFO  (TEST-ShardSplitTest.testSplitStaticIndexReplication-seed#[138729404C1FE31]) [     ] o.a.s.c.c.ZkStateReader Updated live nodes from ZooKeeper... (0) -> (1)
   [junit4]   2> 2250007 INFO  (TEST-ShardSplitTest.testSplitStaticIndexReplication-seed#[138729404C1FE31]) [     ] o.a.s.c.s.i.ZkClientClusterStateProvider Cluster at 127.0.0.1:35048/solr ready
   [junit4]   2> 2250010 INFO  (qtp856507116-79490) [n:127.0.0.1:44959_     ] o.a.s.h.a.CollectionsHandler Invoked Collection Action :create with params collection.configName=conf1&name=control_collection&nrtReplicas=1&action=CREATE&numShards=1&createNodeSet=127.0.0.1:44959_&wt=javabin&version=2 and sendToOCPQueue=true
   [junit4]   2> 2250017 DEBUG (OverseerCollectionConfigSetProcessor-73579790302117892-127.0.0.1:44959_-n_0000000000) [n:127.0.0.1:44959_     ] o.a.s.c.OverseerTaskProcessor Got 1 tasks from work-queue : [[org.apache.solr.cloud.OverseerTaskQueue$QueueEvent@2e684ecf]]
   [junit4]   2> 2250018 DEBUG (OverseerCollectionConfigSetProcessor-73579790302117892-127.0.0.1:44959_-n_0000000000) [n:127.0.0.1:44959_     ] o.a.s.c.OverseerTaskProcessor Marked task [/overseer/collection-queue-work/qn-0000000000] as running
   [junit4]   2> 2250018 DEBUG (OverseerCollectionConfigSetProcessor-73579790302117892-127.0.0.1:44959_-n_0000000000) [n:127.0.0.1:44959_     ] o.a.s.c.OverseerTaskProcessor Overseer Collection Message Handler: Get the message id:/overseer/collection-queue-work/qn-0000000000 message:{
   [junit4]   2>   "name":"control_collection",
   [junit4]   2>   "fromApi":"true",
   [junit4]   2>   "collection.configName":"conf1",
   [junit4]   2>   "numShards":"1",
   [junit4]   2>   "createNodeSet":"127.0.0.1:44959_",
   [junit4]   2>   "nrtReplicas":"1",
   [junit4]   2>   "stateFormat":"2",
   [junit4]   2>   "replicationFactor":"1",
   [junit4]   2>   "operation":"create"}
   [junit4]   2> 2250018 DEBUG (OverseerThreadFactory-5235-thread-1-processing-n:127.0.0.1:44959_) [n:127.0.0.1:44959_     ] o.a.s.c.OverseerTaskProcessor Runner processing /overseer/collection-queue-work/qn-0000000000
   [junit4]   2> 2250018 DEBUG (OverseerThreadFactory-5235-thread-1-processing-n:127.0.0.1:44959_) [n:127.0.0.1:44959_     ] o.a.s.c.a.c.OverseerCollectionMessageHandler OverseerCollectionMessageHandler.processMessage : create , {
   [junit4]   2>   "name":"control_collection",
   [junit4]   2>   "fromApi":"true",
   [junit4]   2>   "collection.configName":"conf1",
   [junit4]   2>   "numShards":"1",
   [junit4]   2>   "createNodeSet":"127.0.0.1:44959_",
   [junit4]   2>   "nrtReplicas":"1",
   [junit4]   2>   "stateFormat":"2",
   [junit4]   2>   "replicationFactor":"1",
   [junit4]   2>   "operation":"create"}
   [junit4]   2> 2250019 DEBUG (OverseerCollectionConfigSetProcessor-73579790302117892-127.0.0.1:44959_-n_0000000000) [n:127.0.0.1:44959_     ] o.a.s.c.OverseerTaskProcessor Cleaning up work-queue. #Running tasks: 1 #Completed tasks: 0
   [junit4]   2> 2250019 DEBUG (OverseerCollectionConfigSetProcessor-73579790302117892-127.0.0.1:44959_-n_0000000000) [n:127.0.0.1:44959_     ] o.a.s.c.OverseerTaskProcessor RunningTasks: [/overseer/collection-queue-work/qn-0000000000]
   [junit4]   2> 2250019 DEBUG (OverseerCollectionConfigSetProcessor-73579790302117892-127.0.0.1:44959_-n_0000000000) [n:127.0.0.1:44959_     ] o.a.s.c.OverseerTaskProcessor BlockedTasks: []
   [junit4]   2> 2250019 DEBUG (OverseerCollectionConfigSetProcessor-73579790302117892-127.0.0.1:44959_-n_0000000000) [n:127.0.0.1:44959_     ] o.a.s.c.OverseerTaskProcessor CompletedTasks: []
   [junit4]   2> 2250019 INFO  (OverseerCollectionConfigSetProcessor-73579790302117892-127.0.0.1:44959_-n_0000000000) [n:127.0.0.1:44959_     ] o.a.s.c.OverseerTaskProcessor RunningZKTasks: [/overseer/collection-queue-work/qn-0000000000]
   [junit4]   2> 2250019 INFO  (OverseerThreadFactory-5235-thread-1-processing-n:127.0.0.1:44959_) [n:127.0.0.1:44959_     ] o.a.s.c.a.c.CreateCollectionCmd Create collection control_collection
   [junit4]   2> 2250020 DEBUG (OverseerThreadFactory-5235-thread-1-processing-n:127.0.0.1:44959_) [n:127.0.0.1:44959_     ] o.a.s.c.a.c.OverseerCollectionMessageHandler creating collections conf node /collections/control_collection 
   [junit4]   2> 2250021 DEBUG (OverseerThreadFactory-5235-thread-1-processing-n:127.0.0.1:44959_) [n:127.0.0.1:44959_     ] o.a.s.c.a.c.CreateCollectionCmd Check for collection zkNode:control_collection
   [junit4]   2> 2250022 DEBUG (OverseerThreadFactory-5235-thread-1-processing-n:127.0.0.1:44959_) [n:127.0.0.1:44959_     ] o.a.s.c.a.c.CreateCollectionCmd Collection zkNode exists
   [junit4]   2> 2250024 DEBUG (OverseerStateUpdate-73579790302117892-127.0.0.1:44959_-n_0000000000) [n:127.0.0.1:44959_     ] o.a.s.c.Overseer processMessage: queueSize: 1, message = {
   [junit4]   2>   "name":"control_collection",
   [junit4]   2>   "fromApi":"true",
   [junit4]   2>   "collection.configName":"conf1",
   [junit4]   2>   "numShards":"1",
   [junit4]   2>   "createNodeSet":"127.0.0.1:44959_",
   [junit4]   2>   "nrtReplicas":"1",
   [junit4]   2>   "stateFormat":"2",
   [junit4]   2>   "replicationFactor":"1",
   [junit4]   2>   "operation":"create"} current state version: 0
   [junit4]   2> 2250024 DEBUG (OverseerStateUpdate-73579790302117892-127.0.0.1:44959_-n_0000000000) [n:127.0.0.1:44959_     ] o.a.s.c.o.ClusterStateMutator building a new cName: control_collection
   [junit4]   2> 2250025 DEBUG (OverseerStateUpdate-73579790302117892-127.0.0.1:44959_-n_0000000000) [n:127.0.0.1:44959_     ] o.a.s.c.o.ZkStateWriter going to create_collection /collections/control_collection/state.json
   [junit4]   2> 2250125 DEBUG (OverseerThreadFactory-5235-thread-1-processing-n:127.0.0.1:44959_) [n:127.0.0.1:44959_     ] o.a.s.c.a.c.CreateCollectionCmd Creating SolrCores for new collection control_collection, shardNames [shard1] , message : {
   [junit4]   2>   "name":"control_collection",
   [junit4]   2>   "fromApi":"true",
   [junit4]   2>   "collection.configName":"conf1",
   [junit4]   2>   "numShards":"1",
   [junit4]   2>   "createNodeSet":"127.0.0.1:44959_",
   [junit4]   2>   "nrtReplicas":"1",
   [junit4]   2>   "stateFormat":"2",
   [junit4]   2>   "replicationFactor":"1",
   [junit4]   2>   "operation":"create"}
   [junit4]   2> 2250127 DEBUG (OverseerThreadFactory-5235-thread-1-processing-n:127.0.0.1:44959_) [n:127.0.0.1:44959_     ] o.a.s.c.a.c.CreateCollectionCmd Creating core control_collection_shard1_replica_n1 as part of shard shard1 of collection control_collection on 127.0.0.1:44959_
   [junit4]   2> 2250129 INFO  (qtp856507116-79492) [n:127.0.0.1:44959_    x:control_collection_shard1_replica_n1 ] o.a.s.h.a.CoreAdminOperation core create command qt=/admin/cores&collection.configName=conf1&newCollection=true&name=control_collection_shard1_replica_n1&action=CREATE&numShards=1&collection=control_collection&shard=shard1&wt=javabin&version=2&replicaType=NRT
   [junit4]   2> 2250129 INFO  (qtp856507116-79492) [n:127.0.0.1:44959_    x:control_collection_shard1_replica_n1 ] o.a.s.c.TransientSolrCoreCacheDefault Allocating transient cache for 4 transient cores
   [junit4]   2> 2250132 DEBUG (OverseerStateUpdate-73579790302117892-127.0.0.1:44959_-n_0000000000) [n:127.0.0.1:44959_     ] o.a.s.c.Overseer processMessage: queueSize: 1, message = {
   [junit4]   2>   "core":"control_collection_shard1_replica_n1",
   [junit4]   2>   "roles":null,
   [junit4]   2>   "base_url":"http://127.0.0.1:44959",
   [junit4]   2>   "node_name":"127.0.0.1:44959_",
   [junit4]   2>   "numShards":"1",
   [junit4]   2>   "state":"down",
   [junit4]   2>   "shard":"shard1",
   [junit4]   2>   "collection":"control_collection",
   [junit4]   2>   "type":"NRT",
   [junit4]   2>   "operation":"state"} current state version: 0
   [junit4]   2> 2250132 DEBUG (OverseerStateUpdate-73579790302117892-127.0.0.1:44959_-n_0000000000) [n:127.0.0.1:44959_     ] o.a.s.c.o.ReplicaMutator Update state numShards=1 message={
   [junit4]   2>   "core":"control_collection_shard1_replica_n1",
   [junit4]   2>   "roles":null,
   [junit4]   2>   "base_url":"http://127.0.0.1:44959",
   [junit4]   2>   "node_name":"127.0.0.1:44959_",
   [junit4]   2>   "numShards":"1",
   [junit4]   2>   "state":"down",
   [junit4]   2>   "shard":"shard1",
   [junit4]   2>   "collection":"control_collection",
   [junit4]   2>   "type":"NRT",
   [junit4]   2>   "operation":"state"}
   [junit4]   2> 2250134 DEBUG (OverseerStateUpdate-73579790302117892-127.0.0.1:44959_-n_0000000000) [n:127.0.0.1:44959_     ] o.a.s.c.o.ReplicaMutator Will update state for replica: core_node2:{
   [junit4]   2>   "core":"control_collection_shard1_replica_n1",
   [junit4]   2>   "base_url":"http://127.0.0.1:44959",
   [junit4]   2>   "node_name":"127.0.0.1:44959_",
   [junit4]   2>   "state":"down",
   [junit4]   2>   "type":"NRT"}
   [junit4]   2> 2250134 DEBUG (OverseerStateUpdate-73579790302117892-127.0.0.1:44959_-n_0000000000) [n:127.0.0.1:44959_     ] o.a.s.c.o.ReplicaMutator Collection is now: DocCollection(control_collection//collections/control_collection/state.json/0)={
   [junit4]   2>   "pullReplicas":"0",
   [junit4]   2>   "replicationFactor":"1",
   [junit4]   2>   "router":{"name":"compositeId"},
   [junit4]   2>   "maxShardsPerNode":"1",
   [junit4]   2>   "autoAddReplicas":"false",
   [junit4]   2>   "nrtReplicas":"1",
   [junit4]   2>   "tlogReplicas":"0",
   [junit4]   2>   "shards":{"shard1":{
   [junit4]   2>       "range":"80000000-7fffffff",
   [junit4]   2>       "state":"active",
   [junit4]   2>       "replicas":{"core_node2":{
   [junit4]   2>           "core":"control_collection_shard1_replica_n1",
   [junit4]   2>           "base_url":"http://127.0.0.1:44959",
   [junit4]   2>           "node_name":"127.0.0.1:44959_",
   [junit4]   2>           "state":"down",
   [junit4]   2>           "type":"NRT"}}}}}
   [junit4]   2> 2250235 DEBUG (OverseerStateUpdate-73579790302117892-127.0.0.1:44959_-n_0000000000) [n:127.0.0.1:44959_     ] o.a.s.c.o.ZkStateWriter going to update_collection /collections/control_collection/state.json version: 0
   [junit4]   2> 2251144 INFO  (qtp856507116-79492) [n:127.0.0.1:44959_ c:control_collection s:shard1  x:control_collection_shard1_replica_n1 ] o.a.s.c.SolrConfig Using Lucene MatchVersion: 9.0.0
   [junit4]   2> 2251165 INFO  (qtp856507116-79492) [n:127.0.0.1:44959_ c:control_collection s:shard1  x:control_collection_shard1_replica_n1 ] o.a.s.s.IndexSchema [control_collection_shard1_replica_n1] Schema name=test
   [junit4]   2> 2251260 INFO  (qtp856507116-79492) [n:127.0.0.1:44959_ c:control_collection s:shard1  x:control_collection_shard1_replica_n1 ] o.a.s.s.IndexSchema Loaded schema test/1.6 with uniqueid field id
   [junit4]   2> 2251282 INFO  (qtp856507116-79492) [n:127.0.0.1:44959_ c:control_collection s:shard1  x:control_collection_shard1_replica_n1 ] o.a.s.c.CoreContainer Creating SolrCore 'control_collection_shard1_replica_n1' using configuration from collection control_collection, trusted=true
   [junit4]   2> 2251283 INFO  (qtp856507116-79492) [n:127.0.0.1:44959_ c:control_collection s:shard1  x:control_collection_shard1_replica_n1 ] o.a.s.m.r.SolrJmxReporter JMX monitoring for 'solr.core.control_collection.shard1.replica_n1' (registry 'solr.core.control_collection.shard1.replica_n1') enabled at server: com.sun.jmx.mbeanserver.JmxMBeanServer@65dab43f
   [junit4]   2> 2251283 INFO  (qtp856507116-79492) [n:127.0.0.1:44959_ c:control_collection s:shard1  x:control_collection_shard1_replica_n1 ] o.a.s.c.SolrCore [[control_collection_shard1_replica_n1] ] Opening new SolrCore at [/x1/jenkins/jenkins-slave/workspace/Lucene-Solr-NightlyTests-master/checkout/solr/build/solr-core/test/J1/temp/solr.cloud.api.collections.ShardSplitTest_138729404C1FE31-001/control-001/cores/control_collection_shard1_replica_n1], dataDir=[/x1/jenkins/jenkins-slave/workspace/Lucene-Solr-NightlyTests-master/checkout/solr/build/solr-core/test/J1/temp/solr.cloud.api.collections.ShardSplitTest_138729404C1FE31-001/control-001/cores/control_collection_shard1_replica_n1/data/]
   [junit4]   2> 2251288 INFO  (qtp856507116-79492) [n:127.0.0.1:44959_ c:control_collection s:shard1  x:control_collection_shard1_replica_n1 ] o.a.s.u.RandomMergePolicy RandomMergePolicy wrapping class org.apache.lucene.index.AlcoholicMergePolicy: [AlcoholicMergePolicy: minMergeSize=0, mergeFactor=10, maxMergeSize=2022057337, maxMergeSizeForForcedMerge=9223372036854775807, calibrateSizeByDeletes=true, maxMergeDocs=2147483647, maxCFSSegmentSizeMB=8.796093022207999E12, noCFSRatio=0.1]
   [junit4]   2> 2251298 WARN  (qtp856507116-79492) [n:127.0.0.1:44959_ c:control_collection s:shard1  x:control_collection_shard1_replica_n1 ] o.a.s.c.RequestHandlers INVALID paramSet a in requestHandler {type = requestHandler,name = /dump,class = DumpRequestHandler,attributes = {initParams=a, name=/dump, class=DumpRequestHandler},args = {defaults={a=A,b=B}}}
   [junit4]   2> 2251368 INFO  (qtp856507116-79492) [n:127.0.0.1:44959_ c:control_collection s:shard1  x:control_collection_shard1_replica_n1 ] o.a.s.u.UpdateHandler Using UpdateLog implementation: org.apache.solr.update.UpdateLog
   [junit4]   2> 2251368 INFO  (qtp856507116-79492) [n:127.0.0.1:44959_ c:control_collecti

[...truncated too long message...]

igure:
[ivy:configure] :: loading settings :: file = /x1/jenkins/jenkins-slave/workspace/Lucene-Solr-NightlyTests-master/checkout/lucene/top-level-ivy-settings.xml

resolve:

ivy-availability-check:
[loadresource] Do not set property disallowed.ivy.jars.list as its length is 0.

-ivy-fail-disallowed-ivy-version:

ivy-fail:

ivy-fail:

ivy-configure:
[ivy:configure] :: loading settings :: file = /x1/jenkins/jenkins-slave/workspace/Lucene-Solr-NightlyTests-master/checkout/lucene/top-level-ivy-settings.xml

resolve:

ivy-availability-check:
[loadresource] Do not set property disallowed.ivy.jars.list as its length is 0.

-ivy-fail-disallowed-ivy-version:

ivy-fail:

ivy-configure:
[ivy:configure] :: loading settings :: file = /x1/jenkins/jenkins-slave/workspace/Lucene-Solr-NightlyTests-master/checkout/lucene/top-level-ivy-settings.xml

resolve:

ivy-availability-check:
[loadresource] Do not set property disallowed.ivy.jars.list as its length is 0.

-ivy-fail-disallowed-ivy-version:

ivy-fail:

ivy-fail:

ivy-configure:
[ivy:configure] :: loading settings :: file = /x1/jenkins/jenkins-slave/workspace/Lucene-Solr-NightlyTests-master/checkout/lucene/top-level-ivy-settings.xml

resolve:

ivy-availability-check:
[loadresource] Do not set property disallowed.ivy.jars.list as its length is 0.

-ivy-fail-disallowed-ivy-version:

ivy-fail:

ivy-fail:

ivy-configure:
[ivy:configure] :: loading settings :: file = /x1/jenkins/jenkins-slave/workspace/Lucene-Solr-NightlyTests-master/checkout/lucene/top-level-ivy-settings.xml

resolve:

ivy-availability-check:
[loadresource] Do not set property disallowed.ivy.jars.list as its length is 0.

-ivy-fail-disallowed-ivy-version:

ivy-fail:

ivy-fail:

ivy-configure:
[ivy:configure] :: loading settings :: file = /x1/jenkins/jenkins-slave/workspace/Lucene-Solr-NightlyTests-master/checkout/lucene/top-level-ivy-settings.xml

resolve:

ivy-availability-check:
[loadresource] Do not set property disallowed.ivy.jars.list as its length is 0.

-ivy-fail-disallowed-ivy-version:

ivy-fail:

ivy-fail:

ivy-configure:
[ivy:configure] :: loading settings :: file = /x1/jenkins/jenkins-slave/workspace/Lucene-Solr-NightlyTests-master/checkout/lucene/top-level-ivy-settings.xml

resolve:

ivy-availability-check:
[loadresource] Do not set property disallowed.ivy.jars.list as its length is 0.

-ivy-fail-disallowed-ivy-version:

ivy-fail:

ivy-fail:

ivy-configure:
[ivy:configure] :: loading settings :: file = /x1/jenkins/jenkins-slave/workspace/Lucene-Solr-NightlyTests-master/checkout/lucene/top-level-ivy-settings.xml

resolve:

ivy-availability-check:
[loadresource] Do not set property disallowed.ivy.jars.list as its length is 0.

-ivy-fail-disallowed-ivy-version:

ivy-fail:

ivy-fail:

ivy-configure:
[ivy:configure] :: loading settings :: file = /x1/jenkins/jenkins-slave/workspace/Lucene-Solr-NightlyTests-master/checkout/lucene/top-level-ivy-settings.xml

resolve:

ivy-availability-check:
[loadresource] Do not set property disallowed.ivy.jars.list as its length is 0.

-ivy-fail-disallowed-ivy-version:

ivy-fail:

ivy-fail:

ivy-configure:
[ivy:configure] :: loading settings :: file = /x1/jenkins/jenkins-slave/workspace/Lucene-Solr-NightlyTests-master/checkout/lucene/top-level-ivy-settings.xml

resolve:

ivy-availability-check:
[loadresource] Do not set property disallowed.ivy.jars.list as its length is 0.

-ivy-fail-disallowed-ivy-version:

ivy-fail:

ivy-fail:

ivy-configure:
[ivy:configure] :: loading settings :: file = /x1/jenkins/jenkins-slave/workspace/Lucene-Solr-NightlyTests-master/checkout/lucene/top-level-ivy-settings.xml

resolve:

ivy-availability-check:
[loadresource] Do not set property disallowed.ivy.jars.list as its length is 0.

-ivy-fail-disallowed-ivy-version:

ivy-fail:

ivy-fail:

ivy-configure:
[ivy:configure] :: loading settings :: file = /x1/jenkins/jenkins-slave/workspace/Lucene-Solr-NightlyTests-master/checkout/lucene/top-level-ivy-settings.xml

resolve:

ivy-availability-check:
[loadresource] Do not set property disallowed.ivy.jars.list as its length is 0.

-ivy-fail-disallowed-ivy-version:

ivy-fail:

ivy-fail:

ivy-configure:
[ivy:configure] :: loading settings :: file = /x1/jenkins/jenkins-slave/workspace/Lucene-Solr-NightlyTests-master/checkout/lucene/top-level-ivy-settings.xml

resolve:

ivy-availability-check:
[loadresource] Do not set property disallowed.ivy.jars.list as its length is 0.

-ivy-fail-disallowed-ivy-version:

ivy-fail:

ivy-fail:

ivy-configure:
[ivy:configure] :: loading settings :: file = /x1/jenkins/jenkins-slave/workspace/Lucene-Solr-NightlyTests-master/checkout/lucene/top-level-ivy-settings.xml

resolve:

jar-checksums:
    [mkdir] Created dir: /x1/jenkins/jenkins-slave/workspace/Lucene-Solr-NightlyTests-master/checkout/solr/null2063963175
     [copy] Copying 249 files to /x1/jenkins/jenkins-slave/workspace/Lucene-Solr-NightlyTests-master/checkout/solr/null2063963175
   [delete] Deleting directory /x1/jenkins/jenkins-slave/workspace/Lucene-Solr-NightlyTests-master/checkout/solr/null2063963175

check-working-copy:
[ivy:cachepath] :: resolving dependencies :: #;working@lucene1-us-west
[ivy:cachepath] 	confs: [default]
[ivy:cachepath] 	found org.eclipse.jgit#org.eclipse.jgit;5.3.0.201903130848-r in public
[ivy:cachepath] 	found com.jcraft#jsch;0.1.54 in public
[ivy:cachepath] 	found com.jcraft#jzlib;1.1.1 in public
[ivy:cachepath] 	found com.googlecode.javaewah#JavaEWAH;1.1.6 in public
[ivy:cachepath] 	found org.slf4j#slf4j-api;1.7.2 in public
[ivy:cachepath] 	found org.bouncycastle#bcpg-jdk15on;1.60 in public
[ivy:cachepath] 	found org.bouncycastle#bcprov-jdk15on;1.60 in public
[ivy:cachepath] 	found org.bouncycastle#bcpkix-jdk15on;1.60 in public
[ivy:cachepath] 	found org.slf4j#slf4j-nop;1.7.2 in public
[ivy:cachepath] :: resolution report :: resolve 64ms :: artifacts dl 6ms
	---------------------------------------------------------------------
	|                  |            modules            ||   artifacts   |
	|       conf       | number| search|dwnlded|evicted|| number|dwnlded|
	---------------------------------------------------------------------
	|      default     |   9   |   0   |   0   |   0   ||   9   |   0   |
	---------------------------------------------------------------------
[wc-checker] Initializing working copy...
[wc-checker] Checking working copy status...

-jenkins-base:

BUILD SUCCESSFUL
Total time: 342 minutes 57 seconds
Archiving artifacts
java.lang.InterruptedException: no matches found within 10000
	at hudson.FilePath$ValidateAntFileMask.hasMatch(FilePath.java:2847)
	at hudson.FilePath$ValidateAntFileMask.invoke(FilePath.java:2726)
	at hudson.FilePath$ValidateAntFileMask.invoke(FilePath.java:2707)
	at hudson.FilePath$FileCallableWrapper.call(FilePath.java:3086)
Also:   hudson.remoting.Channel$CallSiteStackTrace: Remote call to lucene
		at hudson.remoting.Channel.attachCallSiteStackTrace(Channel.java:1741)
		at hudson.remoting.UserRequest$ExceptionResponse.retrieve(UserRequest.java:357)
		at hudson.remoting.Channel.call(Channel.java:955)
		at hudson.FilePath.act(FilePath.java:1072)
		at hudson.FilePath.act(FilePath.java:1061)
		at hudson.FilePath.validateAntFileMask(FilePath.java:2705)
		at hudson.tasks.ArtifactArchiver.perform(ArtifactArchiver.java:243)
		at hudson.tasks.BuildStepCompatibilityLayer.perform(BuildStepCompatibilityLayer.java:81)
		at hudson.tasks.BuildStepMonitor$1.perform(BuildStepMonitor.java:20)
		at hudson.model.AbstractBuild$AbstractBuildExecution.perform(AbstractBuild.java:744)
		at hudson.model.AbstractBuild$AbstractBuildExecution.performAllBuildSteps(AbstractBuild.java:690)
		at hudson.model.Build$BuildExecution.post2(Build.java:186)
		at hudson.model.AbstractBuild$AbstractBuildExecution.post(AbstractBuild.java:635)
		at hudson.model.Run.execute(Run.java:1835)
		at hudson.model.FreeStyleBuild.run(FreeStyleBuild.java:43)
		at hudson.model.ResourceController.execute(ResourceController.java:97)
		at hudson.model.Executor.run(Executor.java:429)
Caused: hudson.FilePath$TunneledInterruptedException
	at hudson.FilePath$FileCallableWrapper.call(FilePath.java:3088)
	at hudson.remoting.UserRequest.perform(UserRequest.java:212)
	at hudson.remoting.UserRequest.perform(UserRequest.java:54)
	at hudson.remoting.Request$2.run(Request.java:369)
	at hudson.remoting.InterceptingExecutorService$1.call(InterceptingExecutorService.java:72)
	at java.util.concurrent.FutureTask.run(FutureTask.java:266)
	at java.util.concurrent.ThreadPoolExecutor.runWorker(ThreadPoolExecutor.java:1142)
	at java.util.concurrent.ThreadPoolExecutor$Worker.run(ThreadPoolExecutor.java:617)
	at java.lang.Thread.run(Thread.java:748)
Caused: java.lang.InterruptedException: java.lang.InterruptedException: no matches found within 10000
	at hudson.FilePath.act(FilePath.java:1074)
	at hudson.FilePath.act(FilePath.java:1061)
	at hudson.FilePath.validateAntFileMask(FilePath.java:2705)
	at hudson.tasks.ArtifactArchiver.perform(ArtifactArchiver.java:243)
	at hudson.tasks.BuildStepCompatibilityLayer.perform(BuildStepCompatibilityLayer.java:81)
	at hudson.tasks.BuildStepMonitor$1.perform(BuildStepMonitor.java:20)
	at hudson.model.AbstractBuild$AbstractBuildExecution.perform(AbstractBuild.java:744)
	at hudson.model.AbstractBuild$AbstractBuildExecution.performAllBuildSteps(AbstractBuild.java:690)
	at hudson.model.Build$BuildExecution.post2(Build.java:186)
	at hudson.model.AbstractBuild$AbstractBuildExecution.post(AbstractBuild.java:635)
	at hudson.model.Run.execute(Run.java:1835)
	at hudson.model.FreeStyleBuild.run(FreeStyleBuild.java:43)
	at hudson.model.ResourceController.execute(ResourceController.java:97)
	at hudson.model.Executor.run(Executor.java:429)
No artifacts found that match the file pattern "**/*.events,heapdumps/**,**/hs_err_pid*". Configuration error?
Recording test results
Build step 'Publish JUnit test result report' changed build result to UNSTABLE
Email was triggered for: Unstable (Test Failures)
Sending email for trigger: Unstable (Test Failures)

Mime
View raw message