lucene-dev mailing list archives

Site index · List index
Message view « Date » · « Thread »
Top « Date » · « Thread »
From Apache Jenkins Server <jenk...@builds.apache.org>
Subject [JENKINS] Lucene-Solr-NightlyTests-master - Build # 1893 - Still unstable
Date Tue, 09 Jul 2019 00:54:37 GMT
Build: https://builds.apache.org/job/Lucene-Solr-NightlyTests-master/1893/

1 tests failed.
FAILED:  org.apache.solr.cloud.hdfs.HdfsUnloadDistributedZkTest.test

Error Message:
Captured an uncaught exception in thread: Thread[id=4630, name=testExecutor-1196-thread-7, state=RUNNABLE, group=TGRP-HdfsUnloadDistributedZkTest]

Stack Trace:
com.carrotsearch.randomizedtesting.UncaughtExceptionError: Captured an uncaught exception in thread: Thread[id=4630, name=testExecutor-1196-thread-7, state=RUNNABLE, group=TGRP-HdfsUnloadDistributedZkTest]
Caused by: java.lang.RuntimeException: org.apache.solr.client.solrj.SolrServerException: Timeout occurred while waiting response from server at: http://127.0.0.1:34920/qlev/x
	at __randomizedtesting.SeedInfo.seed([2B7759AB7508681F]:0)
	at org.apache.solr.cloud.BasicDistributedZkTest.lambda$createCollectionInOneInstance$2(BasicDistributedZkTest.java:762)
	at org.apache.solr.common.util.ExecutorUtil$MDCAwareThreadPoolExecutor.lambda$execute$0(ExecutorUtil.java:209)
	at java.base/java.util.concurrent.ThreadPoolExecutor.runWorker(ThreadPoolExecutor.java:1128)
	at java.base/java.util.concurrent.ThreadPoolExecutor$Worker.run(ThreadPoolExecutor.java:628)
	at java.base/java.lang.Thread.run(Thread.java:834)
Caused by: org.apache.solr.client.solrj.SolrServerException: Timeout occurred while waiting response from server at: http://127.0.0.1:34920/qlev/x
	at org.apache.solr.client.solrj.impl.HttpSolrClient.executeMethod(HttpSolrClient.java:667)
	at org.apache.solr.client.solrj.impl.HttpSolrClient.request(HttpSolrClient.java:262)
	at org.apache.solr.client.solrj.impl.HttpSolrClient.request(HttpSolrClient.java:245)
	at org.apache.solr.client.solrj.SolrRequest.process(SolrRequest.java:211)
	at org.apache.solr.client.solrj.SolrRequest.process(SolrRequest.java:228)
	at org.apache.solr.cloud.BasicDistributedZkTest.lambda$createCollectionInOneInstance$2(BasicDistributedZkTest.java:760)
	... 4 more
Caused by: java.net.SocketTimeoutException: Read timed out
	at java.base/java.net.SocketInputStream.socketRead0(Native Method)
	at java.base/java.net.SocketInputStream.socketRead(SocketInputStream.java:115)
	at java.base/java.net.SocketInputStream.read(SocketInputStream.java:168)
	at java.base/java.net.SocketInputStream.read(SocketInputStream.java:140)
	at org.apache.http.impl.io.SessionInputBufferImpl.streamRead(SessionInputBufferImpl.java:137)
	at org.apache.http.impl.io.SessionInputBufferImpl.fillBuffer(SessionInputBufferImpl.java:153)
	at org.apache.http.impl.io.SessionInputBufferImpl.readLine(SessionInputBufferImpl.java:282)
	at org.apache.http.impl.conn.DefaultHttpResponseParser.parseHead(DefaultHttpResponseParser.java:138)
	at org.apache.http.impl.conn.DefaultHttpResponseParser.parseHead(DefaultHttpResponseParser.java:56)
	at org.apache.http.impl.io.AbstractMessageParser.parse(AbstractMessageParser.java:259)
	at org.apache.http.impl.DefaultBHttpClientConnection.receiveResponseHeader(DefaultBHttpClientConnection.java:163)
	at org.apache.http.impl.conn.CPoolProxy.receiveResponseHeader(CPoolProxy.java:165)
	at org.apache.http.protocol.HttpRequestExecutor.doReceiveResponse(HttpRequestExecutor.java:273)
	at org.apache.http.protocol.HttpRequestExecutor.execute(HttpRequestExecutor.java:125)
	at org.apache.http.impl.execchain.MainClientExec.execute(MainClientExec.java:272)
	at org.apache.http.impl.execchain.ProtocolExec.execute(ProtocolExec.java:185)
	at org.apache.http.impl.execchain.RetryExec.execute(RetryExec.java:89)
	at org.apache.http.impl.execchain.RedirectExec.execute(RedirectExec.java:110)
	at org.apache.http.impl.client.InternalHttpClient.doExecute(InternalHttpClient.java:185)
	at org.apache.http.impl.client.CloseableHttpClient.execute(CloseableHttpClient.java:83)
	at org.apache.http.impl.client.CloseableHttpClient.execute(CloseableHttpClient.java:56)
	at org.apache.solr.client.solrj.impl.HttpSolrClient.executeMethod(HttpSolrClient.java:555)
	... 9 more




Build Log:
[...truncated 14193 lines...]
   [junit4] Suite: org.apache.solr.cloud.hdfs.HdfsUnloadDistributedZkTest
   [junit4]   2> Creating dataDir: /home/jenkins/jenkins-slave/workspace/Lucene-Solr-NightlyTests-master/checkout/solr/build/solr-core/test/J2/temp/solr.cloud.hdfs.HdfsUnloadDistributedZkTest_2B7759AB7508681F-001/init-core-data-001
   [junit4]   2> 844055 INFO  (SUITE-HdfsUnloadDistributedZkTest-seed#[2B7759AB7508681F]-worker) [     ] o.a.s.SolrTestCaseJ4 Using PointFields (NUMERIC_POINTS_SYSPROP=true) w/NUMERIC_DOCVALUES_SYSPROP=false
   [junit4]   2> 844055 INFO  (SUITE-HdfsUnloadDistributedZkTest-seed#[2B7759AB7508681F]-worker) [     ] o.a.s.SolrTestCaseJ4 Randomized ssl (false) and clientAuth (false) via: @org.apache.solr.SolrTestCaseJ4$SuppressSSL(bugUrl="https://issues.apache.org/jira/browse/SOLR-5776")
   [junit4]   2> 844055 INFO  (SUITE-HdfsUnloadDistributedZkTest-seed#[2B7759AB7508681F]-worker) [     ] o.a.s.SolrTestCaseJ4 SecureRandom sanity checks: test.solr.allowed.securerandom=null & java.security.egd=file:/dev/./urandom
   [junit4]   2> 844056 INFO  (SUITE-HdfsUnloadDistributedZkTest-seed#[2B7759AB7508681F]-worker) [     ] o.a.s.BaseDistributedSearchTestCase Setting hostContext system property: /qlev/x
   [junit4]   2> 847328 WARN  (SUITE-HdfsUnloadDistributedZkTest-seed#[2B7759AB7508681F]-worker) [     ] o.a.h.u.NativeCodeLoader Unable to load native-hadoop library for your platform... using builtin-java classes where applicable
   [junit4]   1> Formatting using clusterid: testClusterID
   [junit4]   2> 851848 WARN  (SUITE-HdfsUnloadDistributedZkTest-seed#[2B7759AB7508681F]-worker) [     ] o.a.h.m.i.MetricsConfig Cannot locate configuration: tried hadoop-metrics2-namenode.properties,hadoop-metrics2.properties
   [junit4]   2> 853513 WARN  (SUITE-HdfsUnloadDistributedZkTest-seed#[2B7759AB7508681F]-worker) [     ] o.a.h.h.HttpRequestLog Jetty request log can only be enabled using Log4j
   [junit4]   2> 853674 INFO  (SUITE-HdfsUnloadDistributedZkTest-seed#[2B7759AB7508681F]-worker) [     ] o.e.j.s.Server jetty-9.4.19.v20190610; built: 2019-06-10T16:30:51.723Z; git: afcf563148970e98786327af5e07c261fda175d3; jvm 11.0.1+13-LTS
   [junit4]   2> 853727 INFO  (SUITE-HdfsUnloadDistributedZkTest-seed#[2B7759AB7508681F]-worker) [     ] o.e.j.s.session DefaultSessionIdManager workerName=node0
   [junit4]   2> 853727 INFO  (SUITE-HdfsUnloadDistributedZkTest-seed#[2B7759AB7508681F]-worker) [     ] o.e.j.s.session No SessionScavenger set, using defaults
   [junit4]   2> 853727 INFO  (SUITE-HdfsUnloadDistributedZkTest-seed#[2B7759AB7508681F]-worker) [     ] o.e.j.s.session node0 Scavenging every 600000ms
   [junit4]   2> 853729 INFO  (SUITE-HdfsUnloadDistributedZkTest-seed#[2B7759AB7508681F]-worker) [     ] o.e.j.s.h.ContextHandler Started o.e.j.s.ServletContextHandler@66d0f4f1{static,/static,jar:file:/home/jenkins/.ivy2/cache/org.apache.hadoop/hadoop-hdfs/tests/hadoop-hdfs-3.2.0-tests.jar!/webapps/static,AVAILABLE}
   [junit4]   2> 855589 INFO  (SUITE-HdfsUnloadDistributedZkTest-seed#[2B7759AB7508681F]-worker) [     ] o.e.j.s.h.ContextHandler Started o.e.j.w.WebAppContext@4b95ddb1{hdfs,/,file:///home/jenkins/jenkins-slave/workspace/Lucene-Solr-NightlyTests-master/checkout/solr/build/solr-core/test/J2/temp/jetty-lucene2-us-west.apache.org-41105-hdfs-_-any-1795781736388275519.dir/webapp/,AVAILABLE}{/hdfs}
   [junit4]   2> 855598 INFO  (SUITE-HdfsUnloadDistributedZkTest-seed#[2B7759AB7508681F]-worker) [     ] o.e.j.s.AbstractConnector Started ServerConnector@62924317{HTTP/1.1,[http/1.1]}{lucene2-us-west.apache.org:41105}
   [junit4]   2> 855598 INFO  (SUITE-HdfsUnloadDistributedZkTest-seed#[2B7759AB7508681F]-worker) [     ] o.e.j.s.Server Started @855647ms
   [junit4]   2> 861298 WARN  (SUITE-HdfsUnloadDistributedZkTest-seed#[2B7759AB7508681F]-worker) [     ] o.a.h.h.HttpRequestLog Jetty request log can only be enabled using Log4j
   [junit4]   2> 861370 INFO  (SUITE-HdfsUnloadDistributedZkTest-seed#[2B7759AB7508681F]-worker) [     ] o.e.j.s.Server jetty-9.4.19.v20190610; built: 2019-06-10T16:30:51.723Z; git: afcf563148970e98786327af5e07c261fda175d3; jvm 11.0.1+13-LTS
   [junit4]   2> 861391 INFO  (SUITE-HdfsUnloadDistributedZkTest-seed#[2B7759AB7508681F]-worker) [     ] o.e.j.s.session DefaultSessionIdManager workerName=node0
   [junit4]   2> 861391 INFO  (SUITE-HdfsUnloadDistributedZkTest-seed#[2B7759AB7508681F]-worker) [     ] o.e.j.s.session No SessionScavenger set, using defaults
   [junit4]   2> 861391 INFO  (SUITE-HdfsUnloadDistributedZkTest-seed#[2B7759AB7508681F]-worker) [     ] o.e.j.s.session node0 Scavenging every 600000ms
   [junit4]   2> 861411 INFO  (SUITE-HdfsUnloadDistributedZkTest-seed#[2B7759AB7508681F]-worker) [     ] o.e.j.s.h.ContextHandler Started o.e.j.s.ServletContextHandler@6779f27d{static,/static,jar:file:/home/jenkins/.ivy2/cache/org.apache.hadoop/hadoop-hdfs/tests/hadoop-hdfs-3.2.0-tests.jar!/webapps/static,AVAILABLE}
   [junit4]   2> 862436 INFO  (SUITE-HdfsUnloadDistributedZkTest-seed#[2B7759AB7508681F]-worker) [     ] o.e.j.s.h.ContextHandler Started o.e.j.w.WebAppContext@d58d4c4{datanode,/,file:///home/jenkins/jenkins-slave/workspace/Lucene-Solr-NightlyTests-master/checkout/solr/build/solr-core/test/J2/temp/jetty-localhost-37972-datanode-_-any-3656530584125110750.dir/webapp/,AVAILABLE}{/datanode}
   [junit4]   2> 862456 INFO  (SUITE-HdfsUnloadDistributedZkTest-seed#[2B7759AB7508681F]-worker) [     ] o.e.j.s.AbstractConnector Started ServerConnector@425145a9{HTTP/1.1,[http/1.1]}{localhost:37972}
   [junit4]   2> 862456 INFO  (SUITE-HdfsUnloadDistributedZkTest-seed#[2B7759AB7508681F]-worker) [     ] o.e.j.s.Server Started @862504ms
   [junit4]   2> 870513 INFO  (Block report processor) [     ] BlockStateChange BLOCK* processReport 0x8960d0da0834537e: Processing first storage report for DS-e24f92f8-2e7e-4896-8cc0-7bcfd3c4f4cd from datanode b7482382-ef7b-4582-a28f-82f269bd5c69
   [junit4]   2> 870521 INFO  (Block report processor) [     ] BlockStateChange BLOCK* processReport 0x8960d0da0834537e: from storage DS-e24f92f8-2e7e-4896-8cc0-7bcfd3c4f4cd node DatanodeRegistration(127.0.0.1:38560, datanodeUuid=b7482382-ef7b-4582-a28f-82f269bd5c69, infoPort=35808, infoSecurePort=0, ipcPort=40724, storageInfo=lv=-57;cid=testClusterID;nsid=313491573;c=1562622877853), blocks: 0, hasStaleStorage: true, processing time: 1 msecs, invalidatedBlocks: 0
   [junit4]   2> 870521 INFO  (Block report processor) [     ] BlockStateChange BLOCK* processReport 0x8960d0da0834537e: Processing first storage report for DS-060f896e-9f74-4fc2-91cc-20713f785bbf from datanode b7482382-ef7b-4582-a28f-82f269bd5c69
   [junit4]   2> 870522 INFO  (Block report processor) [     ] BlockStateChange BLOCK* processReport 0x8960d0da0834537e: from storage DS-060f896e-9f74-4fc2-91cc-20713f785bbf node DatanodeRegistration(127.0.0.1:38560, datanodeUuid=b7482382-ef7b-4582-a28f-82f269bd5c69, infoPort=35808, infoSecurePort=0, ipcPort=40724, storageInfo=lv=-57;cid=testClusterID;nsid=313491573;c=1562622877853), blocks: 0, hasStaleStorage: false, processing time: 0 msecs, invalidatedBlocks: 0
   [junit4]   2> 871564 INFO  (TEST-HdfsUnloadDistributedZkTest.test-seed#[2B7759AB7508681F]) [     ] o.a.s.c.ZkTestServer STARTING ZK TEST SERVER
   [junit4]   2> 871570 INFO  (ZkTestServer Run Thread) [     ] o.a.s.c.ZkTestServer client port:0.0.0.0/0.0.0.0:0
   [junit4]   2> 871570 INFO  (ZkTestServer Run Thread) [     ] o.a.s.c.ZkTestServer Starting server
   [junit4]   2> 871679 INFO  (TEST-HdfsUnloadDistributedZkTest.test-seed#[2B7759AB7508681F]) [     ] o.a.s.c.ZkTestServer start zk server on port:44240
   [junit4]   2> 871679 INFO  (TEST-HdfsUnloadDistributedZkTest.test-seed#[2B7759AB7508681F]) [     ] o.a.s.c.ZkTestServer parse host and port list: 127.0.0.1:44240
   [junit4]   2> 871679 INFO  (TEST-HdfsUnloadDistributedZkTest.test-seed#[2B7759AB7508681F]) [     ] o.a.s.c.ZkTestServer connecting to 127.0.0.1 44240
   [junit4]   2> 871789 INFO  (TEST-HdfsUnloadDistributedZkTest.test-seed#[2B7759AB7508681F]) [     ] o.a.s.c.c.ConnectionManager Waiting for client to connect to ZooKeeper
   [junit4]   2> 872064 INFO  (zkConnectionManagerCallback-1937-thread-1) [     ] o.a.s.c.c.ConnectionManager zkClient has connected
   [junit4]   2> 872064 INFO  (TEST-HdfsUnloadDistributedZkTest.test-seed#[2B7759AB7508681F]) [     ] o.a.s.c.c.ConnectionManager Client is connected to ZooKeeper
   [junit4]   2> 872148 INFO  (TEST-HdfsUnloadDistributedZkTest.test-seed#[2B7759AB7508681F]) [     ] o.a.s.c.c.ConnectionManager Waiting for client to connect to ZooKeeper
   [junit4]   2> 872174 INFO  (zkConnectionManagerCallback-1939-thread-1) [     ] o.a.s.c.c.ConnectionManager zkClient has connected
   [junit4]   2> 872174 INFO  (TEST-HdfsUnloadDistributedZkTest.test-seed#[2B7759AB7508681F]) [     ] o.a.s.c.c.ConnectionManager Client is connected to ZooKeeper
   [junit4]   2> 872182 INFO  (TEST-HdfsUnloadDistributedZkTest.test-seed#[2B7759AB7508681F]) [     ] o.a.s.c.ZkTestServer put /home/jenkins/jenkins-slave/workspace/Lucene-Solr-NightlyTests-master/checkout/solr/core/src/test-files/solr/collection1/conf/solrconfig-tlog.xml to /configs/conf1/solrconfig.xml
   [junit4]   2> 872184 INFO  (TEST-HdfsUnloadDistributedZkTest.test-seed#[2B7759AB7508681F]) [     ] o.a.s.c.ZkTestServer put /home/jenkins/jenkins-slave/workspace/Lucene-Solr-NightlyTests-master/checkout/solr/core/src/test-files/solr/collection1/conf/schema.xml to /configs/conf1/schema.xml
   [junit4]   2> 872185 INFO  (TEST-HdfsUnloadDistributedZkTest.test-seed#[2B7759AB7508681F]) [     ] o.a.s.c.ZkTestServer put /home/jenkins/jenkins-slave/workspace/Lucene-Solr-NightlyTests-master/checkout/solr/core/src/test-files/solr/collection1/conf/solrconfig.snippet.randomindexconfig.xml to /configs/conf1/solrconfig.snippet.randomindexconfig.xml
   [junit4]   2> 872199 INFO  (TEST-HdfsUnloadDistributedZkTest.test-seed#[2B7759AB7508681F]) [     ] o.a.s.c.ZkTestServer put /home/jenkins/jenkins-slave/workspace/Lucene-Solr-NightlyTests-master/checkout/solr/core/src/test-files/solr/collection1/conf/stopwords.txt to /configs/conf1/stopwords.txt
   [junit4]   2> 872200 INFO  (TEST-HdfsUnloadDistributedZkTest.test-seed#[2B7759AB7508681F]) [     ] o.a.s.c.ZkTestServer put /home/jenkins/jenkins-slave/workspace/Lucene-Solr-NightlyTests-master/checkout/solr/core/src/test-files/solr/collection1/conf/protwords.txt to /configs/conf1/protwords.txt
   [junit4]   2> 872201 INFO  (TEST-HdfsUnloadDistributedZkTest.test-seed#[2B7759AB7508681F]) [     ] o.a.s.c.ZkTestServer put /home/jenkins/jenkins-slave/workspace/Lucene-Solr-NightlyTests-master/checkout/solr/core/src/test-files/solr/collection1/conf/currency.xml to /configs/conf1/currency.xml
   [junit4]   2> 872235 INFO  (TEST-HdfsUnloadDistributedZkTest.test-seed#[2B7759AB7508681F]) [     ] o.a.s.c.ZkTestServer put /home/jenkins/jenkins-slave/workspace/Lucene-Solr-NightlyTests-master/checkout/solr/core/src/test-files/solr/collection1/conf/enumsConfig.xml to /configs/conf1/enumsConfig.xml
   [junit4]   2> 872236 INFO  (TEST-HdfsUnloadDistributedZkTest.test-seed#[2B7759AB7508681F]) [     ] o.a.s.c.ZkTestServer put /home/jenkins/jenkins-slave/workspace/Lucene-Solr-NightlyTests-master/checkout/solr/core/src/test-files/solr/collection1/conf/open-exchange-rates.json to /configs/conf1/open-exchange-rates.json
   [junit4]   2> 872237 INFO  (TEST-HdfsUnloadDistributedZkTest.test-seed#[2B7759AB7508681F]) [     ] o.a.s.c.ZkTestServer put /home/jenkins/jenkins-slave/workspace/Lucene-Solr-NightlyTests-master/checkout/solr/core/src/test-files/solr/collection1/conf/mapping-ISOLatin1Accent.txt to /configs/conf1/mapping-ISOLatin1Accent.txt
   [junit4]   2> 872275 INFO  (TEST-HdfsUnloadDistributedZkTest.test-seed#[2B7759AB7508681F]) [     ] o.a.s.c.ZkTestServer put /home/jenkins/jenkins-slave/workspace/Lucene-Solr-NightlyTests-master/checkout/solr/core/src/test-files/solr/collection1/conf/old_synonyms.txt to /configs/conf1/old_synonyms.txt
   [junit4]   2> 872276 INFO  (TEST-HdfsUnloadDistributedZkTest.test-seed#[2B7759AB7508681F]) [     ] o.a.s.c.ZkTestServer put /home/jenkins/jenkins-slave/workspace/Lucene-Solr-NightlyTests-master/checkout/solr/core/src/test-files/solr/collection1/conf/synonyms.txt to /configs/conf1/synonyms.txt
   [junit4]   2> 872277 INFO  (TEST-HdfsUnloadDistributedZkTest.test-seed#[2B7759AB7508681F]) [     ] o.a.s.c.AbstractFullDistribZkTestBase Will use NRT replicas unless explicitly asked otherwise
   [junit4]   2> 874653 WARN  (TEST-HdfsUnloadDistributedZkTest.test-seed#[2B7759AB7508681F]) [     ] o.e.j.s.AbstractConnector Ignoring deprecated socket close linger time
   [junit4]   2> 874669 INFO  (TEST-HdfsUnloadDistributedZkTest.test-seed#[2B7759AB7508681F]) [     ] o.a.s.c.s.e.JettySolrRunner Start Jetty (original configured port=0)
   [junit4]   2> 874670 INFO  (TEST-HdfsUnloadDistributedZkTest.test-seed#[2B7759AB7508681F]) [     ] o.a.s.c.s.e.JettySolrRunner Trying to start Jetty on port 0 try number 1 ...
   [junit4]   2> 874670 INFO  (TEST-HdfsUnloadDistributedZkTest.test-seed#[2B7759AB7508681F]) [     ] o.e.j.s.Server jetty-9.4.19.v20190610; built: 2019-06-10T16:30:51.723Z; git: afcf563148970e98786327af5e07c261fda175d3; jvm 11.0.1+13-LTS
   [junit4]   2> 874670 INFO  (TEST-HdfsUnloadDistributedZkTest.test-seed#[2B7759AB7508681F]) [     ] o.e.j.s.session DefaultSessionIdManager workerName=node0
   [junit4]   2> 874670 INFO  (TEST-HdfsUnloadDistributedZkTest.test-seed#[2B7759AB7508681F]) [     ] o.e.j.s.session No SessionScavenger set, using defaults
   [junit4]   2> 874671 INFO  (TEST-HdfsUnloadDistributedZkTest.test-seed#[2B7759AB7508681F]) [     ] o.e.j.s.session node0 Scavenging every 660000ms
   [junit4]   2> 874672 INFO  (TEST-HdfsUnloadDistributedZkTest.test-seed#[2B7759AB7508681F]) [     ] o.e.j.s.h.ContextHandler Started o.e.j.s.ServletContextHandler@200bbfc{/qlev/x,null,AVAILABLE}
   [junit4]   2> 874672 INFO  (TEST-HdfsUnloadDistributedZkTest.test-seed#[2B7759AB7508681F]) [     ] o.e.j.s.AbstractConnector Started ServerConnector@276ad9cb{HTTP/1.1,[http/1.1, h2c]}{127.0.0.1:41912}
   [junit4]   2> 874672 INFO  (TEST-HdfsUnloadDistributedZkTest.test-seed#[2B7759AB7508681F]) [     ] o.e.j.s.Server Started @874721ms
   [junit4]   2> 874672 INFO  (TEST-HdfsUnloadDistributedZkTest.test-seed#[2B7759AB7508681F]) [     ] o.a.s.c.s.e.JettySolrRunner Jetty properties: {hostContext=/qlev/x, solr.data.dir=hdfs://lucene2-us-west.apache.org:39982/hdfs__lucene2-us-west.apache.org_39982__home_jenkins_jenkins-slave_workspace_Lucene-Solr-NightlyTests-master_checkout_solr_build_solr-core_test_J2_temp_solr.cloud.hdfs.HdfsUnloadDistributedZkTest_2B7759AB7508681F-001_tempDir-002_control_data, hostPort=41912, coreRootDirectory=/home/jenkins/jenkins-slave/workspace/Lucene-Solr-NightlyTests-master/checkout/solr/build/solr-core/test/J2/../../../../../../../../../../../home/jenkins/jenkins-slave/workspace/Lucene-Solr-NightlyTests-master/checkout/solr/build/solr-core/test/J2/temp/solr.cloud.hdfs.HdfsUnloadDistributedZkTest_2B7759AB7508681F-001/control-001/cores}
   [junit4]   2> 874673 ERROR (TEST-HdfsUnloadDistributedZkTest.test-seed#[2B7759AB7508681F]) [     ] o.a.s.u.StartupLoggingUtils Missing Java Option solr.log.dir. Logging may be missing or incomplete.
   [junit4]   2> 874673 INFO  (TEST-HdfsUnloadDistributedZkTest.test-seed#[2B7759AB7508681F]) [     ] o.a.s.s.SolrDispatchFilter Using logger factory org.apache.logging.slf4j.Log4jLoggerFactory
   [junit4]   2> 874673 INFO  (TEST-HdfsUnloadDistributedZkTest.test-seed#[2B7759AB7508681F]) [     ] o.a.s.s.SolrDispatchFilter  ___      _       Welcome to Apache Solr™ version 9.0.0
   [junit4]   2> 874673 INFO  (TEST-HdfsUnloadDistributedZkTest.test-seed#[2B7759AB7508681F]) [     ] o.a.s.s.SolrDispatchFilter / __| ___| |_ _   Starting in cloud mode on port null
   [junit4]   2> 874673 INFO  (TEST-HdfsUnloadDistributedZkTest.test-seed#[2B7759AB7508681F]) [     ] o.a.s.s.SolrDispatchFilter \__ \/ _ \ | '_|  Install dir: null
   [junit4]   2> 874673 INFO  (TEST-HdfsUnloadDistributedZkTest.test-seed#[2B7759AB7508681F]) [     ] o.a.s.s.SolrDispatchFilter |___/\___/_|_|    Start time: 2019-07-08T21:55:02.437281Z
   [junit4]   2> 874687 INFO  (TEST-HdfsUnloadDistributedZkTest.test-seed#[2B7759AB7508681F]) [     ] o.a.s.c.c.ConnectionManager Waiting for client to connect to ZooKeeper
   [junit4]   2> 874706 INFO  (zkConnectionManagerCallback-1941-thread-1) [     ] o.a.s.c.c.ConnectionManager zkClient has connected
   [junit4]   2> 874706 INFO  (TEST-HdfsUnloadDistributedZkTest.test-seed#[2B7759AB7508681F]) [     ] o.a.s.c.c.ConnectionManager Client is connected to ZooKeeper
   [junit4]   2> 874815 INFO  (TEST-HdfsUnloadDistributedZkTest.test-seed#[2B7759AB7508681F]) [     ] o.a.s.s.SolrDispatchFilter Loading solr.xml from SolrHome (not found in ZooKeeper)
   [junit4]   2> 874815 INFO  (TEST-HdfsUnloadDistributedZkTest.test-seed#[2B7759AB7508681F]) [     ] o.a.s.c.SolrXmlConfig Loading container configuration from /home/jenkins/jenkins-slave/workspace/Lucene-Solr-NightlyTests-master/checkout/solr/build/solr-core/test/J2/temp/solr.cloud.hdfs.HdfsUnloadDistributedZkTest_2B7759AB7508681F-001/control-001/solr.xml
   [junit4]   2> 874819 INFO  (TEST-HdfsUnloadDistributedZkTest.test-seed#[2B7759AB7508681F]) [     ] o.a.s.c.SolrXmlConfig Configuration parameter autoReplicaFailoverWorkLoopDelay is ignored
   [junit4]   2> 874819 INFO  (TEST-HdfsUnloadDistributedZkTest.test-seed#[2B7759AB7508681F]) [     ] o.a.s.c.SolrXmlConfig Configuration parameter autoReplicaFailoverBadNodeExpiration is ignored
   [junit4]   2> 874833 INFO  (TEST-HdfsUnloadDistributedZkTest.test-seed#[2B7759AB7508681F]) [     ] o.a.s.c.SolrXmlConfig MBean server found: com.sun.jmx.mbeanserver.JmxMBeanServer@598e4a8e, but no JMX reporters were configured - adding default JMX reporter.
   [junit4]   2> 875674 INFO  (TEST-HdfsUnloadDistributedZkTest.test-seed#[2B7759AB7508681F]) [     ] o.a.s.h.c.HttpShardHandlerFactory Host whitelist initialized: WhitelistHostChecker [whitelistHosts=null, whitelistHostCheckingEnabled=false]
   [junit4]   2> 875693 WARN  (TEST-HdfsUnloadDistributedZkTest.test-seed#[2B7759AB7508681F]) [     ] o.e.j.u.s.S.config Trusting all certificates configured for Client@6508d637[provider=null,keyStore=null,trustStore=null]
   [junit4]   2> 875693 WARN  (TEST-HdfsUnloadDistributedZkTest.test-seed#[2B7759AB7508681F]) [     ] o.e.j.u.s.S.config No Client EndPointIdentificationAlgorithm configured for Client@6508d637[provider=null,keyStore=null,trustStore=null]
   [junit4]   2> 875744 WARN  (TEST-HdfsUnloadDistributedZkTest.test-seed#[2B7759AB7508681F]) [     ] o.e.j.u.s.S.config Trusting all certificates configured for Client@7d64e971[provider=null,keyStore=null,trustStore=null]
   [junit4]   2> 875744 WARN  (TEST-HdfsUnloadDistributedZkTest.test-seed#[2B7759AB7508681F]) [     ] o.e.j.u.s.S.config No Client EndPointIdentificationAlgorithm configured for Client@7d64e971[provider=null,keyStore=null,trustStore=null]
   [junit4]   2> 875745 INFO  (TEST-HdfsUnloadDistributedZkTest.test-seed#[2B7759AB7508681F]) [     ] o.a.s.c.ZkContainer Zookeeper client=127.0.0.1:44240/solr
   [junit4]   2> 875763 INFO  (TEST-HdfsUnloadDistributedZkTest.test-seed#[2B7759AB7508681F]) [     ] o.a.s.c.c.ConnectionManager Waiting for client to connect to ZooKeeper
   [junit4]   2> 875787 INFO  (zkConnectionManagerCallback-1948-thread-1) [     ] o.a.s.c.c.ConnectionManager zkClient has connected
   [junit4]   2> 875816 INFO  (TEST-HdfsUnloadDistributedZkTest.test-seed#[2B7759AB7508681F]) [     ] o.a.s.c.c.ConnectionManager Client is connected to ZooKeeper
   [junit4]   2> 875978 INFO  (TEST-HdfsUnloadDistributedZkTest.test-seed#[2B7759AB7508681F]) [n:127.0.0.1:41912_qlev%2Fx     ] o.a.s.c.c.ConnectionManager Waiting for client to connect to ZooKeeper
   [junit4]   2> 876018 INFO  (zkConnectionManagerCallback-1950-thread-1) [     ] o.a.s.c.c.ConnectionManager zkClient has connected
   [junit4]   2> 876030 INFO  (TEST-HdfsUnloadDistributedZkTest.test-seed#[2B7759AB7508681F]) [n:127.0.0.1:41912_qlev%2Fx     ] o.a.s.c.c.ConnectionManager Client is connected to ZooKeeper
   [junit4]   2> 876758 INFO  (TEST-HdfsUnloadDistributedZkTest.test-seed#[2B7759AB7508681F]) [n:127.0.0.1:41912_qlev%2Fx     ] o.a.s.c.OverseerElectionContext I am going to be the leader 127.0.0.1:41912_qlev%2Fx
   [junit4]   2> 876758 INFO  (TEST-HdfsUnloadDistributedZkTest.test-seed#[2B7759AB7508681F]) [n:127.0.0.1:41912_qlev%2Fx     ] o.a.s.c.Overseer Overseer (id=75004112278978564-127.0.0.1:41912_qlev%2Fx-n_0000000000) starting
   [junit4]   2> 876836 INFO  (TEST-HdfsUnloadDistributedZkTest.test-seed#[2B7759AB7508681F]) [n:127.0.0.1:41912_qlev%2Fx     ] o.a.s.c.c.ConnectionManager Waiting for client to connect to ZooKeeper
   [junit4]   2> 876893 INFO  (zkConnectionManagerCallback-1957-thread-1) [     ] o.a.s.c.c.ConnectionManager zkClient has connected
   [junit4]   2> 876894 INFO  (TEST-HdfsUnloadDistributedZkTest.test-seed#[2B7759AB7508681F]) [n:127.0.0.1:41912_qlev%2Fx     ] o.a.s.c.c.ConnectionManager Client is connected to ZooKeeper
   [junit4]   2> 876919 INFO  (TEST-HdfsUnloadDistributedZkTest.test-seed#[2B7759AB7508681F]) [n:127.0.0.1:41912_qlev%2Fx     ] o.a.s.c.s.i.ZkClientClusterStateProvider Cluster at 127.0.0.1:44240/solr ready
   [junit4]   2> 876938 INFO  (OverseerStateUpdate-75004112278978564-127.0.0.1:41912_qlev%2Fx-n_0000000000) [n:127.0.0.1:41912_qlev%2Fx     ] o.a.s.c.Overseer Starting to work on the main queue : 127.0.0.1:41912_qlev%2Fx
   [junit4]   2> 876987 INFO  (TEST-HdfsUnloadDistributedZkTest.test-seed#[2B7759AB7508681F]) [n:127.0.0.1:41912_qlev%2Fx     ] o.a.s.c.ZkController Register node as live in ZooKeeper:/live_nodes/127.0.0.1:41912_qlev%2Fx
   [junit4]   2> 877019 INFO  (zkCallback-1949-thread-1) [     ] o.a.s.c.c.ZkStateReader Updated live nodes from ZooKeeper... (0) -> (1)
   [junit4]   2> 877059 INFO  (zkCallback-1956-thread-1) [     ] o.a.s.c.c.ZkStateReader Updated live nodes from ZooKeeper... (0) -> (1)
   [junit4]   2> 877294 INFO  (TEST-HdfsUnloadDistributedZkTest.test-seed#[2B7759AB7508681F]) [n:127.0.0.1:41912_qlev%2Fx     ] o.a.s.h.a.MetricsHistoryHandler No .system collection, keeping metrics history in memory.
   [junit4]   2> 877674 INFO  (TEST-HdfsUnloadDistributedZkTest.test-seed#[2B7759AB7508681F]) [n:127.0.0.1:41912_qlev%2Fx     ] o.a.s.m.r.SolrJmxReporter JMX monitoring for 'solr.node' (registry 'solr.node') enabled at server: com.sun.jmx.mbeanserver.JmxMBeanServer@598e4a8e
   [junit4]   2> 877855 INFO  (TEST-HdfsUnloadDistributedZkTest.test-seed#[2B7759AB7508681F]) [n:127.0.0.1:41912_qlev%2Fx     ] o.a.s.m.r.SolrJmxReporter JMX monitoring for 'solr.jvm' (registry 'solr.jvm') enabled at server: com.sun.jmx.mbeanserver.JmxMBeanServer@598e4a8e
   [junit4]   2> 877870 INFO  (TEST-HdfsUnloadDistributedZkTest.test-seed#[2B7759AB7508681F]) [n:127.0.0.1:41912_qlev%2Fx     ] o.a.s.m.r.SolrJmxReporter JMX monitoring for 'solr.jetty' (registry 'solr.jetty') enabled at server: com.sun.jmx.mbeanserver.JmxMBeanServer@598e4a8e
   [junit4]   2> 877872 INFO  (TEST-HdfsUnloadDistributedZkTest.test-seed#[2B7759AB7508681F]) [n:127.0.0.1:41912_qlev%2Fx     ] o.a.s.c.CorePropertiesLocator Found 0 core definitions underneath /home/jenkins/jenkins-slave/workspace/Lucene-Solr-NightlyTests-master/checkout/solr/build/solr-core/test/J2/../../../../../../../../../../../home/jenkins/jenkins-slave/workspace/Lucene-Solr-NightlyTests-master/checkout/solr/build/solr-core/test/J2/temp/solr.cloud.hdfs.HdfsUnloadDistributedZkTest_2B7759AB7508681F-001/control-001/cores
   [junit4]   2> 878251 INFO  (TEST-HdfsUnloadDistributedZkTest.test-seed#[2B7759AB7508681F]) [     ] o.a.s.c.c.ConnectionManager Waiting for client to connect to ZooKeeper
   [junit4]   2> 878283 INFO  (zkConnectionManagerCallback-1963-thread-1) [     ] o.a.s.c.c.ConnectionManager zkClient has connected
   [junit4]   2> 878287 INFO  (TEST-HdfsUnloadDistributedZkTest.test-seed#[2B7759AB7508681F]) [     ] o.a.s.c.c.ConnectionManager Client is connected to ZooKeeper
   [junit4]   2> 878300 INFO  (TEST-HdfsUnloadDistributedZkTest.test-seed#[2B7759AB7508681F]) [     ] o.a.s.c.c.ZkStateReader Updated live nodes from ZooKeeper... (0) -> (1)
   [junit4]   2> 878301 INFO  (TEST-HdfsUnloadDistributedZkTest.test-seed#[2B7759AB7508681F]) [     ] o.a.s.c.s.i.ZkClientClusterStateProvider Cluster at 127.0.0.1:44240/solr ready
   [junit4]   2> 878397 INFO  (qtp483337142-3988) [n:127.0.0.1:41912_qlev%2Fx     ] o.a.s.h.a.CollectionsHandler Invoked Collection Action :create with params collection.configName=conf1&name=control_collection&nrtReplicas=1&action=CREATE&numShards=1&createNodeSet=127.0.0.1:41912_qlev%252Fx&wt=javabin&version=2 and sendToOCPQueue=true
   [junit4]   2> 878648 INFO  (OverseerThreadFactory-1102-thread-1-processing-n:127.0.0.1:41912_qlev%2Fx) [n:127.0.0.1:41912_qlev%2Fx     ] o.a.s.c.a.c.CreateCollectionCmd Create collection control_collection
   [junit4]   2> 879111 INFO  (qtp483337142-3990) [n:127.0.0.1:41912_qlev%2Fx    x:control_collection_shard1_replica_n1 ] o.a.s.h.a.CoreAdminOperation core create command qt=/admin/cores&collection.configName=conf1&newCollection=true&name=control_collection_shard1_replica_n1&action=CREATE&numShards=1&collection=control_collection&shard=shard1&wt=javabin&version=2&replicaType=NRT
   [junit4]   2> 879111 INFO  (qtp483337142-3990) [n:127.0.0.1:41912_qlev%2Fx    x:control_collection_shard1_replica_n1 ] o.a.s.c.TransientSolrCoreCacheDefault Allocating transient cache for 4 transient cores
   [junit4]   2> 880313 INFO  (qtp483337142-3990) [n:127.0.0.1:41912_qlev%2Fx c:control_collection s:shard1  x:control_collection_shard1_replica_n1 ] o.a.s.c.SolrConfig Using Lucene MatchVersion: 9.0.0
   [junit4]   2> 880607 INFO  (qtp483337142-3990) [n:127.0.0.1:41912_qlev%2Fx c:control_collection s:shard1  x:control_collection_shard1_replica_n1 ] o.a.s.s.IndexSchema [control_collection_shard1_replica_n1] Schema name=test
   [junit4]   2> 881452 INFO  (qtp483337142-3990) [n:127.0.0.1:41912_qlev%2Fx c:control_collection s:shard1  x:control_collection_shard1_replica_n1 ] o.a.s.s.IndexSchema Loaded schema test/1.0 with uniqueid field id
   [junit4]   2> 881486 INFO  (qtp483337142-3990) [n:127.0.0.1:41912_qlev%2Fx c:control_collection s:shard1  x:control_collection_shard1_replica_n1 ] o.a.s.c.CoreContainer Creating SolrCore 'control_collection_shard1_replica_n1' using configuration from collection control_collection, trusted=true
   [junit4]   2> 881486 INFO  (qtp483337142-3990) [n:127.0.0.1:41912_qlev%2Fx c:control_collection s:shard1  x:control_collection_shard1_replica_n1 ] o.a.s.m.r.SolrJmxReporter JMX monitoring for 'solr.core.control_collection.shard1.replica_n1' (registry 'solr.core.control_collection.shard1.replica_n1') enabled at server: com.sun.jmx.mbeanserver.JmxMBeanServer@598e4a8e
   [junit4]   2> 881497 INFO  (qtp483337142-3990) [n:127.0.0.1:41912_qlev%2Fx c:control_collection s:shard1  x:control_collection_shard1_replica_n1 ] o.a.s.c.HdfsDirectoryFactory solr.hdfs.home=hdfs://lucene2-us-west.apache.org:39982/solr_hdfs_home
   [junit4]   2> 881497 INFO  (qtp483337142-3990) [n:127.0.0.1:41912_qlev%2Fx c:control_collection s:shard1  x:control_collection_shard1_replica_n1 ] o.a.s.c.HdfsDirectoryFactory Solr Kerberos Authentication disabled
   [junit4]   2> 881498 INFO  (qtp483337142-3990) [n:127.0.0.1:41912_qlev%2Fx c:control_collection s:shard1  x:control_collection_shard1_replica_n1 ] o.a.s.c.SolrCore [[control_collection_shard1_replica_n1] ] Opening new SolrCore at [/home/jenkins/jenkins-slave/workspace/Lucene-Solr-NightlyTests-master/checkout/solr/build/solr-core/test/J2/temp/solr.cloud.hdfs.HdfsUnloadDistributedZkTest_2B7759AB7508681F-001/control-001/cores/control_collection_shard1_replica_n1], dataDir=[hdfs://lucene2-us-west.apache.org:39982/solr_hdfs_home/control_collection/core_node2/data/]
   [junit4]   2> 881499 INFO  (qtp483337142-3990) [n:127.0.0.1:41912_qlev%2Fx c:control_collection s:shard1  x:control_collection_shard1_replica_n1 ] o.a.s.c.HdfsDirectoryFactory creating directory factory for path hdfs://lucene2-us-west.apache.org:39982/solr_hdfs_home/control_collection/core_node2/data/snapshot_metadata
   [junit4]   2> 881522 INFO  (qtp483337142-3990) [n:127.0.0.1:41912_qlev%2Fx c:control_collection s:shard1  x:control_collection_shard1_replica_n1 ] o.a.s.c.HdfsDirectoryFactory Number of slabs of block cache [1] with direct memory allocation set to [true]
   [junit4]   2> 881522 INFO  (qtp483337142-3990) [n:127.0.0.1:41912_qlev%2Fx c:control_collection s:shard1  x:control_collection_shard1_replica_n1 ] o.a.s.c.HdfsDirectoryFactory Block cache target memory usage, slab size of [4194304] will allocate [1] slabs and use ~[4194304] bytes
   [junit4]   2> 881522 INFO  (qtp483337142-3990) [n:127.0.0.1:41912_qlev%2Fx c:control_collection s:shard1  x:control_collection_shard1_replica_n1 ] o.a.s.c.HdfsDirectoryFactory Creating new single instance HDFS BlockCache
   [junit4]   2> 881618 INFO  (qtp483337142-3990) [n:127.0.0.1:41912_qlev%2Fx c:control_collection s:shard1  x:control_collection_shard1_replica_n1 ] o.a.s.s.b.BlockDirectory Block cache on write is disabled
   [junit4]   2> 881631 INFO  (qtp483337142-3990) [n:127.0.0.1:41912_qlev%2Fx c:control_collection s:shard1  x:control_collection_shard1_replica_n1 ] o.a.s.c.HdfsDirectoryFactory creating directory factory for path hdfs://lucene2-us-west.apache.org:39982/solr_hdfs_home/control_collection/core_node2/data
   [junit4]   2> 881695 INFO  (qtp483337142-3990) [n:127.0.0.1:41912_qlev%2Fx c:control_collection s:shard1  x:control_collection_shard1_replica_n1 ] o.a.s.c.HdfsDirectoryFactory creating directory factory for path hdfs://lucene2-us-west.apache.org:39982/solr_hdfs_home/control_collection/core_node2/data/index
   [junit4]   2> 881706 INFO  (qtp483337142-3990) [n:127.0.0.1:41912_qlev%2Fx c:control_collection s:shard1  x:control_collection_shard1_replica_n1 ] o.a.s.c.HdfsDirectoryFactory Number of slabs of block cache [1] with direct memory allocation set to [true]
   [junit4]   2> 881719 INFO  (qtp483337142-3990) [n:127.0.0.1:41912_qlev%2Fx c:control_collection s:shard1  x:control_collection_shard1_replica_n1 ] o.a.s.c.HdfsDirectoryFactory Block cache target memory usage, slab size of [4194304] will allocate [1] slabs and use ~[4194304] bytes
   [junit4]   2> 881719 INFO  (qtp483337142-3990) [n:127.0.0.1:41912_qlev%2Fx c:control_collection s:shard1  x:control_collection_shard1_replica_n1 ] o.a.s.c.HdfsDirectoryFactory Creating new single instance HDFS BlockCache
   [junit4]   2> 881760 INFO  (qtp483337142-3990) [n:127.0.0.1:41912_qlev%2Fx c:control_collection s:shard1  x:control_collection_shard1_replica_n1 ] o.a.s.s.b.BlockDirectory Block cache on write is disabled
   [junit4]   2> 881761 INFO  (qtp483337142-3990) [n:127.0.0.1:41912_qlev%2Fx c:control_collection s:shard1  x:control_collection_shard1_replica_n1 ] o.a.s.u.RandomMergePolicy RandomMergePolicy wrapping class org.apache.lucene.index.LogDocMergePolicy: [LogDocMergePolicy: minMergeSize=1000, mergeFactor=31, maxMergeSize=9223372036854775807, maxMergeSizeForForcedMerge=9223372036854775807, calibrateSizeByDeletes=true, maxMergeDocs=2147483647, maxCFSSegmentSizeMB=1.0859375, noCFSRatio=0.0]
   [junit4]   2> 882508 WARN  (qtp483337142-3990) [n:127.0.0.1:41912_qlev%2Fx c:control_collection s:shard1  x:control_collection_shard1_replica_n1 ] o.a.s.c.RequestHandlers INVALID paramSet a in requestHandler {type = requestHandler,name = /dump,class = DumpRequestHandler,attributes = {initParams=a, name=/dump, class=DumpRequestHandler},args = {defaults={a=A,b=B}}}
   [junit4]   2> 882646 INFO  (qtp483337142-3990) [n:127.0.0.1:41912_qlev%2Fx c:control_collection s:shard1  x:control_collection_shard1_replica_n1 ] o.a.s.u.UpdateHandler Using UpdateLog implementation: org.apache.solr.update.HdfsUpdateLog
   [junit4]   2> 882646 INFO  (qtp483337142-3990) [n:127.0.0.1:41912_qlev%2Fx c:control_collection s:shard1  x:control_collection_shard1_replica_n1 ] o.a.s.u.UpdateLog Initializing UpdateLog: dataDir= defaultSyncLevel=FLUSH numRecordsToKeep=100 maxNumLogsToKeep=10 numVersionBuckets=65536
   [junit4]   2> 882646 INFO  (qtp483337142-3990) [n:127.0.0.1:41912_qlev%2Fx c:control_collection s:shard1  x:control_collection_shard1_replica_n1 ] o.a.s.u.HdfsUpdateLog Initializing HdfsUpdateLog: tlogDfsReplication=2
   [junit4]   2> 882666 INFO  (qtp483337142-3990) [n:127.0.0.1:41912_qlev%2Fx c:control_collection s:shard1  x:control_collection_shard1_replica_n1 ] o.a.s.u.CommitTracker Hard AutoCommit: disabled
   [junit4]   2> 882666 INFO  (qtp483337142-3990) [n:127.0.0.1:41912_qlev%2Fx c:control_collection s:shard1  x:control_collection_shard1_replica_n1 ] o.a.s.u.CommitTracker Soft AutoCommit: disabled
   [junit4]   2> 882669 INFO  (qtp483337142-3990) [n:127.0.0.1:41912_qlev%2Fx c:control_collection s:shard1  x:control_collection_shard1_replica_n1 ] o.a.s.u.RandomMergePolicy RandomMergePolicy wrapping class org.apache.lucene.index.MockRandomMergePolicy: org.apache.lucene.index.MockRandomMergePolicy@2b8dbbc4
   [junit4]   2> 882791 INFO  (qtp483337142-3990) [n:127.0.0.1:41912_qlev%2Fx c:control_collection s:shard1  x:control_collection_shard1_replica_n1 ] o.a.s.s.SolrIndexSearcher Opening [Searcher@7de23179[control_collection_shard1_replica_n1] main]
   [junit4]   2> 882807 INFO  (qtp483337142-3990) [n:127.0.0.1:41912_qlev%2Fx c:control_collection s:shard1  x:control_collection_shard1_replica_n1 ] o.a.s.r.ManagedResourceStorage Configured ZooKeeperStorageIO with znodeBase: /configs/conf1
   [junit4]   2> 882811 INFO  (qtp483337142-3990) [n:127.0.0.1:41912_qlev%2Fx c:control_collection s:shard1  x:control_collection_shard1_replica_n1 ] o.a.s.r.ManagedResourceStorage Loaded null at path _rest_managed.json using ZooKeeperStorageIO:path=/configs/conf1
   [junit4]   2> 882820 INFO  (qtp483337142-3990) [n:127.0.0.1:41912_qlev%2Fx c:control_collection s:shard1  x:control_collection_shard1_replica_n1 ] o.a.s.h.ReplicationHandler Commits will be reserved for 10000ms.
   [junit4]   2> 882822 INFO  (qtp483337142-3990) [n:127.0.0.1:41912_qlev%2Fx c:control_collection s:shard1  x:control_collection_shard1_replica_n1 ] o.a.s.u.UpdateLog Could not find max version in index or recent updates, using new clock 1638528881090625536
   [junit4]   2> 882829 INFO  (searcherExecutor-1107-thread-1-processing-n:127.0.0.1:41912_qlev%2Fx x:control_collection_shard1_replica_n1 c:control_collection s:shard1) [n:127.0.0.1:41912_qlev%2Fx c:control_collection s:shard1  x:control_collection_shard1_replica_n1 ] o.a.s.c.SolrCore [control_collection_shard1_replica_n1] Registered new searcher Searcher@7de23179[control_collection_shard1_replica_n1] main{ExitableDirectoryReader(UninvertingDirectoryReader())}
   [junit4]   2> 882841 INFO  (qtp483337142-3990) [n:127.0.0.1:41912_qlev%2Fx c:control_collection s:shard1  x:control_collection_shard1_replica_n1 ] o.a.s.c.ZkShardTerms Successful update of terms at /collections/control_collection/terms/shard1 to Terms{values={core_node2=0}, version=0}
   [junit4]   2> 882841 INFO  (qtp483337142-3990) [n:127.0.0.1:41912_qlev%2Fx c:control_collection s:shard1  x:control_collection_shard1_replica_n1 ] o.a.s.c.ShardLeaderElectionContextBase make sure parent is created /collections/control_collection/leaders/shard1
   [junit4]   2> 882846 INFO  (qtp483337142-3990) [n:127.0.0.1:41912_qlev%2Fx c:control_collection s:shard1  x:control_collection_shard1_replica_n1 ] o.a.s.c.ShardLeaderElectionContext Enough replicas found to continue.
   [junit4]   2> 882846 INFO  (qtp483337142-3990) [n:127.0.0.1:41912_qlev%2Fx c:control_collection s:shard1  x:control_collection_shard1_replica_n1 ] o.a.s.c.ShardLeaderElectionContext I may be the new leader - try and sync
   [junit4]   2> 882846 INFO  (qtp483337142-3990) [n:127.0.0.1:41912_qlev%2Fx c:control_collection s:shard1  x:control_collection_shard1_replica_n1 ] o.a.s.c.SyncStrategy Sync replicas to http://127.0.0.1:41912/qlev/x/control_collection_shard1_replica_n1/
   [junit4]   2> 882847 INFO  (qtp483337142-3990) [n:127.0.0.1:41912_qlev%2Fx c:control_collection s:shard1  x:control_collection_shard1_replica_n1 ] o.a.s.c.SyncStrategy Sync Success - now sync replicas to me
   [junit4]   2> 882847 INFO  (qtp483337142-3990) [n:127.0.0.1:41912_qlev%2Fx c:control_collection s:shard1  x:control_collection_shard1_replica_n1 ] o.a.s.c.SyncStrategy http://127.0.0.1:41912/qlev/x/control_collection_shard1_replica_n1/ has no replicas
   [junit4]   2> 882847 INFO  (qtp483337142-3990) [n:127.0.0.1:41912_qlev%2Fx c:control_collection s:shard1  x:control_collection_shard1_replica_n1 ] o.a.s.c.ShardLeaderElectionContextBase Creating leader registration node /collections/control_collection/leaders/shard1/leader after winning as /collections/control_collection/leader_elect/shard1/election/75004112278978564-core_node2-n_0000000000
   [junit4]   2> 882856 INFO  (qtp483337142-3990) [n:127.0.0.1:41912_qlev%2Fx c:control_collection s:shard1  x:control_collection_shard1_replica_n1 ] o.a.s.c.ShardLeaderElectionContext I am the new leader: http://127.0.0.1:41912/qlev/x/control_collection_shard1_replica_n1/ shard1
   [junit4]   2> 882857 INFO  (qtp483337142-3990) [n:127.0.0.1:41912_qlev%2Fx c:control_collection s:shard1  x:control_collection_shard1_replica_n1 ] o.a.s.c.ZkController I am the leader, no recovery necessary
   [junit4]   2> 882868 INFO  (qtp483337142-3990) [n:127.0.0.1:41912_qlev%2Fx c:control_collection s:shard1  x:control_collection_shard1_replica_n1 ] o.a.s.s.HttpSolrCall [admin] webapp=null path=/admin/cores params={qt=/admin/cores&collection.configName=conf1&newCollection=true&name=control_collection_shard1_replica_n1&action=CREATE&numShards=1&collection=control_collection&shard=shard1&wt=javabin&version=2&replicaType=NRT} status=0 QTime=3757
   [junit4]   2> 882885 INFO  (qtp483337142-3988) [n:127.0.0.1:41912_qlev%2Fx     ] o.a.s.h.a.CollectionsHandler Wait for new collection to be active for at most 45 seconds. Check all shard replicas
   [junit4]   2> 882976 INFO  (zkCallback-1949-thread-1) [     ] o.a.s.c.c.ZkStateReader A cluster state change: [WatchedEvent state:SyncConnected type:NodeDataChanged path:/collections/control_collection/state.json] for collection [control_collection] has occurred - updating... (live nodes size: [1])
   [junit4]   2> 882980 INFO  (zkCallback-1949-thread-2) [     ] o.a.s.c.c.ZkStateReader A cluster state change: [WatchedEvent state:SyncConnected type:NodeDataChanged path:/collections/control_collection/state.json] for collection [control_collection] has occurred - updating... (live nodes size: [1])
   [junit4]   2> 882984 INFO  (qtp483337142-3988) [n:127.0.0.1:41912_qlev%2Fx     ] o.a.s.s.HttpSolrCall [admin] webapp=null path=/admin/collections params={collection.configName=conf1&name=control_collection&nrtReplicas=1&action=CREATE&numShards=1&createNodeSet=127.0.0.1:41912_qlev%252Fx&wt=javabin&version=2} status=0 QTime=4586
   [junit4]   2> 883141 INFO  (TEST-HdfsUnloadDistributedZkTest.test-seed#[2B7759AB7508681F]) [     ] o.a.s.c.c.ConnectionManager Waiting for client to connect to ZooKeeper
   [junit4]   2> 883143 INFO  (zkConnectionManagerCallback-1969-thread-1) [     ] o.a.s.c.c.ConnectionManager zkClient has connected
   [junit4]   2> 883143 INFO  (TEST-HdfsUnloadDistributedZkTest.test-seed#[2B7759AB7508681F]) [     ] o.a.s.c.c.ConnectionManager Client is connected to ZooKeeper
   [junit4]   2> 883163 INFO  (TEST-HdfsUnloadDistributedZkTest.test-seed#[2B7759AB7508681F]) [     ] o.a.s.c.c.ZkStateReader Updated live nodes from ZooKeeper... (0) -> (1)
   [junit4]   2> 883165 INFO  (TEST-HdfsUnloadDistributedZkTest.test-seed#[2B7759AB7508681F]) [     ] o.a.s.c.s.i.ZkClientClusterStateProvider Cluster at 127.0.0.1:44240/solr ready
   [junit4]   2> 883165 INFO  (TEST-HdfsUnloadDistributedZkTest.test-seed#[2B7759AB7508681F]) [     ] o.a.s.c.ChaosMonkey monkey: init - expire sessions:false cause connection loss:false
   [junit4]   2> 883166 INFO  (qtp483337142-3990) [n:127.0.0.1:41912_qlev%2Fx     ] o.a.s.h.a.CollectionsHandler Invoked Collection Action :create with params collection.configName=conf1&name=collection1&nrtReplicas=1&action=CREATE&numShards=2&createNodeSet=&stateFormat=2&wt=javabin&version=2 and sendToOCPQueue=true
   [junit4]   2> 883193 INFO  (OverseerCollectionConfigSetProcessor-75004112278978564-127.0.0.1:41912_qlev%2Fx-n_0000000000) [n:127.0.0.1:41912_qlev%2Fx     ] o.a.s.c.OverseerTaskQueue Response ZK path: /overseer/collection-queue-work/qnr-0000000000 doesn't exist.  Requestor may have disconnected from ZooKeeper
   [junit4]   2> 883193 INFO  (OverseerThreadFactory-1102-thread-2-processing-n:127.0.0.1:41912_qlev%2Fx) [n:127.0.0.1:41912_qlev%2Fx     ] o.a.s.c.a.c.CreateCollectionCmd Create collection collection1
   [junit4]   2> 883402 WARN  (OverseerThreadFactory-1102-thread-2-processing-n:127.0.0.1:41912_qlev%2Fx) [n:127.0.0.1:41912_qlev%2Fx     ] o.a.s.c.a.c.CreateCollectionCmd It is unusual to create a collection (collection1) without cores.
   [junit4]   2> 883412 INFO  (qtp483337142-3990) [n:127.0.0.1:41912_qlev%2Fx     ] o.a.s.h.a.CollectionsHandler Wait for new collection to be active for at most 45 seconds. Check all shard replicas
   [junit4]   2> 883413 INFO  (qtp483337142-3990) [n:127.0.0.1:41912_qlev%2Fx     ] o.a.s.s.HttpSolrCall [admin] webapp=null path=/admin/collections params={collection.configName=conf1&name=collection1&nrtReplicas=1&action=CREATE&numShards=2&createNodeSet=&stateFormat=2&wt=javabin&version=2} status=0 QTime=246
   [junit4]   2> 883431 INFO  (TEST-HdfsUnloadDistributedZkTest.test-seed#[2B7759AB7508681F]) [     ] o.a.s.c.AbstractFullDistribZkTestBase Creating jetty instances pullReplicaCount=0 numOtherReplicas=4
   [junit4]   2> 883717 INFO  (TEST-HdfsUnloadDistributedZkTest.test-seed#[2B7759AB7508681F]) [     ] o.a.s.c.AbstractFullDistribZkTestBase create jetty 1 in directory /home/jenkins/jenkins-slave/workspace/Lucene-Solr-NightlyTests-master/checkout/solr/build/solr-core/test/J2/temp/solr.cloud.hdfs.HdfsUnloadDistributedZkTest_2B7759AB7508681F-001/shard-1-001 of type NRT
   [junit4]   2> 883732 WARN  (closeThreadPool-1970-thread-1) [     ] o.e.j.s.AbstractConnector Ignoring deprecated socket close linger time
   [junit4]   2> 883733 INFO  (closeThreadPool-1970-thread-1) [     ] o.a.s.c.s.e.JettySolrRunner Start Jetty (original configured port=0)
   [junit4]   2> 883734 INFO  (closeThreadPool-1970-thread-1) [     ] o.a.s.c.s.e.JettySolrRunner Trying to start Jetty on port 0 try number 1 ...
   [junit4]   2> 883735 INFO  (closeThreadPool-1970-thread-1) [     ] o.e.j.s.Server jetty-9.4.19.v20190610; built: 2019-06-10T16:30:51.723Z; git: afcf563148970e98786327af5e07c261fda175d3; jvm 11.0.1+13-LTS
   [junit4]   2> 883784 INFO  (closeThreadPool-1970-thread-1) [     ] o.e.j.s.session DefaultSessionIdManager workerName=node0
   [junit4]   2> 883784 INFO  (closeThreadPool-1970-thread-1) [     ] o.e.j.s.session No SessionScavenger set, using defaults
   [junit4]   2> 883784 INFO  (closeThreadPool-1970-thread-1) [     ] o.e.j.s.session node0 Scavenging every 660000ms
   [junit4]   2> 883789 INFO  (closeThreadPool-1970-thread-1) [     ] o.e.j.s.h.ContextHandler Started o.e.j.s.ServletContextHandler@43c5f45e{/qlev/x,null,AVAILABLE}
   [junit4]   2> 883789 INFO  (closeThreadPool-1970-thread-1) [     ] o.e.j.s.AbstractConnector Started ServerConnector@33dea03a{HTTP/1.1,[http/1.1, h2c]}{127.0.0.1:34920}
   [junit4]   2> 883789 INFO  (closeThreadPool-1970-thread-1) [     ] o.e.j.s.Server Started @883838ms
   [junit4]   2> 883789 INFO  (closeThreadPool-1970-thread-1) [     ] o.a.s.c.s.e.JettySolrRunner Jetty properties: {hostContext=/qlev/x, solrconfig=solrconfig.xml, solr.data.dir=hdfs://lucene2-us-west.apache.org:39982/hdfs__lucene2-us-west.apache.org_39982__home_jenkins_jenkins-slave_workspace_Lucene-Solr-NightlyTests-master_checkout_solr_build_solr-core_test_J2_temp_solr.cloud.hdfs.HdfsUnloadDistributedZkTest_2B7759AB7508681F-001_tempDir-002_jetty1, hostPort=34920, coreRootDirectory=/home/jenkins/jenkins-slave/workspace/Lucene-Solr-NightlyTests-master/checkout/solr/build/solr-core/test/J2/temp/solr.cloud.hdfs.HdfsUnloadDistributedZkTest_2B7759AB7508681F-001/shard-1-001/cores}
   [junit4]   2> 883790 ERROR (closeThreadPool-1970-thread-1) [     ] o.a.s.u.StartupLoggingUtils Missing Java Option solr.log.dir. Logging may be missing or incomplete.
   [junit4]   2> 883790 INFO  (closeThreadPool-1970-thread-1) [     ] o.a.s.s.SolrDispatchFilter Using logger factory org.apache.logging.slf4j.Log4jLoggerFactory
   [junit4]   2> 883790 INFO  (closeThreadPool-1970-thread-1) [     ] o.a.s.s.SolrDispatchFilter  ___      _       Welcome to Apache Solr™ version 9.0.0
   [junit4]   2> 883790 INFO  (closeThreadPool-1970-thread-1) [     ] o.a.s.s.SolrDispatchFilter / __| ___| |_ _   Starting in cloud mode on port null
   [junit4]   2> 883790 INFO  (closeThreadPool-1970-thread-1) [     ] o.a.s.s.SolrDispatchFilter \__ \/ _ \ | '_|  Install dir: null
   [junit4]   2> 883790 INFO  (closeThreadPool-1970-thread-1) [     ] o.a.s.s.SolrDispatchFilter |___/\___/_|_|    Start time: 2019-07-08T21:55:11.554470Z
   [junit4]   2> 883811 INFO  (closeThreadPool-1970-thread-1) [     ] o.a.s.c.c.ConnectionManager Waiting for client to connect to ZooKeeper
   [junit4]   2> 883815 INFO  (zkConnectionManagerCallback-1972-thread-1) [     ] o.a.s.c.c.ConnectionManager zkClient has connected
   [junit4]   2> 883815 INFO  (closeThreadPool-1970-thread-1) [     ] o.a.s.c.c.ConnectionManager Client is connected to ZooKeeper
   [junit4]   2> 883917 INFO  (closeThreadPool-1970-thread-1) [     ] o.a.s.s.SolrDispatchFilter Loading solr.xml from SolrHome (not found in ZooKeeper)
   [junit4]   2> 883917 INFO  (closeThreadPool-1970-thread-1) [     ] o.a.s.c.SolrXmlConfig Loading container configuration from /home/jenkins/jenkins-slave/workspace/Lucene-Solr-NightlyTests-master/checkout/solr/build/solr-core/test/J2/temp/solr.cloud.hdfs.HdfsUnloadDistributedZkTest_2B7759AB7508681F-001/shard-1-001/solr.xml
   [junit4]   2> 883933 INFO  (closeThreadPool-1970-thread-1) [     ] o.a.s.c.SolrXmlConfig Configuration parameter autoReplicaFailoverWorkLoopDelay is ignored
   [junit4]   2> 883933 INFO  (closeThreadPool-1970-thread-1) [     ] o.a.s.c.SolrXmlConfig Configuration parameter autoReplicaFailoverBadNodeExpiration is ignored
   [junit4]   2> 883934 INFO  (closeThreadPool-1970-thread-1) [     ] o.a.s.c.SolrXmlConfig MBean server found: com.sun.jmx.mbeanserver.JmxMBeanServer@598e4a8e, but no JMX reporters were configured - adding default JMX reporter.
   [junit4]   2> 884184 INFO  (closeThreadPool-1970-thread-1) [     ] o.a.s.h.c.HttpShardHandlerFactory Host whitelist initialized: WhitelistHostChecker [whitelistHosts=null, whitelistHostCheckingEnabled=false]
   [junit4]   2> 884205 INFO  (TEST-HdfsUnloadDistributedZkTest.test-seed#[2B7759AB7508681F]) [     ] o.a.s.c.AbstractFullDistribZkTestBase create jetty 2 in directory /home/jenkins/jenkins-slave/workspace/Lucene-Solr-NightlyTests-master/checkout/solr/build/solr-core/test/J2/temp/solr.cloud.hdfs.HdfsUnloadDistributedZkTest_2B7759AB7508681F-001/shard-2-001 of type NRT
   [junit4]   2> 884215 WARN  (closeThreadPool-1970-thread-1) [     ] o.e.j.u.s.S.config Trusting all certificates configured for Client@309975da[provider=null,keyStore=null,trustStore=null]
   [junit4]   2> 884215 WARN  (closeThreadPool-1970-thread-1) [     ] o.e.j.u.s.S.config No Client EndPointIdentificationAlgorithm configured for Client@309975da[provider=null,keyStore=null,trustStore=null]
   [junit4]   2> 884228 WARN  (closeThreadPool-1970-thread-2) [     ] o.e.j.s.AbstractConnector Ignoring deprecated socket close linger time
   [junit4]   2> 884228 INFO  (closeThreadPool-1970-thread-2) [     ] o.a.s.c.s.e.JettySolrRunner Start Jetty (original configured port=0)
   [junit4]   2> 884228 INFO  (closeThreadPool-1970-thread-2) [     ] o.a.s.c.s.e.JettySolrRunner Trying to start Jetty on port 0 try number 1 ...
   [junit4]   2> 884228 INFO  (closeThreadPool-1970-thread-2) [     ] o.e.j.s.Server jetty-9.4.19.v20190610; built: 2019-06-10T16:30:51.723Z; git: afcf563148970e98786327af5e07c261fda175d3; jvm 11.0.1+13-LTS
   [junit4]   2> 884255 WARN  (closeThreadPool-1970-thread-1) [     ] o.e.j.u.s.S.config Trusting all certificates configured for Client@32857c6e[provider=null,keyStore=null,trustStore=null]
   [junit4]   2> 884255 WARN  (closeThreadPool-1970-thread-1) [     ] o.e.j.u.s.S.config No Client EndPointIdentificationAlgorithm configured for Client@32857c6e[provider=null,keyStore=null,trustStore=null]
   [junit4]   2> 884257 INFO  (closeThreadPool-1970-thread-1) [     ] o.a.s.c.ZkContainer Zookeeper client=127.0.0.1:44240/solr
   [junit4]   2> 884273 INFO  (closeThreadPool-1970-thread-2) [     ] o.e.j.s.session DefaultSessionIdManager workerName=node0
   [junit4]   2> 884273 INFO  (closeThreadPool-1970-thread-2) [     ] o.e.j.s.session No SessionScavenger set, using defaults
   [junit4]   2> 884273 INFO  (closeThreadPool-1970-thread-2) [     ] o.e.j.s.session node0 Scavenging every 600000ms
   [junit4]   2> 884275 INFO  (closeThreadPool-1970-thread-1) [     ] o.a.s.c.c.ConnectionManager Waiting for client to connect to ZooKeeper
   [junit4]   2> 884276 INFO  (closeThreadPool-1970-thread-2) [     ] o.e.j.s.h.ContextHandler Started o.e.j.s.ServletContextHandler@720f90ce{/qlev/x,null,AVAILABLE}
   [junit4]   2> 884276 INFO  (closeThreadPool-1970-thread-2) [     ] o.e.j.s.AbstractConnector Started ServerConnector@3d7f17a{HTTP/1.1,[http/1.1, h2c]}{127.0.0.1:42144}
   [junit4]   2> 884276 INFO  (closeThreadPool-1970-thread-2) [     ] o.e.j.s.Server Started @884325ms
   [junit4]   2> 884276 INFO  (closeThreadPool-1970-thread-2) [     ] o.a.s.c.s.e.JettySolrRunner Jetty properties: {hostContext=/qlev/x, solrconfig=solrconfig.xml, solr.data.dir=hdfs://lucene2-us-west.apache.org:39982/hdfs__lucene2-us-west.apache.org_39982__home_jenkins_jenkins-slave_workspace_Lucene-Solr-NightlyTests-master_checkout_solr_build_solr-core_test_J2_temp_solr.cloud.hdfs.HdfsUnloadDistributedZkTest_2B7759AB7508681F-001_tempDir-002_jetty2, hostPort=42144, coreRootDirectory=/home/jenkins/jenkins-slave/workspace/Lucene-Solr-NightlyTests-master/checkout/solr/build/solr-core/test/J2/temp/solr.cloud.hdfs.HdfsUnloadDistributedZkTest_2B7759AB7508681F-001/shard-2-001/cores}
   [junit4]   2> 884277 ERROR (closeThreadPool-1970-thread-2) [     ] o.a.s.u.StartupLoggingUtils Missing Java Option solr.log.dir. Logging may be missing or incomplete.
   [junit4]   2> 884277 INFO  (closeThreadPool-1970-thread-2) [     ] o.a.s.s.SolrDispatchFilter Using logger factory org.apache.logging.slf4j.Log4jLoggerFactory
   [junit4]   2> 884277 INFO  (closeThreadPool-1970-thread-2) [     ] o.a.s.s.SolrDispatchFilter  ___      _       Welcome to Apache Solr™ version 9.0.0
   [junit4]   2> 884277 INFO  (closeThreadPool-1970-thread-2) [     ] o.a.s.s.SolrDispatchFilter / __| ___| |_ _   Starting in cloud mode on port null
   [junit4]   2> 884277 INFO  (closeThreadPool-1970-thread-2) [     ] o.a.s.s.SolrDispatchFilter \__ \/ _ \ | '_|  Install dir: null
   [junit4]   2> 884277 INFO  (closeThreadPool-1970-thread-2) [     ] o.a.s.s.SolrDispatchFilter |___/\___/_|_|    Start time: 2019-07-08T21:55:12.041593Z
   [junit4]   2> 884279 INFO  (closeThreadPool-1970-thread-2) [     ] o.a.s.c.c.ConnectionManager Waiting for client to connect to ZooKeeper
   [junit4]   2> 884280 INFO  (zkConnectionManagerCallback-1981-thread-1) [     ] o.a.s.c.c.ConnectionManager zkClient has connected
   [junit4]   2> 884280 INFO  (closeThreadPool-1970-thread-2) [     ] o.a.s.c.c.ConnectionManager Client is connected to ZooKeeper
   [junit4]   2> 884291 INFO  (zkConnectionManagerCallback-1979-thread-1) [     ] o.a.s.c.c.ConnectionManager zkClient has connected
   [junit4]   2> 884291 INFO  (closeThreadPool-1970-thread-1) [     ] o.a.s.c.c.ConnectionManager Client is connected to ZooKeeper
   [junit4]   2> 884381 INFO  (closeThreadPool-1970-thread-2) [     ] o.a.s.s.SolrDispatchFilter Loading solr.xml from SolrHome (not found in ZooKeeper)
   [junit4]   2> 884381 INFO  (closeThreadPool-1970-thread-2) [     ] o.a.s.c.SolrXmlConfig Loading container configuration from /home/jenkins/jenkins-slave/workspace/Lucene-Solr-NightlyTests-master/checkout/solr/build/solr-core/test/J2/temp/solr.cloud.hdfs.HdfsUnloadDistributedZkTest_2B7759AB7508681F-001/shard-2-001/solr.xml
   [junit4]   2> 884385 INFO  (closeThreadPool-1970-thread-2) [     ] o.a.s.c.SolrXmlConfig Configuration parameter autoReplicaFailoverWorkLoopDelay is ignored
   [junit4]   2> 884385 INFO  (closeThreadPool-1970-thread-2) [     ] o.a.s.c.SolrXmlConfig Configuration parameter autoReplicaFailoverBadNodeExpiration is ignored
   [junit4]   2> 884387 INFO  (closeThreadPool-1970-thread-2) [     ] o.a.s.c.SolrXmlConfig MBean server found: com.sun.jmx.mbeanserver.JmxMBeanServer@598e4a8e, but no JMX reporters were configured - adding default JMX reporter.
   [junit4]   2> 884499 INFO  (closeThreadPool-1970-thread-1) [n:127.0.0.1:34920_qlev%2Fx     ] o.a.s.c.c.ConnectionManager Waiting for client to connect to ZooKeeper
   [junit4]   2> 884499 INFO  (zkConnectionManagerCallback-1984-thread-1) [     ] o.a.s.c.c.ConnectionManager zkClient has connected
   [junit4]   2> 884499 INFO  (closeThreadPool-1970-thread-1) [n:127.0.0.1:34920_qlev%2Fx     ] o.a.s.c.c.ConnectionManager Client is connected to ZooKeeper
   [junit4]   2> 884515 INFO  (closeThreadPool-1970-thread-1) [n:127.0.0.1:34920_qlev%2Fx     ] o.a.s.c.c.ZkStateReader Updated live nodes from ZooKeeper... (0) -> (1)
   [junit4]   2> 884523 INFO  (TEST-HdfsUnloadDistributedZkTest.test-seed#[2B7759AB7508681F]) [     ] o.a.s.c.AbstractFullDistribZkTestBase create jetty 3 in directory /home/jenkins/jenkins-slave/workspace/Lucene-Solr-NightlyTests-master/checkout/solr/build/solr-core/test/J2/temp/solr.cloud.hdfs.HdfsUnloadDistributedZkTest_2B7759AB7508681F-001/shard-3-001 of type NRT
   [junit4]   2> 884525 WARN  (closeThreadPool-1970-thread-3) [     ] o.e.j.s.AbstractConnector Ignoring deprecated socket close linger time
   [junit4]   2> 884525 INFO  (closeThreadPool-1970-thread-3) [     ] o.a.s.c.s.e.JettySolrRunner Start Jetty (original configured port=0)
   [junit4]   2> 884525 INFO  (closeThreadPool-1970-thread-3) [     ] o.a.s.c.s.e.JettySolrRunner Trying to start Jetty on port 0 try number 1 ...
   [junit4]   2> 884526 INFO  (closeThreadPool-1970-thread-3) [     ] o.e.j.s.Server jetty-9.4.19.v20190610; built: 2019-06-10T16:30:51.723Z; git: afcf563148970e98786327af5e07c261fda175d3; jvm 11.0.1+13-LTS
   [junit4]   2> 884526 INFO  (closeThreadPool-1970-thread-1) [n:127.0.0.1:34920_qlev%2Fx     ] o.a.s.c.ZkController Publish node=127.0.0.1:34920_qlev%2Fx as DOWN
   [junit4]   2> 884529 INFO  (closeThreadPool-1970-thread-1) [n:127.0.0.1:34920_qlev%2Fx     ] o.a.s.c.TransientSolrCoreCacheDefault Allocating transient cache for 4 transient cores
   [junit4]   2> 884529 INFO  (closeThreadPool-1970-thread-1) [n:127.0.0.1:34920_qlev%2Fx     ] o.a.s.c.ZkController Register node as live in ZooKeeper:/live_nodes/127.0.0.1:34920_qlev%2Fx
   [junit4]   2> 884534 INFO  (zkCallback-1956-thread-1) [     ] o.a.s.c.c.ZkStateReader Updated live nodes from ZooKeeper... (1) -> (2)
   [junit4]   2> 884534 INFO  (zkCallback-1949-thread-3) [     ] o.a.s.c.c.ZkStateReader Updated live nodes from ZooKeeper... (1) -> (2)
   [junit4]   2> 884560 INFO  (closeThreadPool-1970-thread-1) [n:127.0.0.1:34920_qlev%2Fx     ] o.a.s.c.c.ConnectionManager Waiting for client to connect to ZooKeeper
   [junit4]   2> 884571 INFO  (zkCallback-1983-thread-1) [     ] o.a.s.c.c.ZkStateReader Updated live nodes from ZooKeeper... (1) -> (2)
   [junit4]   2> 884579 INFO  (zkCallback-1968-thread-1) [     ] o.a.s.c.c.ZkStateReader Updated live nodes from ZooKeeper... (1) -> (2)
   [junit4]   2> 884595 INFO  (zkConnectionManagerCallback-1991-thread-1) [     ] o.a.s.c.c.ConnectionManager zkClient has connected
   [junit4]   2> 884595 INFO  (closeThreadPool-1970-thread-1) [n:127.0.0.1:34920_qlev%2Fx     ] o.a.s.c.c.ConnectionManager Client is connected to ZooKeeper
   [junit4]   2> 884596 INFO  (closeThreadPool-1970-thread-1) [n:127.0.0.1:34920_qlev%2Fx     ] o.a.s.c.c.ZkStateReader Updated live nodes from ZooKeeper... (0) -> (2)
   [junit4]   2> 884599 INFO  (closeThreadPool-1970-thread-1) [n:127.0.0.1:34920_qlev%2Fx     ] o.a.s.c.s.i.ZkClientClusterStateProvider Cluster at 127.0.0.1:44240/solr ready
   [junit4]   2> 884735 INFO  (closeThreadPool-1970-thread-3) [     ] o.e.j.s.session DefaultSessionIdManager workerName=node0
   [junit4]   2> 884735 INFO  (closeThreadPool-1970-thread-3) [     ] o.e.j.s.session No SessionScavenger set, using defaults
   [junit4]   2> 884735 INFO  (closeThreadPool-1970-thread-3) [     ] o.e.j.s.session node0 Scavenging every 600000ms
   [junit4]   2> 884747 INFO  (closeThreadPool-1970-thread-1) [n:127.0.0.1:34920_qlev%2Fx     ] o.a.s.h.a.MetricsHistoryHandler No .system collection, keeping metrics history in memory.
   [junit4]   2> 884771 INFO  (closeThreadPool-1970-thread-3) [     ] o.e.j.s.h.ContextHandler Started o.e.j.s.ServletContextHandler@33e74fbd{/qlev/x,null,AVAILABLE}
   [junit4]   2> 884771 INFO  (closeThreadPool-1970-thread-3) [     ] o.e.j.s.AbstractConnector Started ServerConnector@589384af{HTTP/1.1,[http/1.1, h2c]}{127.0.0.1:45749}
   [junit4]   2> 884772 INFO  (closeThreadPool-1970-thread-3) [     ] o.e.j.s.Server Started @884820ms
   [junit4]   2> 884772 INFO  (closeThreadPool-1970-thread-3) [     ] o.a.s.c.s.e.JettySolrRunner Jetty properties: {hostContext=/qlev/x, solrconfig=solrconfig.xml, solr.data.dir=hdfs://lucene2-us-west.apache.org:39982/hdfs__lucene2-us-west.apache.org_39982__home_jenkins_jenkins-slave_workspace_Lucene-Solr-NightlyTests-master_checkout_solr_build_solr-core_test_J2_temp_solr.cloud.hdfs.HdfsUnloadDistributedZkTest_2B7759AB7508681F-001_tempDir-002_jetty3, hostPort=45749, coreRootDirectory=/home/jenkins/jenkins-slave/workspace/Lucene-Solr-NightlyTests-master/checkout/solr/build/solr-core/test/J2/temp/solr.cloud.hdfs.HdfsUnloadDistributedZkTest_2B7759AB7508681F-001/shard-3-001/cores}
   [junit4]   2> 884772 ERROR (closeThreadPool-1970-thread-3) [     ] o.a.s.u.StartupLoggingUtils Missing Java Option solr.log.dir. Logging may be missing or incomplete.
   [junit4]   2> 884772 INFO  (closeThreadPool-1970-thread-3) [     ] o.a.s.s.SolrDispatchFilter Using logger factory org.apache.logging.slf4j.Log4jLoggerFactory
   [junit4]   2> 884772 INFO  (closeThreadPool-1970-thread-3) [     ] o.a.s.s.SolrDispatchFilter  ___      _       Welcome to Apache Solr™ version 9.0.0
   [junit4]   2> 884772 INFO  (closeThreadPool-1970-thread-3) [     ] o.a.s.s.SolrDispatchFilter / __| ___| |_ _   Starting in cloud mode on port null
   [junit4]   2> 884772 INFO  (closeThreadPool-1970-thread-3) [     ] o.a.s.s.SolrDispatchFilter \__ \/ _ \ | '_|  Install dir: null
   [junit4]   2> 884772 INFO  (closeThreadPool-1970-thread-3) [     ] o.a.s.s.SolrDispatchFilter |___/\___/_|_|    Start time: 2019-07-08T21:55:12.536567Z
   [junit4]   2> 884777 INFO  (closeThreadPool-1970-thread-1) [n:127.0.0.1:34920_qlev%2Fx     ] o.a.s.m.r.SolrJmxReporter JMX monitoring for 'solr.node' (registry 'solr.node') enabled at server: com.sun.jmx.mbeanserver.JmxMBeanServer@598e4a8e
   [junit4]   2> 884797 INFO  (closeThreadPool-1970-thread-3) [     ] o.a.s.c.c.ConnectionManager Waiting for client to connect to ZooKeeper
   [junit4]   2> 884804 INFO  (closeThreadPool-1970-thread-1) [n:127.0.0.1:34920_qlev%2Fx     ] o.a.s.m.r.SolrJmxReporter JMX monitoring for 'solr.jvm' (registry 'solr.jvm') enabled at server: com.sun.jmx.mbeanserver.JmxMBeanServer@598e4a8e
   [junit4]   2> 884814 INFO  (closeThreadPool-1970-thread-1) [n:127.0.0.1:34920_qlev%2Fx     ] o.a.s.m.r.SolrJmxReporter JMX monitoring for 'solr.jetty' (registry 'solr.jetty') enabled at server: com.sun.jmx.mbeanserver.JmxMBeanServer@598e4a8e
   [junit4]   2> 884816 INFO  (closeThreadPool-1970-thread-1) [n:127.0.0.1:34920_qlev%2Fx     ] o.a.s.c.CorePropertiesLocator Found 0 core definitions underneath /home/jenkins/jenkins-slave/workspace/Lucene-Solr-NightlyTests-master/checkout/solr/build/solr-core/test/J2/temp/solr.cloud.hdfs.HdfsUnloadDistributedZkTest_2B7759AB7508681F-001/shard-1-001/cores
   [junit4]   2> 884830 INFO  (zkConnectionManagerCallback-1994-thread-1) [     ] o.a.s.c.c.ConnectionManager zkClient has connected
   [junit4]   2> 884831 INFO  (closeThreadPool-1970-thread-3) [     ] o.a.s.c.c.ConnectionManager Client is connected to ZooKeeper
   [junit4]   2> 884867 INFO  (closeThreadPool-1970-thread-2) [     ] o.a.s.h.c.HttpShardHandlerFactory Host whitelist initialized: WhitelistHostChecker [whitelistHosts=null, whitelistHostCheckingEnabled=false]
   [junit4]   2> 884876 WARN  (closeThreadPool-1970-thread-2) [     ] o.e.j.u.s.S.config Trusting all certificates configured for Client@157d8d00[provider=null,keyStore=null,trustStore=null]
   [junit4]   2> 884876 WARN  (closeThreadPool-1970-thread-2) [     ] o.e.j.u.s.S.config No Client EndPointIdentificationAlgorithm configured for Client@157d8d00[provider=null,keyStore=null,trustStore=null]
   [junit4]   2> 884908 WARN  (closeThreadPool-1970-thread-2) [     ] o.e.j.u.s.S.config Trusting all certificates configured for Client@61321b8e[provider=null,keyStore=null,trustStore=null]
   [junit4]   2> 884908 WARN  (closeThreadPool-1970-thread-2) [     ] o.e.j.u.s.S.config No Client EndPointIdentificationAlgorithm configured for Client@61321b8e[provider=null,keyStore=null,trustStore=null]
   [junit4]   2> 884910 INFO  (closeThreadPool-1970-thread-2) [     ] o.a.s.c.ZkContainer Zookeeper client=127.0.0.1:44240/solr
   [junit4]   2> 884927 INFO  (closeThreadPool-1970-thread-2) [     ] o.a.s.c.c.ConnectionManager Waiting for client to connect to ZooKeeper
   [junit4]   2> 884938 INFO  (closeThreadPool-1970-thread-3) [     ] o.a.s.s.SolrDispatchFilter Loading solr.xml from SolrHome (not found in ZooKeeper)
   [junit4]   2> 884938 INFO  (closeThreadPool-1970-thread-3) [     ] o.a.s.c.SolrXmlConfig Loading container configuration from /home/jenkins/jenkins-slave/workspace/Lucene-Solr-NightlyTests-master/checkout/solr/build/solr-core/test/J2/temp/solr.cloud.hdfs.HdfsUnloadDistributedZkTest_2B7759AB7508681F-001/shard-3-001/solr.xml
   [junit4]   2> 884941 INFO  (closeThreadPool-1970-thread-3) [     ] o.a.s.c.SolrXmlConfig Configuration parameter autoReplicaFailoverWorkLoopDelay is ignored
   [junit4]   2> 884941 INFO  (closeThreadPool-1970-thread-3) [     ] o.a.s.c.SolrXmlConfig Configuration parameter autoReplicaFailoverBadNodeExpiration is ignored
   [junit4]   2> 884947 INFO  (zkConnectionManagerCallback-2000-thread-1) [     ] o.a.s.c.c.ConnectionManager zkClient has connected
   [junit4]   2> 884947 INFO  (closeThreadPool-1970-thread-2) [     ] o.a.s.c.c.ConnectionManager Client is connected to ZooKeeper
   [junit4]   2> 884955 INFO  (closeThreadPool-1970-thread-3) [     ] o.a.s.c.SolrXmlConfig MBean server found: com.sun.jmx.mbeanserver.JmxMBeanServer@598e4a8e, but no JMX reporters were configured - adding default JMX reporter.
   [junit4]   2> 885074 INFO  (closeThreadPool-1970-thread-2) [n:127.0.0.1:42144_qlev%2Fx     ] o.a.s.c.c.ConnectionManager Waiting for client to connect to ZooKeeper
   [junit4]   2> 885091 INFO  (zkConnectionManagerCallback-2003-thread-1) [     ] o.a.s.c.c.ConnectionManager zkClient has connected
   [junit4]   2> 885091 INFO  (closeThreadPool-1970-thread-2) [n:127.0.0.1:42144_qlev%2Fx     ] o.a.s.c.c.ConnectionManager Client is connected to ZooKeeper
   [junit4]   2> 885096 INFO  (closeThreadPool-1970-thread-2) [n:127.0.0.1:42144_qlev%2Fx     ] o.a.s.c.c.ZkStateReader Updated live nodes from ZooKeeper... (0) -> (2)
   [junit4]   2> 885102 INFO  (closeThreadPool-1970-thread-2) [n:127.0.0.1:42144_qlev%2Fx     ] o.a.s.c.ZkController Publish node=127.0.0.1:42144_qlev%2Fx as DOWN
   [junit4]   2> 885108 INFO  (closeThreadPool-1970-thread-2) [n:127.0.0.1:42144_qlev%2Fx     ] o.a.s.c.TransientSolrCoreCacheDefault Allocating transient cache for 4 transient cores
   [junit4]   2> 885108 INFO  (closeThreadPool-1970-thread-2) [n:127.0.0.1:42144_qlev%2Fx     ] o.a.s.c.ZkController Register node as live in ZooKeeper:/live_nodes/127.0.0.1:42144_qlev%2Fx
   [junit4]   2> 885111 INFO  (zkCallback-1956-thread-1) [     ] o.a.s.c.c.ZkStateReader Updated live nodes from ZooKeeper... (2) -> (3)
   [junit4]   2> 885111 INFO  (zkCallback-1983-thread-1) [     ] o.a.s.c.c.ZkStateReader Updated live nodes from ZooKeeper... (2) -> (3)
   [junit4]   2> 885111 INFO  (zkCallback-1949-thread-3) [     ] o.a.s.c.c.ZkStateReader Updated live nodes from ZooKeeper... (2) -> (3)
   [junit4]   2> 885111 INFO  (zkCallback-1968-thread-1) [     ] o.a.s.c.c.ZkStateReader Updated live nodes from ZooKeeper... (2) -> (3)
   [junit4]   2> 885117 INFO  (zkCallback-1990-thread-1) [     ] o.a.s.c.c.ZkStateReader Updated live nodes from ZooKeeper... (2) -> (3)
   [junit4]   2> 885119 INFO  (TEST-HdfsUnloadDistributedZkTest.test-seed#[2B7759AB7508681F]) [     ] o.a.s.c.AbstractFullDistribZkTestBase create jetty 4 in directory /home/jenkins/jenkins-slave/workspace/Lucene-Solr-NightlyTests-master/checkout/solr/build/solr-core/test/J2/temp/solr.cloud.hdfs.HdfsUnloadDistributedZkTest_2B7759AB7508681F-001/shard-4-001 of type NRT
   [junit4]   2> 885120 WARN  (closeThreadPool-1970-thread-1) [     ] o.e.j.s.AbstractConnector Ignoring deprecated socket close linger time
   [junit4]   2> 885120 INFO  (closeThreadPool-1970-thread-1) [     ] o.a.s.c.s.e.JettySolrRunner Start Jetty (original configured port=0)
   [junit4]   2> 885120 INFO  (closeThreadPool-1970-thread-1) [     ] o.a.s.c.s.e.JettySolrRunner Trying to start Jetty on port 0 try number 1 ...
   [junit4]   2> 885120 INFO  (closeThreadPool-1970-thread-1) [     ] o.e.j.s.Server jetty-9.4.19.v20190610; built: 2019-06-10T16:30:51.723Z; git: afcf563148970e98786327af5e07c261fda175d3; jvm 11.0.1+13-LTS
   [junit4]   2> 885126 INFO  (closeThreadPool-1970-thread-2) [n:127.0.0.1:42144_qlev%2Fx     ] o.a.s.c.c.ConnectionManager Waiting for client to connect to ZooKeeper
   [junit4]   2> 885134 INFO  (zkCallback-2002-thread-1) [     ] o.a.s.c.c.ZkStateReader Updated live nodes from ZooKeeper... (2) -> (3)
   [junit4]   2> 885138 INFO  (zkConnectionManagerCallback-2010-thread-1) [     ] o.a.s.c.c.ConnectionManager zkClient has connected
   [junit4]   2> 885139 INFO  (closeThreadPool-1970-thread-2) [n:127.0.0.1:42144_qlev%2Fx     ] o.a.s.c.c.ConnectionManager Client is connected to ZooKeeper
   [junit4]   2> 885140 INFO  (closeThreadPool-1970-thread-2) [n:127.0.0.1:42144_qlev%2Fx     ] o.a.s.c.c.ZkStateReader Updated live nodes from ZooKeeper... (0) -> (3)
   [junit4]   2> 885141 INFO  (closeThreadPool-1970-thread-2) [n:127.0.0.1:42144_qlev%2Fx     ] o.a.s.c.s.i.ZkClientClusterStateProvider Cluster at 127.0.0.1:44240/solr ready
   [junit4]   2> 885191 INFO  (closeThreadPool-1970-thread-1) [     ] o.e.j.s.session DefaultSessionIdManager workerName=node0
   [junit4]   2> 885191 INFO  (closeThreadPool-1970-thread-1) [     ] o.e.j.s.session No SessionScavenger set, using defaults
   [junit4]   2> 885191 INFO  (closeThreadPool-1970-thread-1) [     ] o.e.j.s.session node0 Scavenging every 600000ms
   [junit4]   2> 885194 INFO  (closeThreadPool-1970-thread-1) [     ] o.e.j.s.h.ContextHandler Started o.e.j.s.ServletContextHandler@67526d64{/qlev/x,null,AVAILABLE}
   [junit4]   2> 885195 INFO  (closeThreadPool-1970-thread-2) [n:127.0.0.1:42144_qlev%2Fx     ] o.a.s.h.a.MetricsHistoryHandler No .system collection, keeping metrics history in memory.
   [junit4]   2> 885199 INFO  (closeThreadPool-1970-thread-1) [     ] o.e.j.s.AbstractConnector Started ServerConnector@6c5d0ae1{HTTP/1.1,[http/1.1, h2c]}{127.0.0.1:38207}
   [junit4]   2> 885199 INFO  (closeThreadPool-1970-thread-1) [     ] o.e.j.s.Server Started @885248ms
   [junit4]   2> 885199 INFO  (closeThreadPool-1970-thread-1) [     ] o.a.s.c.s.e.JettySolrRunner Jetty properties: {hostContext=/qlev/x, solrconfig=solrconfig.xml, solr.data.dir=hdfs://lucene2-us-west.apache.org:39982/hdfs__lucene2-us-west.apache.org_39982__home_jenkins_jenkins-slave_workspace_Lucene-Solr-NightlyTests-master_checkout_solr_build_solr-core_test_J2_temp_solr.cloud.hdfs.HdfsUnloadDistributedZkTest_2B7759AB7508681F-001_tempDir-002_jetty4, hostPort=38207, coreRootDirectory=/home/jenkins/jenkins-slave/workspace/Lucene-Solr-NightlyTests-master/checkout/solr/build/solr-core/test/J2/../../../../../../../../../../../home/jenkins/jenkins-slave/workspace/Lucene-Solr-NightlyTests-master/checkout/solr/build/solr-core/test/J2/temp/solr.cloud.hdfs.HdfsUnloadDistributedZkTest_2B7759AB7508681F-001/shard-4-001/cores, replicaType=NRT}
   [junit4]   2> 885199 ERROR (closeThreadPool-1970-thread-1) [     ] o.a.s.u.StartupLoggingUtils Missing Java Option solr.log.dir. Logging may be missing or incomplete.
   [junit4]   2> 885199 INFO  (closeThreadPool-1970-thread-1) [     ] o.a.s.s.SolrDispatchFilter Using logger factory org.apache.logging.slf4j.Log4jLoggerFactory
   [junit4]   2> 885199 INFO  (closeThreadPool-1970-thread-1) [     ] o.a.s.s.SolrDispatchFilter  ___      _       Welcome to Apache Solr™ version 9.0.0
   [junit4]   2> 885200 INFO  (closeThreadPool-1970-thread-1) [     ] o.a.s.s.SolrDispatchFilter / __| ___| |_ _   Starting in cloud mode on port null
   [junit4]   2> 885200 INFO  (closeThreadPool-1970-thread-1) [     ] o.a.s.s.SolrDispatchFilter \__ \/ _ \ | '_|  Install dir: null
   [junit4]   2> 885200 INFO  (OverseerCollectionConfigSetProcessor-75004112278978564-127.0.0.1:41912_qlev%2Fx-n_0000000000) [n:127.0.0.1:41912_qlev%2Fx     ] o.a.s.c.OverseerTaskQueue Response ZK path: /overseer/collection-queue-work/qnr-0000000002 doesn't exist.  Requestor may have disconnected from ZooKeeper
   [junit4]   2> 885200 INFO  (closeThreadPool-1970-thread-1) [     ] o.a.s.s.SolrDispatchFilter |___/\___/_|_|    Start time: 2019-07-08T21:55:12.964051Z
   [junit4]   2> 885215 INFO  (closeThreadPool-1970-thread-1) [     ] o.a.s.c.c.ConnectionManager Waiting for client to connect to ZooKeeper
   [junit4]   2> 885216 INFO  (closeThreadPool-1970-thread-2) [n:127.0.0.1:42144_qlev%2Fx     ] o.a.s.m.r.SolrJmxReporter JMX monitoring for 'solr.node' (registry 'solr.node') enabled at server: com.sun.jmx.mbeanserver.JmxMBeanServer@598e4a8e
   [junit4]   2> 885219 INFO  (zkConnectionManagerCallback-2013-thread-1) [     ] o.a.s.c.c.ConnectionManager zkClient has connected
   [junit4]   2> 885219 INFO  (closeThreadPool-1970-thread-1) [     ] o.a.s.c.c.ConnectionManager Client is connected to ZooKeeper
   [junit4]   2> 885234 INFO  (closeThreadPool-1970-thread-2) [n:127.0.0.1:42144_qlev%2Fx     ] o.a.s.m.r.SolrJmxReporter JMX monitoring for 'solr.jvm' (registry 'solr.jvm') enabled at server: com.sun.jmx.mbeanserver.JmxMBeanServer@598e4a8e
   [junit4]   2> 885234 INFO  (closeThreadPool-1970-thread-2) [n:127.0.0.1:42144_qlev%2Fx     ] o.a.s.m.r.SolrJmxReporter JMX monitoring for 'solr.jetty' (registry 'solr.jetty') enabled at server: com.sun.jmx.mbeanserver.JmxMBeanServer@598e4a8e
   [junit4]   2> 885242 INFO  (closeThreadPool-1970-thread-2) [n:127.0.0.1:42144_qlev%2Fx     ] o.a.s.c.CorePropertiesLocator Found 0 core definitions underneath /home/jenkins/jenkins-slave/workspace/Lucene-Solr-NightlyTests-master/checkout/solr/build/solr-core/test/J2/temp/solr.cloud.hdfs.HdfsUnloadDistributedZkTest_2B7759AB7508681F-001/shard-2-001/cores
   [junit4]   2> 885320 INFO  (closeThreadPool-1970-thread-1) [     ] o.a.s.s.SolrDispatchFilter Loading solr.xml from SolrHome (not found in ZooKeeper)
   [junit4]   2> 885320 INFO  (closeThreadPool-1970-thread-1) [     ] o.a.s.c.SolrXmlConfig Loading container configuration from /home/jenkins/jenkins-slave/workspace/Lucene-Solr-NightlyTests-master/checkout/solr/build/solr-core/test/J2/temp/solr.cloud.hdfs.HdfsUnloadDistributedZkTest_2B7759AB7508681F-001/shard-4-001/solr.xml
   [junit4]   2> 885323 INFO  (closeThreadPool-1970-thread-1) [     ] o.a.s.c.SolrXmlConfig Configuration parameter autoReplicaFailoverWorkLoopDelay is ignored
   [junit4]   2> 885323 INFO  (closeThreadPool-1970-thread-1) [     ] o.a.s.c.SolrXmlConfig Configuration parameter autoReplicaFailoverBadNodeExpiration is ignored
   [junit4]   2> 885324 INFO  (closeThreadPool-1970-thread-1) [     ] o.a.s.c.SolrXmlConfig MBean server found: com.sun.jmx.mbeanserver.JmxMBeanServer@598e4a8e, but no JMX reporters were configured - adding default JMX reporter.
   [junit4]   2> 885391 INFO  (closeThreadPool-1970-thread-3) [     ] o.a.s.h.c.HttpShardHandlerFactory Host whitelist initialized: WhitelistHostChecker [whitelistHosts=null, whitelistHostCheckingEnabled=false]
   [junit4]   2> 885463 WARN  (closeThreadPool-1970-thread-3) [     ] o.e.j.u.s.S.config Trusting all certificates configured for Client@a4b763a[provider=null,keyStore=null,trustStore=null]
   [junit4]   2> 885463 WARN  (closeThreadPool-1970-thread-3) [     ] o.e.j.u.s.S.config No Client EndPointIdentificationAlgorithm configured for Client@a4b763a[provider=null,keyStore=null,trustStore=null]
   [junit4]   2> 885516 INFO  (closeThreadPool-1970-thread-1) [     ] o.a.s.h.c.HttpShardHandlerFactory Host whitelist initialized: WhitelistHostChecker [whitelistHosts=null, whitelistHostCheckingEnabled=false]
   [junit4]   2> 885547 WARN  (closeThreadPool-1970-thread-3) [     ] o.e.j.u.s.S.config Trusting all certificates configured for Client@b669ba1[provider=null,keyStore=null,trustStore=null]
   [junit4]   2> 885547 WARN  (closeThreadPool-1970-thread-3) [     ] o.e.j.u.s.S.config No Client EndPointIdentificationAlgorithm configured for Client@b669ba1[provider=null,keyStore=null,trustStore=null]
   [junit4]   2> 885549 INFO  (closeThreadPool-1970-thread-3) [     ] o.a.s.c.ZkContainer Zookeeper client=127.0.0.1:44240/solr
   [junit4]   2> 885555 WARN  (closeThreadPool-1970-thread-1) [     ] o.e.j.u.s.S.config Trusting all certificates configured for Client@19241082[provider=null,keyStore=null,trustStore=null]
   [junit4]   2> 885555 WARN  (closeThreadPool-1970-thread-1) [     ] o.e.j.u.s.S.config No Client EndPointIdentificationAlgorithm configured for Client@19241082[provider=null,keyStore=null,trustStore=null]
   [junit4]   2> 885562 INFO  (closeThreadPool-1970-thread-3) [     ] o.a.s.c.c.ConnectionManager Waiting for client to connect to ZooKeeper
   [junit4]   2> 885578 INFO  (zkConnectionManagerCallback-2021-thread-1) [     ] o.a.s.c.c.ConnectionManager zkClient has connected
   [junit4]   2> 885578 INFO  (closeThreadPool-1970-thread-3) [     ] o.a.s.c.c.ConnectionManager Client is connected to ZooKeeper
   [junit4]   2> 885593 WARN  (closeThreadPool-1970-thread-1) [     ] o.e.j.u.s.S.config Trusting all certificates configured for Client@66941675[provider=null,keyStore=null,trustStore=null]
   [junit4]   2> 885593 WARN  (closeThreadPool-1970-thread-1) [     ] o.e.j.u.s.S.config No Client EndPointIdentificationAlgorithm configured for Client@66941675[provider=null,keyStore=null,trustStore=null]
   [junit4]   2> 885594 INFO  (closeThreadPool-1970-thread-1) [     ] o.a.s.c.ZkContainer Zookeeper client=127.0.0.1:44240/solr
   [junit4]   2> 885604 INFO  (closeThreadPool-1970-thread-1) [     ] o.a.s.c.c.ConnectionManager Waiting for client to connect to ZooKeeper
   [junit4]   2> 885610 INFO  (zkConnectionManagerCallback-2026-thread-1) [     ] o.a.s.c.c.ConnectionManager zkClient has connected
   [junit4]   2> 885610 INFO  (closeThreadPool-1970-thread-1) [     ] o.a.s.c.c.ConnectionManager Client is connected to ZooKeeper
   [junit4]   2> 885695 INFO  (closeThreadPool-1970-thread-3) [n:127.0.0.1:45749_qlev%2Fx     ] o.a.s.c.c.ConnectionManager Waiting for client to connect to ZooKeeper
   [junit4]   2> 885697 INFO  (zkConnectionManagerCallback-2028-thread-1) [     ] o.a.s.c.c.ConnectionManager zkClient has connected
   [junit4]   2> 885697 INFO  (closeThreadPool-1970-thread-3) [n:127.0.0.1:45749_qlev%2Fx     ] o.a.s.c.c.ConnectionManager Client is connected to ZooKeeper
   [junit4]   2> 885705 INFO  (closeThreadPool-1970-thread-3) [n:127.0.0.1:45749_qlev%2Fx     ] o.a.s.c.c.ZkStateReader Updated live nodes from ZooKeeper... (0) -> (3)
   [junit4]   2> 885709 INFO  (closeThreadPool-1970-thread-3) [n:127.0.0.1:45749_qlev%2Fx     ] o.a.s.c.ZkController Publish node=127.0.0.1:45749_qlev%2Fx as DOWN
   [junit4]   2> 885711 INFO  (closeThreadPool-1970-thread-3) [n:127.0.0.1:45749_qlev%2Fx     ] o.a.s.c.TransientSolrCoreCacheDefault Allocating transient cache for 4 transient cores
   [junit4]   2> 885711 INFO  (closeThreadPool-1970-thread-3) [n:127.0.0.1:45749_qlev%2Fx     ] o.a.s.c.ZkController Register node as live in ZooKeeper:/live_nodes/127.0.0.1:45749_qlev%2Fx
   [junit4]   2> 885713 INFO  (zkCallback-1990-thread-1) [     ] o.a.s.c.c.ZkStateReader Updated live nodes from ZooKeeper... (3) -> (4)
   [junit4]   2> 885713 INFO  (zkCallback-1983-thread-1) [     ] o.a.s.c.c.ZkStateReader Updated live nodes from ZooKeeper... (3) -> (4)
   [junit4]   2> 885713 INFO  (zkCallback-1956-thread-1) [     ] o.a.s.c.c.ZkStateReader Updated live nodes from ZooKeeper... (3) -> (4)
   [junit4]   2> 885713 INFO  (zkCallback-1968-thread-1) [     ] o.a.s.c.c.ZkStateReader Updated live nodes from ZooKeeper... (3) -> (4)
   [junit4]   2> 885713 INFO  (zkCallback-2002-thread-1) [     ] o.a.s.c.c.ZkStateReader Updated live nodes from ZooKeeper... (3) -> (4)
   [junit4]   2> 885713 INFO  (zkCallback-1949-thread-3) [     ] o.a.s.c.c.ZkStateReader Updated live nodes from ZooKeeper... (3) -> (4)
   [junit4]   2> 885723 INFO  (zkCallback-2027-thread-1) [     ] o.a.s.c.c.ZkStateReader Updated live nodes from ZooKeeper... (3) -> (4)
   [junit4]   2> 885782 INFO  (closeThreadPool-1970-thread-3) [n:127.0.0.1:45749_qlev%2Fx     ] o.a.s.c.c.ConnectionManager Waiting for client to connect to ZooKeeper
   [junit4]   2> 885794 INFO  (zkCallback-2009-thread-1) [     ] o.a.s.c.c.ZkStateReader Updated live nodes from ZooKeeper... (3) -> (4)
   [junit4]   2> 885800 INFO  (closeThreadPool-1970-thread-1) [     ] o.a.s.c.c.ConnectionManager Waiting for client to connect to ZooKeeper
   [junit4]   2> 885808 INFO  (zkConnectionManagerCallback-2035-thread-1) [     ] o.a.s.c.c.ConnectionManager zkClient has connected
   [junit4]   2> 885808 INFO  (closeThreadPool-1970-thread-3) [n:127.0.0.1:45749_qlev%2Fx     ] o.a.s.c.c.ConnectionManager Client is connected to ZooKeeper
   [junit4]   2> 885808 INFO  (zkConnectionManagerCallback-2037-thread-1) [     ] o.a.s.c.c.ConnectionManager zkClient has connected
   [junit4]   2> 885809 INFO  (closeThreadPool-1970-thread-1) [     ] o.a.s.c.c.ConnectionManager Client is connected to ZooKeeper
   [junit4]   2> 885815 INFO  (closeThreadPool-1970-thread-3) [n:127.0.0.1:45749_qlev%2Fx     ] o.a.s.c.c.ZkStateReader Updated live nodes from ZooKeeper... (0) -> (4)
   [junit4]   2> 885818 INFO  (closeThreadPool-1970-thread-3) [n:127.0.0.1:45749_qlev%2Fx     ] o.a.s.c.s.i.ZkClientClusterStateProvider Cluster at 127.0.0.1:44240/solr ready
   [junit4]   2> 885823 INFO  (closeThreadPool-1970-thread-1) [     ] o.a.s.c.c.ZkStateReader Updated live nodes from ZooKeeper... (0) -> (4)
   [junit4]   2> 885828 INFO  (closeThreadPool-1970-thread-1) [     ] o.a.s.c.ZkController Publish node=127.0.0.1:38207_qlev%2Fx as DOWN
   [junit4]   2> 885829 INFO  (closeThreadPool-1970-thread-1) [     ] o.a.s.c.TransientSolrCoreCacheDefault Allocating transient cache for 4 transient cores
   [junit4]   2> 885829 INFO  (closeThreadPool-1970-thread-1) [     ] o.a.s.c.ZkController Register node as live in ZooKeeper:/live_nodes/127.0.0.1:38207_qlev%2Fx
   [junit4]   2> 885831 INFO  (zkCallback-2027-thread-1) [     ] o.a.s.c.c.ZkStateReader Updated live nodes from ZooKeeper... (4) -> (5)
   [junit4]   2> 885831 INFO  (zkCallback-2002-thread-1) [     ] o.a.s.c.c.ZkStateReader Updated live nodes from ZooKeeper... (4) -> (5)
   [junit4]   2> 885831 INFO  (zkCallback-1990-thread-1) [     ] o.a.s.c.c.ZkStateReader Updated live nodes from ZooKeeper... (4) -> (5)
   [junit4]   2> 885831 INFO  (zkCallback-1968-thread-1) [     ] o.a.s.c.c.ZkStateReader Updated live nodes from ZooKeeper... (4) -> (5)
   [junit4]   2> 885831 INFO  (zkCallback-1983-thread-1) [     ] o.a.s.c.c.ZkStateReader Updated live nodes from ZooKeeper... (4) -> (5)
   [junit4]   2> 885831 INFO  (zkCallback-1956-thread-1) [     ] o.a.s.c.c.ZkStateReader Updated live nodes from ZooKeeper... (4) -> (5)
   [junit4]   2> 885831 INFO  (zkCallback-2009-thread-1) [     ] o.a.s.c.c.ZkStateReader Updated live nodes from ZooKeeper... (4) -> (5)
   [junit4]   2> 885831 INFO  (zkCallback-1949-thread-3) [     ] o.a.s.c.c.ZkStateReader Updated live nodes from ZooKeeper... (4) -> (5)
   [junit4]   2> 885842 INFO  (zkCallback-2034-thread-1) [     ] o.a.s.c.c.ZkStateReader Updated live nodes from ZooKeeper... (4) -> (5)
   [junit4]   2> 885842 INFO  (closeThreadPool-1970-thread-1) [     ] o.a.s.c.c.ConnectionManager Waiting for client to connect to ZooKeeper
   [junit4]   2> 885843 INFO  (zkCallback-2036-thread-1) [     ] o.a.s.c.c.ZkStateReader Updated live nodes from ZooKeeper... (4) -> (5)
   [junit4]   2> 885844 INFO  (zkConnectionManagerCallback-2044-thread-1) [     ] o.a.s.c.c.ConnectionManager zkClient has connected
   [junit4]   2> 885844 INFO  (closeThreadPool-1970-thread-1) [     ] o.a.s.c.c.ConnectionManager Client is connected to ZooKeeper
   [junit4]   2> 885852 INFO  (closeThreadPool-1970-thread-1) [     ] o.a.s.c.c.ZkStateReader Updated live nodes from ZooKeeper... (0) -> (5)
   [junit4]   2> 885854 INFO  (closeThreadPool-1970-thread-1) [     ] o.a.s.c.s.i.ZkClientClusterStateProvider Cluster at 127.0.0.1:44240/solr ready
   [junit4]   2> 885864 INFO  (closeThreadPool-1970-thread-3) [n:127.0.0.1:45749_qlev%2Fx     ] o.a.s.h.a.MetricsHistoryHandler No .system collection, keeping metrics history in memory.
   [junit4]   2> 885885 INFO  (closeThreadPool-1970-thread-1) [     ] o.a.s.h.a.MetricsHistoryHandler No .system collection, keeping metrics history in memory.
   [junit4]   2> 885904 WARN  (closeThreadPool-1970-thread-1) [     ] o.a.s.m.r.j.JmxMetricsReporter Unable to register counter
   [junit4]   2>           => javax.management.InstanceNotFoundException: solr:dom1=node,category=ADMIN,scope=/admin/collections,name=requests
   [junit4]   2> 	at java.management/com.sun.jmx.interceptor.DefaultMBeanServerInterceptor.getMBean(DefaultMBeanServerInterceptor.java:1083)
   [junit4]   2> javax.management.InstanceNotFoundException: solr:dom1=node,category=ADMIN,scope=/admin/collections,name=requests
   [junit4]   2> 	at com.sun.jmx.interceptor.DefaultMBeanServerInterceptor.getMBean(DefaultMBeanServerInterceptor.java:1083) ~[?:?]
   [junit4]   2> 	at com.sun.jmx.interceptor.DefaultMBeanServerInterceptor.exclusiveUnregisterMBean(DefaultMBeanServerInterceptor.java:423) ~[?:?]
   [junit4]   2> 	at com.sun.jmx.interceptor.DefaultMBeanServerInterceptor.unregisterMBean(DefaultMBeanServerInterceptor.java:411) ~[?:?]
   [junit4]   2> 	at com.sun.jmx.mbeanserver.JmxMBeanServer.unregisterMBean(JmxMBeanServer.java:546) ~[?:?]
   [junit4]   2> 	at org.apache.solr.metrics.reporters.jmx.JmxMetricsReporter$JmxListener.registerMBean(JmxMetricsReporter.java:531) ~[java/:?]
   [junit4]   2> 	at org.apache.solr.metrics.reporters.jmx.JmxMetricsReporter$JmxListener.onCounterAdded(JmxMetricsReporter.java:596) ~[java/:?]
   [junit4]   2> 	at com.codahale.metrics.MetricRegistry.notifyListenerOfAddedMetric(MetricRegistry.java:470) ~[metrics-core-4.0.5.jar:4.0.5]
   [junit4]   2> 	at com.codahale.metrics.MetricRegistry.addListener(MetricRegistry.java:309) ~[metrics-core-4.0.5.jar:4.0.5]
   [junit4]   2> 	at org.apache.solr.metrics.reporters.jmx.JmxMetricsReporter.start(JmxMetricsReporter.java:729) ~[java/:?]
   [junit4]   2> 	at org.apache.solr.metrics.reporters.SolrJmxReporter.doInit(SolrJmxReporter.java:109) ~[java/:?]
   [junit4]   2> 	at org.apache.solr.metrics.SolrMetricReporter.init(SolrMetricReporter.java:70) ~[java/:?]
   [junit4]   2> 	at org.apache.solr.metrics.SolrMetricManager.loadReporter(SolrMetricManager.java:916) ~[java/:?]
   [junit4]   2> 	at org.apache.solr.metrics.SolrMetricManager.loadReporters(SolrMetricManager.java:843) ~[java/:?]
   [junit4]   2> 	at org.apache.solr.core.CoreContainer.load(CoreContainer.java:661) ~[java/:?]
   [junit4]   2> 	at org.apache.solr.servlet.SolrDispatchFilter.createCoreContainer(SolrDispatchFilter.java:261) ~[java/:?]
   [junit4]   2> 	at org.apache.solr.servlet.SolrDispatchFilter.init(SolrDispatchFilter.java:181) ~[java/:?]
   [junit4]   2> 	at org.eclipse.jetty.servlet.FilterHolder.initialize(FilterHolder.java:136) ~[jetty-servlet-9.4.19.v20190610.jar:9.4.19.v20190610]
   [junit4]   2> 	at org.eclipse.jetty.servlet.ServletHandler.lambda$initialize$0(ServletHandler.java:750) ~[jetty-servlet-9.4.19.v20190610.jar:9.4.19.v20190610]
   [junit4]   2> 	at java.util.Spliterators$ArraySpliterator.forEachRemaining(Spliterators.java:948) ~[?:?]
   [junit4]   2> 	at java.util.stream.Streams$ConcatSpliterator.forEachRemaining(Streams.java:734) ~[?:?]
   [junit4]   2> 	at java.util.stream.Streams$ConcatSpliterator.forEachRemaining(Streams.java:734) ~[?:?]
   [junit4]   2> 	at java.util.stream.ReferencePipeline$Head.forEach(ReferencePipeline.java:658) ~[?:?]
   [junit4]   2> 	at org.eclipse.jetty.servlet.ServletHandler.initialize(ServletHandler.java:744) ~[jetty-servlet-9.4.19.v20190610.jar:9.4.19.v20190610]
   [junit4]   2> 	at org.eclipse.jetty.servlet.ServletHandler.updateMappings(ServletHandler.java:1449) ~[jetty-servlet-9.4.19.v20190610.jar:9.4.19.v20190610]
   [junit4]   2> 	at org.eclipse.jetty.servlet.ServletHandler.setFilterMappings(ServletHandler.java:1513) ~[jetty-servlet-9.4.19.v20190610.jar:9.4.19.v20190610]
   [junit4]   2> 	at org.eclipse.jetty.servlet.ServletHandler.addFilterMapping(ServletHan

[...truncated too long message...]

 file = /home/jenkins/jenkins-slave/workspace/Lucene-Solr-NightlyTests-master/checkout/lucene/top-level-ivy-settings.xml

resolve:

ivy-availability-check:
[loadresource] Do not set property disallowed.ivy.jars.list as its length is 0.

-ivy-fail-disallowed-ivy-version:

ivy-fail:

ivy-fail:

ivy-configure:
[ivy:configure] :: loading settings :: file = /home/jenkins/jenkins-slave/workspace/Lucene-Solr-NightlyTests-master/checkout/lucene/top-level-ivy-settings.xml

resolve:

ivy-availability-check:
[loadresource] Do not set property disallowed.ivy.jars.list as its length is 0.

-ivy-fail-disallowed-ivy-version:

ivy-fail:

ivy-configure:
[ivy:configure] :: loading settings :: file = /home/jenkins/jenkins-slave/workspace/Lucene-Solr-NightlyTests-master/checkout/lucene/top-level-ivy-settings.xml

resolve:

ivy-availability-check:
[loadresource] Do not set property disallowed.ivy.jars.list as its length is 0.

-ivy-fail-disallowed-ivy-version:

ivy-fail:

ivy-fail:

ivy-configure:
[ivy:configure] :: loading settings :: file = /home/jenkins/jenkins-slave/workspace/Lucene-Solr-NightlyTests-master/checkout/lucene/top-level-ivy-settings.xml

resolve:

ivy-availability-check:
[loadresource] Do not set property disallowed.ivy.jars.list as its length is 0.

-ivy-fail-disallowed-ivy-version:

ivy-fail:

ivy-fail:

ivy-configure:
[ivy:configure] :: loading settings :: file = /home/jenkins/jenkins-slave/workspace/Lucene-Solr-NightlyTests-master/checkout/lucene/top-level-ivy-settings.xml

resolve:

ivy-availability-check:
[loadresource] Do not set property disallowed.ivy.jars.list as its length is 0.

-ivy-fail-disallowed-ivy-version:

ivy-fail:

ivy-fail:

ivy-configure:
[ivy:configure] :: loading settings :: file = /home/jenkins/jenkins-slave/workspace/Lucene-Solr-NightlyTests-master/checkout/lucene/top-level-ivy-settings.xml

resolve:

ivy-availability-check:
[loadresource] Do not set property disallowed.ivy.jars.list as its length is 0.

-ivy-fail-disallowed-ivy-version:

ivy-fail:

ivy-fail:

ivy-configure:
[ivy:configure] :: loading settings :: file = /home/jenkins/jenkins-slave/workspace/Lucene-Solr-NightlyTests-master/checkout/lucene/top-level-ivy-settings.xml

resolve:

ivy-availability-check:
[loadresource] Do not set property disallowed.ivy.jars.list as its length is 0.

-ivy-fail-disallowed-ivy-version:

ivy-fail:

ivy-fail:

ivy-configure:
[ivy:configure] :: loading settings :: file = /home/jenkins/jenkins-slave/workspace/Lucene-Solr-NightlyTests-master/checkout/lucene/top-level-ivy-settings.xml

resolve:

ivy-availability-check:
[loadresource] Do not set property disallowed.ivy.jars.list as its length is 0.

-ivy-fail-disallowed-ivy-version:

ivy-fail:

ivy-fail:

ivy-configure:
[ivy:configure] :: loading settings :: file = /home/jenkins/jenkins-slave/workspace/Lucene-Solr-NightlyTests-master/checkout/lucene/top-level-ivy-settings.xml

resolve:

ivy-availability-check:
[loadresource] Do not set property disallowed.ivy.jars.list as its length is 0.

-ivy-fail-disallowed-ivy-version:

ivy-fail:

ivy-fail:

ivy-configure:
[ivy:configure] :: loading settings :: file = /home/jenkins/jenkins-slave/workspace/Lucene-Solr-NightlyTests-master/checkout/lucene/top-level-ivy-settings.xml

resolve:

ivy-availability-check:
[loadresource] Do not set property disallowed.ivy.jars.list as its length is 0.

-ivy-fail-disallowed-ivy-version:

ivy-fail:

ivy-fail:

ivy-configure:
[ivy:configure] :: loading settings :: file = /home/jenkins/jenkins-slave/workspace/Lucene-Solr-NightlyTests-master/checkout/lucene/top-level-ivy-settings.xml

resolve:

ivy-availability-check:
[loadresource] Do not set property disallowed.ivy.jars.list as its length is 0.

-ivy-fail-disallowed-ivy-version:

ivy-fail:

ivy-fail:

ivy-configure:
[ivy:configure] :: loading settings :: file = /home/jenkins/jenkins-slave/workspace/Lucene-Solr-NightlyTests-master/checkout/lucene/top-level-ivy-settings.xml

resolve:

ivy-availability-check:
[loadresource] Do not set property disallowed.ivy.jars.list as its length is 0.

-ivy-fail-disallowed-ivy-version:

ivy-fail:

ivy-fail:

ivy-configure:
[ivy:configure] :: loading settings :: file = /home/jenkins/jenkins-slave/workspace/Lucene-Solr-NightlyTests-master/checkout/lucene/top-level-ivy-settings.xml

resolve:

ivy-availability-check:
[loadresource] Do not set property disallowed.ivy.jars.list as its length is 0.

-ivy-fail-disallowed-ivy-version:

ivy-fail:

ivy-fail:

ivy-configure:
[ivy:configure] :: loading settings :: file = /home/jenkins/jenkins-slave/workspace/Lucene-Solr-NightlyTests-master/checkout/lucene/top-level-ivy-settings.xml

resolve:

jar-checksums:
    [mkdir] Created dir: /home/jenkins/jenkins-slave/workspace/Lucene-Solr-NightlyTests-master/checkout/solr/null971399961
     [copy] Copying 249 files to /home/jenkins/jenkins-slave/workspace/Lucene-Solr-NightlyTests-master/checkout/solr/null971399961
   [delete] Deleting directory /home/jenkins/jenkins-slave/workspace/Lucene-Solr-NightlyTests-master/checkout/solr/null971399961

check-working-copy:
[ivy:cachepath] :: resolving dependencies :: #;working@lucene2-us-west.apache.org
[ivy:cachepath] 	confs: [default]
[ivy:cachepath] 	found org.eclipse.jgit#org.eclipse.jgit;5.3.0.201903130848-r in public
[ivy:cachepath] 	found com.jcraft#jsch;0.1.54 in public
[ivy:cachepath] 	found com.jcraft#jzlib;1.1.1 in public
[ivy:cachepath] 	found com.googlecode.javaewah#JavaEWAH;1.1.6 in public
[ivy:cachepath] 	found org.slf4j#slf4j-api;1.7.2 in public
[ivy:cachepath] 	found org.bouncycastle#bcpg-jdk15on;1.60 in public
[ivy:cachepath] 	found org.bouncycastle#bcprov-jdk15on;1.60 in public
[ivy:cachepath] 	found org.bouncycastle#bcpkix-jdk15on;1.60 in public
[ivy:cachepath] 	found org.slf4j#slf4j-nop;1.7.2 in public
[ivy:cachepath] :: resolution report :: resolve 118ms :: artifacts dl 11ms
	---------------------------------------------------------------------
	|                  |            modules            ||   artifacts   |
	|       conf       | number| search|dwnlded|evicted|| number|dwnlded|
	---------------------------------------------------------------------
	|      default     |   9   |   0   |   0   |   0   ||   9   |   0   |
	---------------------------------------------------------------------
[wc-checker] Initializing working copy...
[wc-checker] Checking working copy status...

-jenkins-base:

BUILD SUCCESSFUL
Total time: 638 minutes 30 seconds
Archiving artifacts
java.lang.InterruptedException: no matches found within 10000
	at hudson.FilePath$ValidateAntFileMask.hasMatch(FilePath.java:2847)
	at hudson.FilePath$ValidateAntFileMask.invoke(FilePath.java:2726)
	at hudson.FilePath$ValidateAntFileMask.invoke(FilePath.java:2707)
	at hudson.FilePath$FileCallableWrapper.call(FilePath.java:3086)
Also:   hudson.remoting.Channel$CallSiteStackTrace: Remote call to lucene2
		at hudson.remoting.Channel.attachCallSiteStackTrace(Channel.java:1741)
		at hudson.remoting.UserRequest$ExceptionResponse.retrieve(UserRequest.java:357)
		at hudson.remoting.Channel.call(Channel.java:955)
		at hudson.FilePath.act(FilePath.java:1072)
		at hudson.FilePath.act(FilePath.java:1061)
		at hudson.FilePath.validateAntFileMask(FilePath.java:2705)
		at hudson.tasks.ArtifactArchiver.perform(ArtifactArchiver.java:243)
		at hudson.tasks.BuildStepCompatibilityLayer.perform(BuildStepCompatibilityLayer.java:81)
		at hudson.tasks.BuildStepMonitor$1.perform(BuildStepMonitor.java:20)
		at hudson.model.AbstractBuild$AbstractBuildExecution.perform(AbstractBuild.java:744)
		at hudson.model.AbstractBuild$AbstractBuildExecution.performAllBuildSteps(AbstractBuild.java:690)
		at hudson.model.Build$BuildExecution.post2(Build.java:186)
		at hudson.model.AbstractBuild$AbstractBuildExecution.post(AbstractBuild.java:635)
		at hudson.model.Run.execute(Run.java:1835)
		at hudson.model.FreeStyleBuild.run(FreeStyleBuild.java:43)
		at hudson.model.ResourceController.execute(ResourceController.java:97)
		at hudson.model.Executor.run(Executor.java:429)
Caused: hudson.FilePath$TunneledInterruptedException
	at hudson.FilePath$FileCallableWrapper.call(FilePath.java:3088)
	at hudson.remoting.UserRequest.perform(UserRequest.java:212)
	at hudson.remoting.UserRequest.perform(UserRequest.java:54)
	at hudson.remoting.Request$2.run(Request.java:369)
	at hudson.remoting.InterceptingExecutorService$1.call(InterceptingExecutorService.java:72)
	at java.util.concurrent.FutureTask.run(FutureTask.java:266)
	at java.util.concurrent.ThreadPoolExecutor.runWorker(ThreadPoolExecutor.java:1142)
	at java.util.concurrent.ThreadPoolExecutor$Worker.run(ThreadPoolExecutor.java:617)
	at java.lang.Thread.run(Thread.java:748)
Caused: java.lang.InterruptedException: java.lang.InterruptedException: no matches found within 10000
	at hudson.FilePath.act(FilePath.java:1074)
	at hudson.FilePath.act(FilePath.java:1061)
	at hudson.FilePath.validateAntFileMask(FilePath.java:2705)
	at hudson.tasks.ArtifactArchiver.perform(ArtifactArchiver.java:243)
	at hudson.tasks.BuildStepCompatibilityLayer.perform(BuildStepCompatibilityLayer.java:81)
	at hudson.tasks.BuildStepMonitor$1.perform(BuildStepMonitor.java:20)
	at hudson.model.AbstractBuild$AbstractBuildExecution.perform(AbstractBuild.java:744)
	at hudson.model.AbstractBuild$AbstractBuildExecution.performAllBuildSteps(AbstractBuild.java:690)
	at hudson.model.Build$BuildExecution.post2(Build.java:186)
	at hudson.model.AbstractBuild$AbstractBuildExecution.post(AbstractBuild.java:635)
	at hudson.model.Run.execute(Run.java:1835)
	at hudson.model.FreeStyleBuild.run(FreeStyleBuild.java:43)
	at hudson.model.ResourceController.execute(ResourceController.java:97)
	at hudson.model.Executor.run(Executor.java:429)
No artifacts found that match the file pattern "**/*.events,heapdumps/**,**/hs_err_pid*". Configuration error?
Recording test results
Build step 'Publish JUnit test result report' changed build result to UNSTABLE
Email was triggered for: Unstable (Test Failures)
Sending email for trigger: Unstable (Test Failures)

Mime
View raw message