lucene-dev mailing list archives

Site index · List index
Message view « Date » · « Thread »
Top « Date » · « Thread »
From Policeman Jenkins Server <jenk...@thetaphi.de>
Subject [JENKINS] Lucene-Solr-master-Linux (64bit/jdk-11.0.3) - Build # 24449 - Unstable!
Date Fri, 26 Jul 2019 01:20:23 GMT
Build: https://jenkins.thetaphi.de/job/Lucene-Solr-master-Linux/24449/
Java: 64bit/jdk-11.0.3 -XX:+UseCompressedOops -XX:+UseG1GC

5 tests failed.
FAILED:  org.apache.solr.search.facet.TestCloudJSONFacetSKG.testRandom

Error Message:
Error from server at http://127.0.0.1:37751/solr/org.apache.solr.search.facet.TestCloudJSONFacetSKG_collection: Error from server at null: Expected mime type application/octet-stream but got text/html. <html> <head> <meta http-equiv="Content-Type" content="text/html;charset=utf-8"/> <title>Error 500 Server Error</title> </head> <body><h2>HTTP ERROR 500</h2> <p>Problem accessing /solr/org.apache.solr.search.facet.TestCloudJSONFacetSKG_collection_shard2_replica_n2/select. Reason: <pre>    Server Error</pre></p><h3>Caused by:</h3><pre>java.lang.AssertionError  at java.base/java.util.HashMap$TreeNode.moveRootToFront(HashMap.java:1896)  at java.base/java.util.HashMap$TreeNode.putTreeVal(HashMap.java:2061)  at java.base/java.util.HashMap.putVal(HashMap.java:633)  at java.base/java.util.HashMap.put(HashMap.java:607)  at org.apache.solr.search.LRUCache.put(LRUCache.java:201)  at org.apache.solr.search.SolrIndexSearcher.getDocListC(SolrIndexSearcher.java:1449)  at org.apache.solr.search.SolrIndexSearcher.search(SolrIndexSearcher.java:568)  at org.apache.solr.handler.component.QueryComponent.doProcessUngroupedSearch(QueryComponent.java:1484)  at org.apache.solr.handler.component.QueryComponent.process(QueryComponent.java:398)  at org.apache.solr.handler.component.SearchHandler.handleRequestBody(SearchHandler.java:305)  at org.apache.solr.handler.RequestHandlerBase.handleRequest(RequestHandlerBase.java:199)  at org.apache.solr.core.SolrCore.execute(SolrCore.java:2581)  at org.apache.solr.servlet.HttpSolrCall.execute(HttpSolrCall.java:780)  at org.apache.solr.servlet.HttpSolrCall.call(HttpSolrCall.java:566)  at org.apache.solr.servlet.SolrDispatchFilter.doFilter(SolrDispatchFilter.java:423)  at org.apache.solr.servlet.SolrDispatchFilter.doFilter(SolrDispatchFilter.java:350)  at org.eclipse.jetty.servlet.ServletHandler$CachedChain.doFilter(ServletHandler.java:1610)  at org.apache.solr.client.solrj.embedded.JettySolrRunner$DebugFilter.doFilter(JettySolrRunner.java:165)  at org.eclipse.jetty.servlet.ServletHandler$CachedChain.doFilter(ServletHandler.java:1610)  at org.eclipse.jetty.servlet.ServletHandler.doHandle(ServletHandler.java:540)  at org.eclipse.jetty.server.handler.ScopedHandler.nextHandle(ScopedHandler.java:255)  at org.eclipse.jetty.server.session.SessionHandler.doHandle(SessionHandler.java:1711)  at org.eclipse.jetty.server.handler.ScopedHandler.nextHandle(ScopedHandler.java:255)  at org.eclipse.jetty.server.handler.ContextHandler.doHandle(ContextHandler.java:1347)  at org.eclipse.jetty.server.handler.ScopedHandler.nextScope(ScopedHandler.java:203)  at org.eclipse.jetty.servlet.ServletHandler.doScope(ServletHandler.java:480)  at org.eclipse.jetty.server.session.SessionHandler.doScope(SessionHandler.java:1678)  at org.eclipse.jetty.server.handler.ScopedHandler.nextScope(ScopedHandler.java:201)  at org.eclipse.jetty.server.handler.ContextHandler.doScope(ContextHandler.java:1249)  at org.eclipse.jetty.server.handler.ScopedHandler.handle(ScopedHandler.java:144)  at org.eclipse.jetty.server.handler.gzip.GzipHandler.handle(GzipHandler.java:703)  at org.eclipse.jetty.server.handler.HandlerWrapper.handle(HandlerWrapper.java:132)  at org.eclipse.jetty.server.Server.handle(Server.java:505)  at org.eclipse.jetty.server.HttpChannel.handle(HttpChannel.java:370)  at org.eclipse.jetty.server.HttpChannel.run(HttpChannel.java:311)  at org.eclipse.jetty.util.thread.QueuedThreadPool.runJob(QueuedThreadPool.java:781)  at org.eclipse.jetty.util.thread.QueuedThreadPool$Runner.run(QueuedThreadPool.java:917)  at java.base/java.lang.Thread.run(Thread.java:834) </pre> <hr><a href="http://eclipse.org/jetty">Powered by Jetty:// 9.4.19.v20190610</a><hr/>  </body> </html> 

Stack Trace:
org.apache.solr.client.solrj.impl.HttpSolrClient$RemoteSolrException: Error from server at http://127.0.0.1:37751/solr/org.apache.solr.search.facet.TestCloudJSONFacetSKG_collection: Error from server at null: Expected mime type application/octet-stream but got text/html. <html>
<head>
<meta http-equiv="Content-Type" content="text/html;charset=utf-8"/>
<title>Error 500 Server Error</title>
</head>
<body><h2>HTTP ERROR 500</h2>
<p>Problem accessing /solr/org.apache.solr.search.facet.TestCloudJSONFacetSKG_collection_shard2_replica_n2/select. Reason:
<pre>    Server Error</pre></p><h3>Caused by:</h3><pre>java.lang.AssertionError
	at java.base/java.util.HashMap$TreeNode.moveRootToFront(HashMap.java:1896)
	at java.base/java.util.HashMap$TreeNode.putTreeVal(HashMap.java:2061)
	at java.base/java.util.HashMap.putVal(HashMap.java:633)
	at java.base/java.util.HashMap.put(HashMap.java:607)
	at org.apache.solr.search.LRUCache.put(LRUCache.java:201)
	at org.apache.solr.search.SolrIndexSearcher.getDocListC(SolrIndexSearcher.java:1449)
	at org.apache.solr.search.SolrIndexSearcher.search(SolrIndexSearcher.java:568)
	at org.apache.solr.handler.component.QueryComponent.doProcessUngroupedSearch(QueryComponent.java:1484)
	at org.apache.solr.handler.component.QueryComponent.process(QueryComponent.java:398)
	at org.apache.solr.handler.component.SearchHandler.handleRequestBody(SearchHandler.java:305)
	at org.apache.solr.handler.RequestHandlerBase.handleRequest(RequestHandlerBase.java:199)
	at org.apache.solr.core.SolrCore.execute(SolrCore.java:2581)
	at org.apache.solr.servlet.HttpSolrCall.execute(HttpSolrCall.java:780)
	at org.apache.solr.servlet.HttpSolrCall.call(HttpSolrCall.java:566)
	at org.apache.solr.servlet.SolrDispatchFilter.doFilter(SolrDispatchFilter.java:423)
	at org.apache.solr.servlet.SolrDispatchFilter.doFilter(SolrDispatchFilter.java:350)
	at org.eclipse.jetty.servlet.ServletHandler$CachedChain.doFilter(ServletHandler.java:1610)
	at org.apache.solr.client.solrj.embedded.JettySolrRunner$DebugFilter.doFilter(JettySolrRunner.java:165)
	at org.eclipse.jetty.servlet.ServletHandler$CachedChain.doFilter(ServletHandler.java:1610)
	at org.eclipse.jetty.servlet.ServletHandler.doHandle(ServletHandler.java:540)
	at org.eclipse.jetty.server.handler.ScopedHandler.nextHandle(ScopedHandler.java:255)
	at org.eclipse.jetty.server.session.SessionHandler.doHandle(SessionHandler.java:1711)
	at org.eclipse.jetty.server.handler.ScopedHandler.nextHandle(ScopedHandler.java:255)
	at org.eclipse.jetty.server.handler.ContextHandler.doHandle(ContextHandler.java:1347)
	at org.eclipse.jetty.server.handler.ScopedHandler.nextScope(ScopedHandler.java:203)
	at org.eclipse.jetty.servlet.ServletHandler.doScope(ServletHandler.java:480)
	at org.eclipse.jetty.server.session.SessionHandler.doScope(SessionHandler.java:1678)
	at org.eclipse.jetty.server.handler.ScopedHandler.nextScope(ScopedHandler.java:201)
	at org.eclipse.jetty.server.handler.ContextHandler.doScope(ContextHandler.java:1249)
	at org.eclipse.jetty.server.handler.ScopedHandler.handle(ScopedHandler.java:144)
	at org.eclipse.jetty.server.handler.gzip.GzipHandler.handle(GzipHandler.java:703)
	at org.eclipse.jetty.server.handler.HandlerWrapper.handle(HandlerWrapper.java:132)
	at org.eclipse.jetty.server.Server.handle(Server.java:505)
	at org.eclipse.jetty.server.HttpChannel.handle(HttpChannel.java:370)
	at org.eclipse.jetty.server.HttpChannel.run(HttpChannel.java:311)
	at org.eclipse.jetty.util.thread.QueuedThreadPool.runJob(QueuedThreadPool.java:781)
	at org.eclipse.jetty.util.thread.QueuedThreadPool$Runner.run(QueuedThreadPool.java:917)
	at java.base/java.lang.Thread.run(Thread.java:834)
</pre>
<hr><a href="http://eclipse.org/jetty">Powered by Jetty:// 9.4.19.v20190610</a><hr/>

</body>
</html>

	at __randomizedtesting.SeedInfo.seed([200BDD0A84D4DD47:5247F80535B46B34]:0)
	at org.apache.solr.client.solrj.impl.HttpSolrClient.executeMethod(HttpSolrClient.java:656)
	at org.apache.solr.client.solrj.impl.HttpSolrClient.request(HttpSolrClient.java:262)
	at org.apache.solr.client.solrj.impl.HttpSolrClient.request(HttpSolrClient.java:245)
	at org.apache.solr.client.solrj.SolrRequest.process(SolrRequest.java:211)
	at org.apache.solr.client.solrj.SolrClient.query(SolrClient.java:987)
	at org.apache.solr.client.solrj.SolrClient.query(SolrClient.java:1002)
	at org.apache.solr.search.facet.TestCloudJSONFacetSKG.getNumFound(TestCloudJSONFacetSKG.java:669)
	at org.apache.solr.search.facet.TestCloudJSONFacetSKG.verifySKGResults(TestCloudJSONFacetSKG.java:446)
	at org.apache.solr.search.facet.TestCloudJSONFacetSKG.assertFacetSKGsAreCorrect(TestCloudJSONFacetSKG.java:392)
	at org.apache.solr.search.facet.TestCloudJSONFacetSKG.assertFacetSKGsAreCorrect(TestCloudJSONFacetSKG.java:402)
	at org.apache.solr.search.facet.TestCloudJSONFacetSKG.assertFacetSKGsAreCorrect(TestCloudJSONFacetSKG.java:402)
	at org.apache.solr.search.facet.TestCloudJSONFacetSKG.assertFacetSKGsAreCorrect(TestCloudJSONFacetSKG.java:349)
	at org.apache.solr.search.facet.TestCloudJSONFacetSKG.testRandom(TestCloudJSONFacetSKG.java:274)
	at java.base/jdk.internal.reflect.NativeMethodAccessorImpl.invoke0(Native Method)
	at java.base/jdk.internal.reflect.NativeMethodAccessorImpl.invoke(NativeMethodAccessorImpl.java:62)
	at java.base/jdk.internal.reflect.DelegatingMethodAccessorImpl.invoke(DelegatingMethodAccessorImpl.java:43)
	at java.base/java.lang.reflect.Method.invoke(Method.java:566)
	at com.carrotsearch.randomizedtesting.RandomizedRunner.invoke(RandomizedRunner.java:1750)
	at com.carrotsearch.randomizedtesting.RandomizedRunner$8.evaluate(RandomizedRunner.java:938)
	at com.carrotsearch.randomizedtesting.RandomizedRunner$9.evaluate(RandomizedRunner.java:974)
	at com.carrotsearch.randomizedtesting.RandomizedRunner$10.evaluate(RandomizedRunner.java:988)
	at com.carrotsearch.randomizedtesting.rules.SystemPropertiesRestoreRule$1.evaluate(SystemPropertiesRestoreRule.java:57)
	at org.apache.lucene.util.TestRuleSetupTeardownChained$1.evaluate(TestRuleSetupTeardownChained.java:49)
	at org.apache.lucene.util.AbstractBeforeAfterRule$1.evaluate(AbstractBeforeAfterRule.java:45)
	at org.apache.lucene.util.TestRuleThreadAndTestName$1.evaluate(TestRuleThreadAndTestName.java:48)
	at org.apache.lucene.util.TestRuleIgnoreAfterMaxFailures$1.evaluate(TestRuleIgnoreAfterMaxFailures.java:64)
	at org.apache.lucene.util.TestRuleMarkFailure$1.evaluate(TestRuleMarkFailure.java:47)
	at com.carrotsearch.randomizedtesting.rules.StatementAdapter.evaluate(StatementAdapter.java:36)
	at com.carrotsearch.randomizedtesting.ThreadLeakControl$StatementRunner.run(ThreadLeakControl.java:368)
	at com.carrotsearch.randomizedtesting.ThreadLeakControl.forkTimeoutingTask(ThreadLeakControl.java:817)
	at com.carrotsearch.randomizedtesting.ThreadLeakControl$3.evaluate(ThreadLeakControl.java:468)
	at com.carrotsearch.randomizedtesting.RandomizedRunner.runSingleTest(RandomizedRunner.java:947)
	at com.carrotsearch.randomizedtesting.RandomizedRunner$5.evaluate(RandomizedRunner.java:832)
	at com.carrotsearch.randomizedtesting.RandomizedRunner$6.evaluate(RandomizedRunner.java:883)
	at com.carrotsearch.randomizedtesting.RandomizedRunner$7.evaluate(RandomizedRunner.java:894)
	at com.carrotsearch.randomizedtesting.rules.StatementAdapter.evaluate(StatementAdapter.java:36)
	at com.carrotsearch.randomizedtesting.rules.SystemPropertiesRestoreRule$1.evaluate(SystemPropertiesRestoreRule.java:57)
	at org.apache.lucene.util.AbstractBeforeAfterRule$1.evaluate(AbstractBeforeAfterRule.java:45)
	at com.carrotsearch.randomizedtesting.rules.StatementAdapter.evaluate(StatementAdapter.java:36)
	at org.apache.lucene.util.TestRuleStoreClassName$1.evaluate(TestRuleStoreClassName.java:41)
	at com.carrotsearch.randomizedtesting.rules.NoShadowingOrOverridesOnMethodsRule$1.evaluate(NoShadowingOrOverridesOnMethodsRule.java:40)
	at com.carrotsearch.randomizedtesting.rules.NoShadowingOrOverridesOnMethodsRule$1.evaluate(NoShadowingOrOverridesOnMethodsRule.java:40)
	at com.carrotsearch.randomizedtesting.rules.StatementAdapter.evaluate(StatementAdapter.java:36)
	at com.carrotsearch.randomizedtesting.rules.StatementAdapter.evaluate(StatementAdapter.java:36)
	at org.apache.lucene.util.TestRuleAssertionsRequired$1.evaluate(TestRuleAssertionsRequired.java:53)
	at org.apache.lucene.util.TestRuleMarkFailure$1.evaluate(TestRuleMarkFailure.java:47)
	at org.apache.lucene.util.TestRuleIgnoreAfterMaxFailures$1.evaluate(TestRuleIgnoreAfterMaxFailures.java:64)
	at org.apache.lucene.util.TestRuleIgnoreTestSuites$1.evaluate(TestRuleIgnoreTestSuites.java:54)
	at com.carrotsearch.randomizedtesting.rules.StatementAdapter.evaluate(StatementAdapter.java:36)
	at com.carrotsearch.randomizedtesting.ThreadLeakControl$StatementRunner.run(ThreadLeakControl.java:368)
	at java.base/java.lang.Thread.run(Thread.java:834)


FAILED:  org.apache.solr.search.facet.TestCloudJSONFacetSKG.testRandom

Error Message:
Error from server at http://127.0.0.1:40203/solr/org.apache.solr.search.facet.TestCloudJSONFacetSKG_collection: Error from server at null: Expected mime type application/octet-stream but got text/html. <html> <head> <meta http-equiv="Content-Type" content="text/html;charset=utf-8"/> <title>Error 500 Server Error</title> </head> <body><h2>HTTP ERROR 500</h2> <p>Problem accessing /solr/org.apache.solr.search.facet.TestCloudJSONFacetSKG_collection_shard1_replica_n1/select. Reason: <pre>    Server Error</pre></p><h3>Caused by:</h3><pre>java.lang.AssertionError  at java.base/java.util.HashMap$TreeNode.moveRootToFront(HashMap.java:1896)  at java.base/java.util.HashMap$TreeNode.putTreeVal(HashMap.java:2061)  at java.base/java.util.HashMap.putVal(HashMap.java:633)  at java.base/java.util.HashMap.put(HashMap.java:607)  at org.apache.solr.search.LRUCache.put(LRUCache.java:201)  at org.apache.solr.search.SolrIndexSearcher.getDocListC(SolrIndexSearcher.java:1449)  at org.apache.solr.search.SolrIndexSearcher.search(SolrIndexSearcher.java:568)  at org.apache.solr.handler.component.QueryComponent.doProcessUngroupedSearch(QueryComponent.java:1484)  at org.apache.solr.handler.component.QueryComponent.process(QueryComponent.java:398)  at org.apache.solr.handler.component.SearchHandler.handleRequestBody(SearchHandler.java:305)  at org.apache.solr.handler.RequestHandlerBase.handleRequest(RequestHandlerBase.java:199)  at org.apache.solr.core.SolrCore.execute(SolrCore.java:2581)  at org.apache.solr.servlet.HttpSolrCall.execute(HttpSolrCall.java:780)  at org.apache.solr.servlet.HttpSolrCall.call(HttpSolrCall.java:566)  at org.apache.solr.servlet.SolrDispatchFilter.doFilter(SolrDispatchFilter.java:423)  at org.apache.solr.servlet.SolrDispatchFilter.doFilter(SolrDispatchFilter.java:350)  at org.eclipse.jetty.servlet.ServletHandler$CachedChain.doFilter(ServletHandler.java:1610)  at org.apache.solr.client.solrj.embedded.JettySolrRunner$DebugFilter.doFilter(JettySolrRunner.java:165)  at org.eclipse.jetty.servlet.ServletHandler$CachedChain.doFilter(ServletHandler.java:1610)  at org.eclipse.jetty.servlet.ServletHandler.doHandle(ServletHandler.java:540)  at org.eclipse.jetty.server.handler.ScopedHandler.nextHandle(ScopedHandler.java:255)  at org.eclipse.jetty.server.session.SessionHandler.doHandle(SessionHandler.java:1711)  at org.eclipse.jetty.server.handler.ScopedHandler.nextHandle(ScopedHandler.java:255)  at org.eclipse.jetty.server.handler.ContextHandler.doHandle(ContextHandler.java:1347)  at org.eclipse.jetty.server.handler.ScopedHandler.nextScope(ScopedHandler.java:203)  at org.eclipse.jetty.servlet.ServletHandler.doScope(ServletHandler.java:480)  at org.eclipse.jetty.server.session.SessionHandler.doScope(SessionHandler.java:1678)  at org.eclipse.jetty.server.handler.ScopedHandler.nextScope(ScopedHandler.java:201)  at org.eclipse.jetty.server.handler.ContextHandler.doScope(ContextHandler.java:1249)  at org.eclipse.jetty.server.handler.ScopedHandler.handle(ScopedHandler.java:144)  at org.eclipse.jetty.server.handler.gzip.GzipHandler.handle(GzipHandler.java:703)  at org.eclipse.jetty.server.handler.HandlerWrapper.handle(HandlerWrapper.java:132)  at org.eclipse.jetty.server.Server.handle(Server.java:505)  at org.eclipse.jetty.server.HttpChannel.handle(HttpChannel.java:370)  at org.eclipse.jetty.server.HttpChannel.run(HttpChannel.java:311)  at org.eclipse.jetty.util.thread.QueuedThreadPool.runJob(QueuedThreadPool.java:781)  at org.eclipse.jetty.util.thread.QueuedThreadPool$Runner.run(QueuedThreadPool.java:917)  at java.base/java.lang.Thread.run(Thread.java:834) </pre> <hr><a href="http://eclipse.org/jetty">Powered by Jetty:// 9.4.19.v20190610</a><hr/>  </body> </html> 

Stack Trace:
org.apache.solr.client.solrj.impl.HttpSolrClient$RemoteSolrException: Error from server at http://127.0.0.1:40203/solr/org.apache.solr.search.facet.TestCloudJSONFacetSKG_collection: Error from server at null: Expected mime type application/octet-stream but got text/html. <html>
<head>
<meta http-equiv="Content-Type" content="text/html;charset=utf-8"/>
<title>Error 500 Server Error</title>
</head>
<body><h2>HTTP ERROR 500</h2>
<p>Problem accessing /solr/org.apache.solr.search.facet.TestCloudJSONFacetSKG_collection_shard1_replica_n1/select. Reason:
<pre>    Server Error</pre></p><h3>Caused by:</h3><pre>java.lang.AssertionError
	at java.base/java.util.HashMap$TreeNode.moveRootToFront(HashMap.java:1896)
	at java.base/java.util.HashMap$TreeNode.putTreeVal(HashMap.java:2061)
	at java.base/java.util.HashMap.putVal(HashMap.java:633)
	at java.base/java.util.HashMap.put(HashMap.java:607)
	at org.apache.solr.search.LRUCache.put(LRUCache.java:201)
	at org.apache.solr.search.SolrIndexSearcher.getDocListC(SolrIndexSearcher.java:1449)
	at org.apache.solr.search.SolrIndexSearcher.search(SolrIndexSearcher.java:568)
	at org.apache.solr.handler.component.QueryComponent.doProcessUngroupedSearch(QueryComponent.java:1484)
	at org.apache.solr.handler.component.QueryComponent.process(QueryComponent.java:398)
	at org.apache.solr.handler.component.SearchHandler.handleRequestBody(SearchHandler.java:305)
	at org.apache.solr.handler.RequestHandlerBase.handleRequest(RequestHandlerBase.java:199)
	at org.apache.solr.core.SolrCore.execute(SolrCore.java:2581)
	at org.apache.solr.servlet.HttpSolrCall.execute(HttpSolrCall.java:780)
	at org.apache.solr.servlet.HttpSolrCall.call(HttpSolrCall.java:566)
	at org.apache.solr.servlet.SolrDispatchFilter.doFilter(SolrDispatchFilter.java:423)
	at org.apache.solr.servlet.SolrDispatchFilter.doFilter(SolrDispatchFilter.java:350)
	at org.eclipse.jetty.servlet.ServletHandler$CachedChain.doFilter(ServletHandler.java:1610)
	at org.apache.solr.client.solrj.embedded.JettySolrRunner$DebugFilter.doFilter(JettySolrRunner.java:165)
	at org.eclipse.jetty.servlet.ServletHandler$CachedChain.doFilter(ServletHandler.java:1610)
	at org.eclipse.jetty.servlet.ServletHandler.doHandle(ServletHandler.java:540)
	at org.eclipse.jetty.server.handler.ScopedHandler.nextHandle(ScopedHandler.java:255)
	at org.eclipse.jetty.server.session.SessionHandler.doHandle(SessionHandler.java:1711)
	at org.eclipse.jetty.server.handler.ScopedHandler.nextHandle(ScopedHandler.java:255)
	at org.eclipse.jetty.server.handler.ContextHandler.doHandle(ContextHandler.java:1347)
	at org.eclipse.jetty.server.handler.ScopedHandler.nextScope(ScopedHandler.java:203)
	at org.eclipse.jetty.servlet.ServletHandler.doScope(ServletHandler.java:480)
	at org.eclipse.jetty.server.session.SessionHandler.doScope(SessionHandler.java:1678)
	at org.eclipse.jetty.server.handler.ScopedHandler.nextScope(ScopedHandler.java:201)
	at org.eclipse.jetty.server.handler.ContextHandler.doScope(ContextHandler.java:1249)
	at org.eclipse.jetty.server.handler.ScopedHandler.handle(ScopedHandler.java:144)
	at org.eclipse.jetty.server.handler.gzip.GzipHandler.handle(GzipHandler.java:703)
	at org.eclipse.jetty.server.handler.HandlerWrapper.handle(HandlerWrapper.java:132)
	at org.eclipse.jetty.server.Server.handle(Server.java:505)
	at org.eclipse.jetty.server.HttpChannel.handle(HttpChannel.java:370)
	at org.eclipse.jetty.server.HttpChannel.run(HttpChannel.java:311)
	at org.eclipse.jetty.util.thread.QueuedThreadPool.runJob(QueuedThreadPool.java:781)
	at org.eclipse.jetty.util.thread.QueuedThreadPool$Runner.run(QueuedThreadPool.java:917)
	at java.base/java.lang.Thread.run(Thread.java:834)
</pre>
<hr><a href="http://eclipse.org/jetty">Powered by Jetty:// 9.4.19.v20190610</a><hr/>

</body>
</html>

	at __randomizedtesting.SeedInfo.seed([200BDD0A84D4DD47:5247F80535B46B34]:0)
	at org.apache.solr.client.solrj.impl.HttpSolrClient.executeMethod(HttpSolrClient.java:656)
	at org.apache.solr.client.solrj.impl.HttpSolrClient.request(HttpSolrClient.java:262)
	at org.apache.solr.client.solrj.impl.HttpSolrClient.request(HttpSolrClient.java:245)
	at org.apache.solr.client.solrj.SolrRequest.process(SolrRequest.java:211)
	at org.apache.solr.client.solrj.SolrClient.query(SolrClient.java:987)
	at org.apache.solr.client.solrj.SolrClient.query(SolrClient.java:1002)
	at org.apache.solr.search.facet.TestCloudJSONFacetSKG.getNumFound(TestCloudJSONFacetSKG.java:669)
	at org.apache.solr.search.facet.TestCloudJSONFacetSKG.verifySKGResults(TestCloudJSONFacetSKG.java:446)
	at org.apache.solr.search.facet.TestCloudJSONFacetSKG.assertFacetSKGsAreCorrect(TestCloudJSONFacetSKG.java:392)
	at org.apache.solr.search.facet.TestCloudJSONFacetSKG.assertFacetSKGsAreCorrect(TestCloudJSONFacetSKG.java:402)
	at org.apache.solr.search.facet.TestCloudJSONFacetSKG.assertFacetSKGsAreCorrect(TestCloudJSONFacetSKG.java:402)
	at org.apache.solr.search.facet.TestCloudJSONFacetSKG.assertFacetSKGsAreCorrect(TestCloudJSONFacetSKG.java:349)
	at org.apache.solr.search.facet.TestCloudJSONFacetSKG.testRandom(TestCloudJSONFacetSKG.java:274)
	at java.base/jdk.internal.reflect.NativeMethodAccessorImpl.invoke0(Native Method)
	at java.base/jdk.internal.reflect.NativeMethodAccessorImpl.invoke(NativeMethodAccessorImpl.java:62)
	at java.base/jdk.internal.reflect.DelegatingMethodAccessorImpl.invoke(DelegatingMethodAccessorImpl.java:43)
	at java.base/java.lang.reflect.Method.invoke(Method.java:566)
	at com.carrotsearch.randomizedtesting.RandomizedRunner.invoke(RandomizedRunner.java:1750)
	at com.carrotsearch.randomizedtesting.RandomizedRunner$8.evaluate(RandomizedRunner.java:938)
	at com.carrotsearch.randomizedtesting.RandomizedRunner$9.evaluate(RandomizedRunner.java:974)
	at com.carrotsearch.randomizedtesting.RandomizedRunner$10.evaluate(RandomizedRunner.java:988)
	at com.carrotsearch.randomizedtesting.rules.SystemPropertiesRestoreRule$1.evaluate(SystemPropertiesRestoreRule.java:57)
	at org.apache.lucene.util.TestRuleSetupTeardownChained$1.evaluate(TestRuleSetupTeardownChained.java:49)
	at org.apache.lucene.util.AbstractBeforeAfterRule$1.evaluate(AbstractBeforeAfterRule.java:45)
	at org.apache.lucene.util.TestRuleThreadAndTestName$1.evaluate(TestRuleThreadAndTestName.java:48)
	at org.apache.lucene.util.TestRuleIgnoreAfterMaxFailures$1.evaluate(TestRuleIgnoreAfterMaxFailures.java:64)
	at org.apache.lucene.util.TestRuleMarkFailure$1.evaluate(TestRuleMarkFailure.java:47)
	at com.carrotsearch.randomizedtesting.rules.StatementAdapter.evaluate(StatementAdapter.java:36)
	at com.carrotsearch.randomizedtesting.ThreadLeakControl$StatementRunner.run(ThreadLeakControl.java:368)
	at com.carrotsearch.randomizedtesting.ThreadLeakControl.forkTimeoutingTask(ThreadLeakControl.java:817)
	at com.carrotsearch.randomizedtesting.ThreadLeakControl$3.evaluate(ThreadLeakControl.java:468)
	at com.carrotsearch.randomizedtesting.RandomizedRunner.runSingleTest(RandomizedRunner.java:947)
	at com.carrotsearch.randomizedtesting.RandomizedRunner$5.evaluate(RandomizedRunner.java:832)
	at com.carrotsearch.randomizedtesting.RandomizedRunner$6.evaluate(RandomizedRunner.java:883)
	at com.carrotsearch.randomizedtesting.RandomizedRunner$7.evaluate(RandomizedRunner.java:894)
	at com.carrotsearch.randomizedtesting.rules.StatementAdapter.evaluate(StatementAdapter.java:36)
	at com.carrotsearch.randomizedtesting.rules.SystemPropertiesRestoreRule$1.evaluate(SystemPropertiesRestoreRule.java:57)
	at org.apache.lucene.util.AbstractBeforeAfterRule$1.evaluate(AbstractBeforeAfterRule.java:45)
	at com.carrotsearch.randomizedtesting.rules.StatementAdapter.evaluate(StatementAdapter.java:36)
	at org.apache.lucene.util.TestRuleStoreClassName$1.evaluate(TestRuleStoreClassName.java:41)
	at com.carrotsearch.randomizedtesting.rules.NoShadowingOrOverridesOnMethodsRule$1.evaluate(NoShadowingOrOverridesOnMethodsRule.java:40)
	at com.carrotsearch.randomizedtesting.rules.NoShadowingOrOverridesOnMethodsRule$1.evaluate(NoShadowingOrOverridesOnMethodsRule.java:40)
	at com.carrotsearch.randomizedtesting.rules.StatementAdapter.evaluate(StatementAdapter.java:36)
	at com.carrotsearch.randomizedtesting.rules.StatementAdapter.evaluate(StatementAdapter.java:36)
	at org.apache.lucene.util.TestRuleAssertionsRequired$1.evaluate(TestRuleAssertionsRequired.java:53)
	at org.apache.lucene.util.TestRuleMarkFailure$1.evaluate(TestRuleMarkFailure.java:47)
	at org.apache.lucene.util.TestRuleIgnoreAfterMaxFailures$1.evaluate(TestRuleIgnoreAfterMaxFailures.java:64)
	at org.apache.lucene.util.TestRuleIgnoreTestSuites$1.evaluate(TestRuleIgnoreTestSuites.java:54)
	at com.carrotsearch.randomizedtesting.rules.StatementAdapter.evaluate(StatementAdapter.java:36)
	at com.carrotsearch.randomizedtesting.ThreadLeakControl$StatementRunner.run(ThreadLeakControl.java:368)
	at java.base/java.lang.Thread.run(Thread.java:834)


FAILED:  org.apache.solr.search.facet.TestCloudJSONFacetSKG.testBespoke

Error Message:
Error from server at http://127.0.0.1:45195/solr/org.apache.solr.search.facet.TestCloudJSONFacetSKG_collection: Error from server at null: Expected mime type application/octet-stream but got text/html. <html> <head> <meta http-equiv="Content-Type" content="text/html;charset=utf-8"/> <title>Error 500 Server Error</title> </head> <body><h2>HTTP ERROR 500</h2> <p>Problem accessing /solr/org.apache.solr.search.facet.TestCloudJSONFacetSKG_collection_shard2_replica_n2/select. Reason: <pre>    Server Error</pre></p><h3>Caused by:</h3><pre>java.lang.AssertionError  at java.base/java.util.HashMap$TreeNode.moveRootToFront(HashMap.java:1896)  at java.base/java.util.HashMap$TreeNode.putTreeVal(HashMap.java:2061)  at java.base/java.util.HashMap.putVal(HashMap.java:633)  at java.base/java.util.HashMap.put(HashMap.java:607)  at org.apache.solr.search.LRUCache.put(LRUCache.java:201)  at org.apache.solr.search.SolrIndexSearcher.getDocListC(SolrIndexSearcher.java:1449)  at org.apache.solr.search.SolrIndexSearcher.search(SolrIndexSearcher.java:568)  at org.apache.solr.handler.component.QueryComponent.doProcessUngroupedSearch(QueryComponent.java:1484)  at org.apache.solr.handler.component.QueryComponent.process(QueryComponent.java:398)  at org.apache.solr.handler.component.SearchHandler.handleRequestBody(SearchHandler.java:305)  at org.apache.solr.handler.RequestHandlerBase.handleRequest(RequestHandlerBase.java:199)  at org.apache.solr.core.SolrCore.execute(SolrCore.java:2581)  at org.apache.solr.servlet.HttpSolrCall.execute(HttpSolrCall.java:780)  at org.apache.solr.servlet.HttpSolrCall.call(HttpSolrCall.java:566)  at org.apache.solr.servlet.SolrDispatchFilter.doFilter(SolrDispatchFilter.java:423)  at org.apache.solr.servlet.SolrDispatchFilter.doFilter(SolrDispatchFilter.java:350)  at org.eclipse.jetty.servlet.ServletHandler$CachedChain.doFilter(ServletHandler.java:1610)  at org.apache.solr.client.solrj.embedded.JettySolrRunner$DebugFilter.doFilter(JettySolrRunner.java:165)  at org.eclipse.jetty.servlet.ServletHandler$CachedChain.doFilter(ServletHandler.java:1610)  at org.eclipse.jetty.servlet.ServletHandler.doHandle(ServletHandler.java:540)  at org.eclipse.jetty.server.handler.ScopedHandler.nextHandle(ScopedHandler.java:255)  at org.eclipse.jetty.server.session.SessionHandler.doHandle(SessionHandler.java:1711)  at org.eclipse.jetty.server.handler.ScopedHandler.nextHandle(ScopedHandler.java:255)  at org.eclipse.jetty.server.handler.ContextHandler.doHandle(ContextHandler.java:1347)  at org.eclipse.jetty.server.handler.ScopedHandler.nextScope(ScopedHandler.java:203)  at org.eclipse.jetty.servlet.ServletHandler.doScope(ServletHandler.java:480)  at org.eclipse.jetty.server.session.SessionHandler.doScope(SessionHandler.java:1678)  at org.eclipse.jetty.server.handler.ScopedHandler.nextScope(ScopedHandler.java:201)  at org.eclipse.jetty.server.handler.ContextHandler.doScope(ContextHandler.java:1249)  at org.eclipse.jetty.server.handler.ScopedHandler.handle(ScopedHandler.java:144)  at org.eclipse.jetty.server.handler.gzip.GzipHandler.handle(GzipHandler.java:703)  at org.eclipse.jetty.server.handler.HandlerWrapper.handle(HandlerWrapper.java:132)  at org.eclipse.jetty.server.Server.handle(Server.java:505)  at org.eclipse.jetty.server.HttpChannel.handle(HttpChannel.java:370)  at org.eclipse.jetty.server.HttpChannel.run(HttpChannel.java:311)  at org.eclipse.jetty.util.thread.QueuedThreadPool.runJob(QueuedThreadPool.java:781)  at org.eclipse.jetty.util.thread.QueuedThreadPool$Runner.run(QueuedThreadPool.java:917)  at java.base/java.lang.Thread.run(Thread.java:834) </pre> <hr><a href="http://eclipse.org/jetty">Powered by Jetty:// 9.4.19.v20190610</a><hr/>  </body> </html> 

Stack Trace:
org.apache.solr.client.solrj.impl.HttpSolrClient$RemoteSolrException: Error from server at http://127.0.0.1:45195/solr/org.apache.solr.search.facet.TestCloudJSONFacetSKG_collection: Error from server at null: Expected mime type application/octet-stream but got text/html. <html>
<head>
<meta http-equiv="Content-Type" content="text/html;charset=utf-8"/>
<title>Error 500 Server Error</title>
</head>
<body><h2>HTTP ERROR 500</h2>
<p>Problem accessing /solr/org.apache.solr.search.facet.TestCloudJSONFacetSKG_collection_shard2_replica_n2/select. Reason:
<pre>    Server Error</pre></p><h3>Caused by:</h3><pre>java.lang.AssertionError
	at java.base/java.util.HashMap$TreeNode.moveRootToFront(HashMap.java:1896)
	at java.base/java.util.HashMap$TreeNode.putTreeVal(HashMap.java:2061)
	at java.base/java.util.HashMap.putVal(HashMap.java:633)
	at java.base/java.util.HashMap.put(HashMap.java:607)
	at org.apache.solr.search.LRUCache.put(LRUCache.java:201)
	at org.apache.solr.search.SolrIndexSearcher.getDocListC(SolrIndexSearcher.java:1449)
	at org.apache.solr.search.SolrIndexSearcher.search(SolrIndexSearcher.java:568)
	at org.apache.solr.handler.component.QueryComponent.doProcessUngroupedSearch(QueryComponent.java:1484)
	at org.apache.solr.handler.component.QueryComponent.process(QueryComponent.java:398)
	at org.apache.solr.handler.component.SearchHandler.handleRequestBody(SearchHandler.java:305)
	at org.apache.solr.handler.RequestHandlerBase.handleRequest(RequestHandlerBase.java:199)
	at org.apache.solr.core.SolrCore.execute(SolrCore.java:2581)
	at org.apache.solr.servlet.HttpSolrCall.execute(HttpSolrCall.java:780)
	at org.apache.solr.servlet.HttpSolrCall.call(HttpSolrCall.java:566)
	at org.apache.solr.servlet.SolrDispatchFilter.doFilter(SolrDispatchFilter.java:423)
	at org.apache.solr.servlet.SolrDispatchFilter.doFilter(SolrDispatchFilter.java:350)
	at org.eclipse.jetty.servlet.ServletHandler$CachedChain.doFilter(ServletHandler.java:1610)
	at org.apache.solr.client.solrj.embedded.JettySolrRunner$DebugFilter.doFilter(JettySolrRunner.java:165)
	at org.eclipse.jetty.servlet.ServletHandler$CachedChain.doFilter(ServletHandler.java:1610)
	at org.eclipse.jetty.servlet.ServletHandler.doHandle(ServletHandler.java:540)
	at org.eclipse.jetty.server.handler.ScopedHandler.nextHandle(ScopedHandler.java:255)
	at org.eclipse.jetty.server.session.SessionHandler.doHandle(SessionHandler.java:1711)
	at org.eclipse.jetty.server.handler.ScopedHandler.nextHandle(ScopedHandler.java:255)
	at org.eclipse.jetty.server.handler.ContextHandler.doHandle(ContextHandler.java:1347)
	at org.eclipse.jetty.server.handler.ScopedHandler.nextScope(ScopedHandler.java:203)
	at org.eclipse.jetty.servlet.ServletHandler.doScope(ServletHandler.java:480)
	at org.eclipse.jetty.server.session.SessionHandler.doScope(SessionHandler.java:1678)
	at org.eclipse.jetty.server.handler.ScopedHandler.nextScope(ScopedHandler.java:201)
	at org.eclipse.jetty.server.handler.ContextHandler.doScope(ContextHandler.java:1249)
	at org.eclipse.jetty.server.handler.ScopedHandler.handle(ScopedHandler.java:144)
	at org.eclipse.jetty.server.handler.gzip.GzipHandler.handle(GzipHandler.java:703)
	at org.eclipse.jetty.server.handler.HandlerWrapper.handle(HandlerWrapper.java:132)
	at org.eclipse.jetty.server.Server.handle(Server.java:505)
	at org.eclipse.jetty.server.HttpChannel.handle(HttpChannel.java:370)
	at org.eclipse.jetty.server.HttpChannel.run(HttpChannel.java:311)
	at org.eclipse.jetty.util.thread.QueuedThreadPool.runJob(QueuedThreadPool.java:781)
	at org.eclipse.jetty.util.thread.QueuedThreadPool$Runner.run(QueuedThreadPool.java:917)
	at java.base/java.lang.Thread.run(Thread.java:834)
</pre>
<hr><a href="http://eclipse.org/jetty">Powered by Jetty:// 9.4.19.v20190610</a><hr/>

</body>
</html>

	at __randomizedtesting.SeedInfo.seed([200BDD0A84D4DD47:2BD059334C541AB0]:0)
	at org.apache.solr.client.solrj.impl.HttpSolrClient.executeMethod(HttpSolrClient.java:656)
	at org.apache.solr.client.solrj.impl.HttpSolrClient.request(HttpSolrClient.java:262)
	at org.apache.solr.client.solrj.impl.HttpSolrClient.request(HttpSolrClient.java:245)
	at org.apache.solr.client.solrj.SolrRequest.process(SolrRequest.java:211)
	at org.apache.solr.client.solrj.SolrClient.query(SolrClient.java:987)
	at org.apache.solr.client.solrj.SolrClient.query(SolrClient.java:1002)
	at org.apache.solr.search.facet.TestCloudJSONFacetSKG.getNumFound(TestCloudJSONFacetSKG.java:669)
	at org.apache.solr.search.facet.TestCloudJSONFacetSKG.verifySKGResults(TestCloudJSONFacetSKG.java:446)
	at org.apache.solr.search.facet.TestCloudJSONFacetSKG.assertFacetSKGsAreCorrect(TestCloudJSONFacetSKG.java:392)
	at org.apache.solr.search.facet.TestCloudJSONFacetSKG.assertFacetSKGsAreCorrect(TestCloudJSONFacetSKG.java:349)
	at org.apache.solr.search.facet.TestCloudJSONFacetSKG.testBespoke(TestCloudJSONFacetSKG.java:230)
	at java.base/jdk.internal.reflect.NativeMethodAccessorImpl.invoke0(Native Method)
	at java.base/jdk.internal.reflect.NativeMethodAccessorImpl.invoke(NativeMethodAccessorImpl.java:62)
	at java.base/jdk.internal.reflect.DelegatingMethodAccessorImpl.invoke(DelegatingMethodAccessorImpl.java:43)
	at java.base/java.lang.reflect.Method.invoke(Method.java:566)
	at com.carrotsearch.randomizedtesting.RandomizedRunner.invoke(RandomizedRunner.java:1750)
	at com.carrotsearch.randomizedtesting.RandomizedRunner$8.evaluate(RandomizedRunner.java:938)
	at com.carrotsearch.randomizedtesting.RandomizedRunner$9.evaluate(RandomizedRunner.java:974)
	at com.carrotsearch.randomizedtesting.RandomizedRunner$10.evaluate(RandomizedRunner.java:988)
	at com.carrotsearch.randomizedtesting.rules.SystemPropertiesRestoreRule$1.evaluate(SystemPropertiesRestoreRule.java:57)
	at org.apache.lucene.util.TestRuleSetupTeardownChained$1.evaluate(TestRuleSetupTeardownChained.java:49)
	at org.apache.lucene.util.AbstractBeforeAfterRule$1.evaluate(AbstractBeforeAfterRule.java:45)
	at org.apache.lucene.util.TestRuleThreadAndTestName$1.evaluate(TestRuleThreadAndTestName.java:48)
	at org.apache.lucene.util.TestRuleIgnoreAfterMaxFailures$1.evaluate(TestRuleIgnoreAfterMaxFailures.java:64)
	at org.apache.lucene.util.TestRuleMarkFailure$1.evaluate(TestRuleMarkFailure.java:47)
	at com.carrotsearch.randomizedtesting.rules.StatementAdapter.evaluate(StatementAdapter.java:36)
	at com.carrotsearch.randomizedtesting.ThreadLeakControl$StatementRunner.run(ThreadLeakControl.java:368)
	at com.carrotsearch.randomizedtesting.ThreadLeakControl.forkTimeoutingTask(ThreadLeakControl.java:817)
	at com.carrotsearch.randomizedtesting.ThreadLeakControl$3.evaluate(ThreadLeakControl.java:468)
	at com.carrotsearch.randomizedtesting.RandomizedRunner.runSingleTest(RandomizedRunner.java:947)
	at com.carrotsearch.randomizedtesting.RandomizedRunner$5.evaluate(RandomizedRunner.java:832)
	at com.carrotsearch.randomizedtesting.RandomizedRunner$6.evaluate(RandomizedRunner.java:883)
	at com.carrotsearch.randomizedtesting.RandomizedRunner$7.evaluate(RandomizedRunner.java:894)
	at com.carrotsearch.randomizedtesting.rules.StatementAdapter.evaluate(StatementAdapter.java:36)
	at com.carrotsearch.randomizedtesting.rules.SystemPropertiesRestoreRule$1.evaluate(SystemPropertiesRestoreRule.java:57)
	at org.apache.lucene.util.AbstractBeforeAfterRule$1.evaluate(AbstractBeforeAfterRule.java:45)
	at com.carrotsearch.randomizedtesting.rules.StatementAdapter.evaluate(StatementAdapter.java:36)
	at org.apache.lucene.util.TestRuleStoreClassName$1.evaluate(TestRuleStoreClassName.java:41)
	at com.carrotsearch.randomizedtesting.rules.NoShadowingOrOverridesOnMethodsRule$1.evaluate(NoShadowingOrOverridesOnMethodsRule.java:40)
	at com.carrotsearch.randomizedtesting.rules.NoShadowingOrOverridesOnMethodsRule$1.evaluate(NoShadowingOrOverridesOnMethodsRule.java:40)
	at com.carrotsearch.randomizedtesting.rules.StatementAdapter.evaluate(StatementAdapter.java:36)
	at com.carrotsearch.randomizedtesting.rules.StatementAdapter.evaluate(StatementAdapter.java:36)
	at org.apache.lucene.util.TestRuleAssertionsRequired$1.evaluate(TestRuleAssertionsRequired.java:53)
	at org.apache.lucene.util.TestRuleMarkFailure$1.evaluate(TestRuleMarkFailure.java:47)
	at org.apache.lucene.util.TestRuleIgnoreAfterMaxFailures$1.evaluate(TestRuleIgnoreAfterMaxFailures.java:64)
	at org.apache.lucene.util.TestRuleIgnoreTestSuites$1.evaluate(TestRuleIgnoreTestSuites.java:54)
	at com.carrotsearch.randomizedtesting.rules.StatementAdapter.evaluate(StatementAdapter.java:36)
	at com.carrotsearch.randomizedtesting.ThreadLeakControl$StatementRunner.run(ThreadLeakControl.java:368)
	at java.base/java.lang.Thread.run(Thread.java:834)


FAILED:  org.apache.solr.search.facet.TestCloudJSONFacetSKG.testRandom

Error Message:
Error from server at http://127.0.0.1:33851/solr/org.apache.solr.search.facet.TestCloudJSONFacetSKG_collection: Error from server at null: Expected mime type application/octet-stream but got text/html. <html> <head> <meta http-equiv="Content-Type" content="text/html;charset=utf-8"/> <title>Error 500 Server Error</title> </head> <body><h2>HTTP ERROR 500</h2> <p>Problem accessing /solr/org.apache.solr.search.facet.TestCloudJSONFacetSKG_collection_shard1_replica_n1/select. Reason: <pre>    Server Error</pre></p><h3>Caused by:</h3><pre>java.lang.AssertionError  at java.base/java.util.HashMap$TreeNode.moveRootToFront(HashMap.java:1896)  at java.base/java.util.HashMap$TreeNode.putTreeVal(HashMap.java:2061)  at java.base/java.util.HashMap.putVal(HashMap.java:633)  at java.base/java.util.HashMap.put(HashMap.java:607)  at org.apache.solr.search.LRUCache.put(LRUCache.java:201)  at org.apache.solr.search.SolrIndexSearcher.getDocListC(SolrIndexSearcher.java:1449)  at org.apache.solr.search.SolrIndexSearcher.search(SolrIndexSearcher.java:568)  at org.apache.solr.handler.component.QueryComponent.doProcessUngroupedSearch(QueryComponent.java:1484)  at org.apache.solr.handler.component.QueryComponent.process(QueryComponent.java:398)  at org.apache.solr.handler.component.SearchHandler.handleRequestBody(SearchHandler.java:305)  at org.apache.solr.handler.RequestHandlerBase.handleRequest(RequestHandlerBase.java:199)  at org.apache.solr.core.SolrCore.execute(SolrCore.java:2581)  at org.apache.solr.servlet.HttpSolrCall.execute(HttpSolrCall.java:780)  at org.apache.solr.servlet.HttpSolrCall.call(HttpSolrCall.java:566)  at org.apache.solr.servlet.SolrDispatchFilter.doFilter(SolrDispatchFilter.java:423)  at org.apache.solr.servlet.SolrDispatchFilter.doFilter(SolrDispatchFilter.java:350)  at org.eclipse.jetty.servlet.ServletHandler$CachedChain.doFilter(ServletHandler.java:1610)  at org.apache.solr.client.solrj.embedded.JettySolrRunner$DebugFilter.doFilter(JettySolrRunner.java:165)  at org.eclipse.jetty.servlet.ServletHandler$CachedChain.doFilter(ServletHandler.java:1610)  at org.eclipse.jetty.servlet.ServletHandler.doHandle(ServletHandler.java:540)  at org.eclipse.jetty.server.handler.ScopedHandler.nextHandle(ScopedHandler.java:255)  at org.eclipse.jetty.server.session.SessionHandler.doHandle(SessionHandler.java:1711)  at org.eclipse.jetty.server.handler.ScopedHandler.nextHandle(ScopedHandler.java:255)  at org.eclipse.jetty.server.handler.ContextHandler.doHandle(ContextHandler.java:1347)  at org.eclipse.jetty.server.handler.ScopedHandler.nextScope(ScopedHandler.java:203)  at org.eclipse.jetty.servlet.ServletHandler.doScope(ServletHandler.java:480)  at org.eclipse.jetty.server.session.SessionHandler.doScope(SessionHandler.java:1678)  at org.eclipse.jetty.server.handler.ScopedHandler.nextScope(ScopedHandler.java:201)  at org.eclipse.jetty.server.handler.ContextHandler.doScope(ContextHandler.java:1249)  at org.eclipse.jetty.server.handler.ScopedHandler.handle(ScopedHandler.java:144)  at org.eclipse.jetty.server.handler.gzip.GzipHandler.handle(GzipHandler.java:703)  at org.eclipse.jetty.server.handler.HandlerWrapper.handle(HandlerWrapper.java:132)  at org.eclipse.jetty.server.Server.handle(Server.java:505)  at org.eclipse.jetty.server.HttpChannel.handle(HttpChannel.java:370)  at org.eclipse.jetty.server.HttpChannel.run(HttpChannel.java:311)  at org.eclipse.jetty.util.thread.QueuedThreadPool.runJob(QueuedThreadPool.java:781)  at org.eclipse.jetty.util.thread.QueuedThreadPool$Runner.run(QueuedThreadPool.java:917)  at java.base/java.lang.Thread.run(Thread.java:834) </pre> <hr><a href="http://eclipse.org/jetty">Powered by Jetty:// 9.4.19.v20190610</a><hr/>  </body> </html> 

Stack Trace:
org.apache.solr.client.solrj.impl.HttpSolrClient$RemoteSolrException: Error from server at http://127.0.0.1:33851/solr/org.apache.solr.search.facet.TestCloudJSONFacetSKG_collection: Error from server at null: Expected mime type application/octet-stream but got text/html. <html>
<head>
<meta http-equiv="Content-Type" content="text/html;charset=utf-8"/>
<title>Error 500 Server Error</title>
</head>
<body><h2>HTTP ERROR 500</h2>
<p>Problem accessing /solr/org.apache.solr.search.facet.TestCloudJSONFacetSKG_collection_shard1_replica_n1/select. Reason:
<pre>    Server Error</pre></p><h3>Caused by:</h3><pre>java.lang.AssertionError
	at java.base/java.util.HashMap$TreeNode.moveRootToFront(HashMap.java:1896)
	at java.base/java.util.HashMap$TreeNode.putTreeVal(HashMap.java:2061)
	at java.base/java.util.HashMap.putVal(HashMap.java:633)
	at java.base/java.util.HashMap.put(HashMap.java:607)
	at org.apache.solr.search.LRUCache.put(LRUCache.java:201)
	at org.apache.solr.search.SolrIndexSearcher.getDocListC(SolrIndexSearcher.java:1449)
	at org.apache.solr.search.SolrIndexSearcher.search(SolrIndexSearcher.java:568)
	at org.apache.solr.handler.component.QueryComponent.doProcessUngroupedSearch(QueryComponent.java:1484)
	at org.apache.solr.handler.component.QueryComponent.process(QueryComponent.java:398)
	at org.apache.solr.handler.component.SearchHandler.handleRequestBody(SearchHandler.java:305)
	at org.apache.solr.handler.RequestHandlerBase.handleRequest(RequestHandlerBase.java:199)
	at org.apache.solr.core.SolrCore.execute(SolrCore.java:2581)
	at org.apache.solr.servlet.HttpSolrCall.execute(HttpSolrCall.java:780)
	at org.apache.solr.servlet.HttpSolrCall.call(HttpSolrCall.java:566)
	at org.apache.solr.servlet.SolrDispatchFilter.doFilter(SolrDispatchFilter.java:423)
	at org.apache.solr.servlet.SolrDispatchFilter.doFilter(SolrDispatchFilter.java:350)
	at org.eclipse.jetty.servlet.ServletHandler$CachedChain.doFilter(ServletHandler.java:1610)
	at org.apache.solr.client.solrj.embedded.JettySolrRunner$DebugFilter.doFilter(JettySolrRunner.java:165)
	at org.eclipse.jetty.servlet.ServletHandler$CachedChain.doFilter(ServletHandler.java:1610)
	at org.eclipse.jetty.servlet.ServletHandler.doHandle(ServletHandler.java:540)
	at org.eclipse.jetty.server.handler.ScopedHandler.nextHandle(ScopedHandler.java:255)
	at org.eclipse.jetty.server.session.SessionHandler.doHandle(SessionHandler.java:1711)
	at org.eclipse.jetty.server.handler.ScopedHandler.nextHandle(ScopedHandler.java:255)
	at org.eclipse.jetty.server.handler.ContextHandler.doHandle(ContextHandler.java:1347)
	at org.eclipse.jetty.server.handler.ScopedHandler.nextScope(ScopedHandler.java:203)
	at org.eclipse.jetty.servlet.ServletHandler.doScope(ServletHandler.java:480)
	at org.eclipse.jetty.server.session.SessionHandler.doScope(SessionHandler.java:1678)
	at org.eclipse.jetty.server.handler.ScopedHandler.nextScope(ScopedHandler.java:201)
	at org.eclipse.jetty.server.handler.ContextHandler.doScope(ContextHandler.java:1249)
	at org.eclipse.jetty.server.handler.ScopedHandler.handle(ScopedHandler.java:144)
	at org.eclipse.jetty.server.handler.gzip.GzipHandler.handle(GzipHandler.java:703)
	at org.eclipse.jetty.server.handler.HandlerWrapper.handle(HandlerWrapper.java:132)
	at org.eclipse.jetty.server.Server.handle(Server.java:505)
	at org.eclipse.jetty.server.HttpChannel.handle(HttpChannel.java:370)
	at org.eclipse.jetty.server.HttpChannel.run(HttpChannel.java:311)
	at org.eclipse.jetty.util.thread.QueuedThreadPool.runJob(QueuedThreadPool.java:781)
	at org.eclipse.jetty.util.thread.QueuedThreadPool$Runner.run(QueuedThreadPool.java:917)
	at java.base/java.lang.Thread.run(Thread.java:834)
</pre>
<hr><a href="http://eclipse.org/jetty">Powered by Jetty:// 9.4.19.v20190610</a><hr/>

</body>
</html>

	at __randomizedtesting.SeedInfo.seed([200BDD0A84D4DD47:5247F80535B46B34]:0)
	at org.apache.solr.client.solrj.impl.HttpSolrClient.executeMethod(HttpSolrClient.java:656)
	at org.apache.solr.client.solrj.impl.HttpSolrClient.request(HttpSolrClient.java:262)
	at org.apache.solr.client.solrj.impl.HttpSolrClient.request(HttpSolrClient.java:245)
	at org.apache.solr.client.solrj.SolrRequest.process(SolrRequest.java:211)
	at org.apache.solr.client.solrj.SolrClient.query(SolrClient.java:987)
	at org.apache.solr.client.solrj.SolrClient.query(SolrClient.java:1002)
	at org.apache.solr.search.facet.TestCloudJSONFacetSKG.getNumFound(TestCloudJSONFacetSKG.java:669)
	at org.apache.solr.search.facet.TestCloudJSONFacetSKG.verifySKGResults(TestCloudJSONFacetSKG.java:446)
	at org.apache.solr.search.facet.TestCloudJSONFacetSKG.assertFacetSKGsAreCorrect(TestCloudJSONFacetSKG.java:392)
	at org.apache.solr.search.facet.TestCloudJSONFacetSKG.assertFacetSKGsAreCorrect(TestCloudJSONFacetSKG.java:402)
	at org.apache.solr.search.facet.TestCloudJSONFacetSKG.assertFacetSKGsAreCorrect(TestCloudJSONFacetSKG.java:402)
	at org.apache.solr.search.facet.TestCloudJSONFacetSKG.assertFacetSKGsAreCorrect(TestCloudJSONFacetSKG.java:349)
	at org.apache.solr.search.facet.TestCloudJSONFacetSKG.testRandom(TestCloudJSONFacetSKG.java:274)
	at java.base/jdk.internal.reflect.NativeMethodAccessorImpl.invoke0(Native Method)
	at java.base/jdk.internal.reflect.NativeMethodAccessorImpl.invoke(NativeMethodAccessorImpl.java:62)
	at java.base/jdk.internal.reflect.DelegatingMethodAccessorImpl.invoke(DelegatingMethodAccessorImpl.java:43)
	at java.base/java.lang.reflect.Method.invoke(Method.java:566)
	at com.carrotsearch.randomizedtesting.RandomizedRunner.invoke(RandomizedRunner.java:1750)
	at com.carrotsearch.randomizedtesting.RandomizedRunner$8.evaluate(RandomizedRunner.java:938)
	at com.carrotsearch.randomizedtesting.RandomizedRunner$9.evaluate(RandomizedRunner.java:974)
	at com.carrotsearch.randomizedtesting.RandomizedRunner$10.evaluate(RandomizedRunner.java:988)
	at com.carrotsearch.randomizedtesting.rules.SystemPropertiesRestoreRule$1.evaluate(SystemPropertiesRestoreRule.java:57)
	at org.apache.lucene.util.TestRuleSetupTeardownChained$1.evaluate(TestRuleSetupTeardownChained.java:49)
	at org.apache.lucene.util.AbstractBeforeAfterRule$1.evaluate(AbstractBeforeAfterRule.java:45)
	at org.apache.lucene.util.TestRuleThreadAndTestName$1.evaluate(TestRuleThreadAndTestName.java:48)
	at org.apache.lucene.util.TestRuleIgnoreAfterMaxFailures$1.evaluate(TestRuleIgnoreAfterMaxFailures.java:64)
	at org.apache.lucene.util.TestRuleMarkFailure$1.evaluate(TestRuleMarkFailure.java:47)
	at com.carrotsearch.randomizedtesting.rules.StatementAdapter.evaluate(StatementAdapter.java:36)
	at com.carrotsearch.randomizedtesting.ThreadLeakControl$StatementRunner.run(ThreadLeakControl.java:368)
	at com.carrotsearch.randomizedtesting.ThreadLeakControl.forkTimeoutingTask(ThreadLeakControl.java:817)
	at com.carrotsearch.randomizedtesting.ThreadLeakControl$3.evaluate(ThreadLeakControl.java:468)
	at com.carrotsearch.randomizedtesting.RandomizedRunner.runSingleTest(RandomizedRunner.java:947)
	at com.carrotsearch.randomizedtesting.RandomizedRunner$5.evaluate(RandomizedRunner.java:832)
	at com.carrotsearch.randomizedtesting.RandomizedRunner$6.evaluate(RandomizedRunner.java:883)
	at com.carrotsearch.randomizedtesting.RandomizedRunner$7.evaluate(RandomizedRunner.java:894)
	at com.carrotsearch.randomizedtesting.rules.StatementAdapter.evaluate(StatementAdapter.java:36)
	at com.carrotsearch.randomizedtesting.rules.SystemPropertiesRestoreRule$1.evaluate(SystemPropertiesRestoreRule.java:57)
	at org.apache.lucene.util.AbstractBeforeAfterRule$1.evaluate(AbstractBeforeAfterRule.java:45)
	at com.carrotsearch.randomizedtesting.rules.StatementAdapter.evaluate(StatementAdapter.java:36)
	at org.apache.lucene.util.TestRuleStoreClassName$1.evaluate(TestRuleStoreClassName.java:41)
	at com.carrotsearch.randomizedtesting.rules.NoShadowingOrOverridesOnMethodsRule$1.evaluate(NoShadowingOrOverridesOnMethodsRule.java:40)
	at com.carrotsearch.randomizedtesting.rules.NoShadowingOrOverridesOnMethodsRule$1.evaluate(NoShadowingOrOverridesOnMethodsRule.java:40)
	at com.carrotsearch.randomizedtesting.rules.StatementAdapter.evaluate(StatementAdapter.java:36)
	at com.carrotsearch.randomizedtesting.rules.StatementAdapter.evaluate(StatementAdapter.java:36)
	at org.apache.lucene.util.TestRuleAssertionsRequired$1.evaluate(TestRuleAssertionsRequired.java:53)
	at org.apache.lucene.util.TestRuleMarkFailure$1.evaluate(TestRuleMarkFailure.java:47)
	at org.apache.lucene.util.TestRuleIgnoreAfterMaxFailures$1.evaluate(TestRuleIgnoreAfterMaxFailures.java:64)
	at org.apache.lucene.util.TestRuleIgnoreTestSuites$1.evaluate(TestRuleIgnoreTestSuites.java:54)
	at com.carrotsearch.randomizedtesting.rules.StatementAdapter.evaluate(StatementAdapter.java:36)
	at com.carrotsearch.randomizedtesting.ThreadLeakControl$StatementRunner.run(ThreadLeakControl.java:368)
	at java.base/java.lang.Thread.run(Thread.java:834)


FAILED:  org.apache.solr.search.facet.TestCloudJSONFacetSKG.testRandom

Error Message:
Error from server at http://127.0.0.1:46293/solr/org.apache.solr.search.facet.TestCloudJSONFacetSKG_collection: Error from server at null: Expected mime type application/octet-stream but got text/html. <html> <head> <meta http-equiv="Content-Type" content="text/html;charset=utf-8"/> <title>Error 500 Server Error</title> </head> <body><h2>HTTP ERROR 500</h2> <p>Problem accessing /solr/org.apache.solr.search.facet.TestCloudJSONFacetSKG_collection_shard2_replica_n2/select. Reason: <pre>    Server Error</pre></p><h3>Caused by:</h3><pre>java.lang.AssertionError  at java.base/java.util.HashMap$TreeNode.moveRootToFront(HashMap.java:1896)  at java.base/java.util.HashMap$TreeNode.putTreeVal(HashMap.java:2061)  at java.base/java.util.HashMap.putVal(HashMap.java:633)  at java.base/java.util.HashMap.put(HashMap.java:607)  at org.apache.solr.search.LRUCache.put(LRUCache.java:201)  at org.apache.solr.search.SolrIndexSearcher.getDocListC(SolrIndexSearcher.java:1449)  at org.apache.solr.search.SolrIndexSearcher.search(SolrIndexSearcher.java:568)  at org.apache.solr.handler.component.QueryComponent.doProcessUngroupedSearch(QueryComponent.java:1484)  at org.apache.solr.handler.component.QueryComponent.process(QueryComponent.java:398)  at org.apache.solr.handler.component.SearchHandler.handleRequestBody(SearchHandler.java:305)  at org.apache.solr.handler.RequestHandlerBase.handleRequest(RequestHandlerBase.java:199)  at org.apache.solr.core.SolrCore.execute(SolrCore.java:2581)  at org.apache.solr.servlet.HttpSolrCall.execute(HttpSolrCall.java:780)  at org.apache.solr.servlet.HttpSolrCall.call(HttpSolrCall.java:566)  at org.apache.solr.servlet.SolrDispatchFilter.doFilter(SolrDispatchFilter.java:423)  at org.apache.solr.servlet.SolrDispatchFilter.doFilter(SolrDispatchFilter.java:350)  at org.eclipse.jetty.servlet.ServletHandler$CachedChain.doFilter(ServletHandler.java:1610)  at org.apache.solr.client.solrj.embedded.JettySolrRunner$DebugFilter.doFilter(JettySolrRunner.java:165)  at org.eclipse.jetty.servlet.ServletHandler$CachedChain.doFilter(ServletHandler.java:1610)  at org.eclipse.jetty.servlet.ServletHandler.doHandle(ServletHandler.java:540)  at org.eclipse.jetty.server.handler.ScopedHandler.nextHandle(ScopedHandler.java:255)  at org.eclipse.jetty.server.session.SessionHandler.doHandle(SessionHandler.java:1711)  at org.eclipse.jetty.server.handler.ScopedHandler.nextHandle(ScopedHandler.java:255)  at org.eclipse.jetty.server.handler.ContextHandler.doHandle(ContextHandler.java:1347)  at org.eclipse.jetty.server.handler.ScopedHandler.nextScope(ScopedHandler.java:203)  at org.eclipse.jetty.servlet.ServletHandler.doScope(ServletHandler.java:480)  at org.eclipse.jetty.server.session.SessionHandler.doScope(SessionHandler.java:1678)  at org.eclipse.jetty.server.handler.ScopedHandler.nextScope(ScopedHandler.java:201)  at org.eclipse.jetty.server.handler.ContextHandler.doScope(ContextHandler.java:1249)  at org.eclipse.jetty.server.handler.ScopedHandler.handle(ScopedHandler.java:144)  at org.eclipse.jetty.server.handler.gzip.GzipHandler.handle(GzipHandler.java:703)  at org.eclipse.jetty.server.handler.HandlerWrapper.handle(HandlerWrapper.java:132)  at org.eclipse.jetty.server.Server.handle(Server.java:505)  at org.eclipse.jetty.server.HttpChannel.handle(HttpChannel.java:370)  at org.eclipse.jetty.server.HttpChannel.run(HttpChannel.java:311)  at org.eclipse.jetty.util.thread.QueuedThreadPool.runJob(QueuedThreadPool.java:781)  at org.eclipse.jetty.util.thread.QueuedThreadPool$Runner.run(QueuedThreadPool.java:917)  at java.base/java.lang.Thread.run(Thread.java:834) </pre> <hr><a href="http://eclipse.org/jetty">Powered by Jetty:// 9.4.19.v20190610</a><hr/>  </body> </html> 

Stack Trace:
org.apache.solr.client.solrj.impl.HttpSolrClient$RemoteSolrException: Error from server at http://127.0.0.1:46293/solr/org.apache.solr.search.facet.TestCloudJSONFacetSKG_collection: Error from server at null: Expected mime type application/octet-stream but got text/html. <html>
<head>
<meta http-equiv="Content-Type" content="text/html;charset=utf-8"/>
<title>Error 500 Server Error</title>
</head>
<body><h2>HTTP ERROR 500</h2>
<p>Problem accessing /solr/org.apache.solr.search.facet.TestCloudJSONFacetSKG_collection_shard2_replica_n2/select. Reason:
<pre>    Server Error</pre></p><h3>Caused by:</h3><pre>java.lang.AssertionError
	at java.base/java.util.HashMap$TreeNode.moveRootToFront(HashMap.java:1896)
	at java.base/java.util.HashMap$TreeNode.putTreeVal(HashMap.java:2061)
	at java.base/java.util.HashMap.putVal(HashMap.java:633)
	at java.base/java.util.HashMap.put(HashMap.java:607)
	at org.apache.solr.search.LRUCache.put(LRUCache.java:201)
	at org.apache.solr.search.SolrIndexSearcher.getDocListC(SolrIndexSearcher.java:1449)
	at org.apache.solr.search.SolrIndexSearcher.search(SolrIndexSearcher.java:568)
	at org.apache.solr.handler.component.QueryComponent.doProcessUngroupedSearch(QueryComponent.java:1484)
	at org.apache.solr.handler.component.QueryComponent.process(QueryComponent.java:398)
	at org.apache.solr.handler.component.SearchHandler.handleRequestBody(SearchHandler.java:305)
	at org.apache.solr.handler.RequestHandlerBase.handleRequest(RequestHandlerBase.java:199)
	at org.apache.solr.core.SolrCore.execute(SolrCore.java:2581)
	at org.apache.solr.servlet.HttpSolrCall.execute(HttpSolrCall.java:780)
	at org.apache.solr.servlet.HttpSolrCall.call(HttpSolrCall.java:566)
	at org.apache.solr.servlet.SolrDispatchFilter.doFilter(SolrDispatchFilter.java:423)
	at org.apache.solr.servlet.SolrDispatchFilter.doFilter(SolrDispatchFilter.java:350)
	at org.eclipse.jetty.servlet.ServletHandler$CachedChain.doFilter(ServletHandler.java:1610)
	at org.apache.solr.client.solrj.embedded.JettySolrRunner$DebugFilter.doFilter(JettySolrRunner.java:165)
	at org.eclipse.jetty.servlet.ServletHandler$CachedChain.doFilter(ServletHandler.java:1610)
	at org.eclipse.jetty.servlet.ServletHandler.doHandle(ServletHandler.java:540)
	at org.eclipse.jetty.server.handler.ScopedHandler.nextHandle(ScopedHandler.java:255)
	at org.eclipse.jetty.server.session.SessionHandler.doHandle(SessionHandler.java:1711)
	at org.eclipse.jetty.server.handler.ScopedHandler.nextHandle(ScopedHandler.java:255)
	at org.eclipse.jetty.server.handler.ContextHandler.doHandle(ContextHandler.java:1347)
	at org.eclipse.jetty.server.handler.ScopedHandler.nextScope(ScopedHandler.java:203)
	at org.eclipse.jetty.servlet.ServletHandler.doScope(ServletHandler.java:480)
	at org.eclipse.jetty.server.session.SessionHandler.doScope(SessionHandler.java:1678)
	at org.eclipse.jetty.server.handler.ScopedHandler.nextScope(ScopedHandler.java:201)
	at org.eclipse.jetty.server.handler.ContextHandler.doScope(ContextHandler.java:1249)
	at org.eclipse.jetty.server.handler.ScopedHandler.handle(ScopedHandler.java:144)
	at org.eclipse.jetty.server.handler.gzip.GzipHandler.handle(GzipHandler.java:703)
	at org.eclipse.jetty.server.handler.HandlerWrapper.handle(HandlerWrapper.java:132)
	at org.eclipse.jetty.server.Server.handle(Server.java:505)
	at org.eclipse.jetty.server.HttpChannel.handle(HttpChannel.java:370)
	at org.eclipse.jetty.server.HttpChannel.run(HttpChannel.java:311)
	at org.eclipse.jetty.util.thread.QueuedThreadPool.runJob(QueuedThreadPool.java:781)
	at org.eclipse.jetty.util.thread.QueuedThreadPool$Runner.run(QueuedThreadPool.java:917)
	at java.base/java.lang.Thread.run(Thread.java:834)
</pre>
<hr><a href="http://eclipse.org/jetty">Powered by Jetty:// 9.4.19.v20190610</a><hr/>

</body>
</html>

	at __randomizedtesting.SeedInfo.seed([200BDD0A84D4DD47:5247F80535B46B34]:0)
	at org.apache.solr.client.solrj.impl.HttpSolrClient.executeMethod(HttpSolrClient.java:656)
	at org.apache.solr.client.solrj.impl.HttpSolrClient.request(HttpSolrClient.java:262)
	at org.apache.solr.client.solrj.impl.HttpSolrClient.request(HttpSolrClient.java:245)
	at org.apache.solr.client.solrj.SolrRequest.process(SolrRequest.java:211)
	at org.apache.solr.client.solrj.SolrClient.query(SolrClient.java:987)
	at org.apache.solr.client.solrj.SolrClient.query(SolrClient.java:1002)
	at org.apache.solr.search.facet.TestCloudJSONFacetSKG.getNumFound(TestCloudJSONFacetSKG.java:669)
	at org.apache.solr.search.facet.TestCloudJSONFacetSKG.verifySKGResults(TestCloudJSONFacetSKG.java:446)
	at org.apache.solr.search.facet.TestCloudJSONFacetSKG.assertFacetSKGsAreCorrect(TestCloudJSONFacetSKG.java:392)
	at org.apache.solr.search.facet.TestCloudJSONFacetSKG.assertFacetSKGsAreCorrect(TestCloudJSONFacetSKG.java:402)
	at org.apache.solr.search.facet.TestCloudJSONFacetSKG.assertFacetSKGsAreCorrect(TestCloudJSONFacetSKG.java:402)
	at org.apache.solr.search.facet.TestCloudJSONFacetSKG.assertFacetSKGsAreCorrect(TestCloudJSONFacetSKG.java:349)
	at org.apache.solr.search.facet.TestCloudJSONFacetSKG.testRandom(TestCloudJSONFacetSKG.java:274)
	at java.base/jdk.internal.reflect.NativeMethodAccessorImpl.invoke0(Native Method)
	at java.base/jdk.internal.reflect.NativeMethodAccessorImpl.invoke(NativeMethodAccessorImpl.java:62)
	at java.base/jdk.internal.reflect.DelegatingMethodAccessorImpl.invoke(DelegatingMethodAccessorImpl.java:43)
	at java.base/java.lang.reflect.Method.invoke(Method.java:566)
	at com.carrotsearch.randomizedtesting.RandomizedRunner.invoke(RandomizedRunner.java:1750)
	at com.carrotsearch.randomizedtesting.RandomizedRunner$8.evaluate(RandomizedRunner.java:938)
	at com.carrotsearch.randomizedtesting.RandomizedRunner$9.evaluate(RandomizedRunner.java:974)
	at com.carrotsearch.randomizedtesting.RandomizedRunner$10.evaluate(RandomizedRunner.java:988)
	at com.carrotsearch.randomizedtesting.rules.SystemPropertiesRestoreRule$1.evaluate(SystemPropertiesRestoreRule.java:57)
	at org.apache.lucene.util.TestRuleSetupTeardownChained$1.evaluate(TestRuleSetupTeardownChained.java:49)
	at org.apache.lucene.util.AbstractBeforeAfterRule$1.evaluate(AbstractBeforeAfterRule.java:45)
	at org.apache.lucene.util.TestRuleThreadAndTestName$1.evaluate(TestRuleThreadAndTestName.java:48)
	at org.apache.lucene.util.TestRuleIgnoreAfterMaxFailures$1.evaluate(TestRuleIgnoreAfterMaxFailures.java:64)
	at org.apache.lucene.util.TestRuleMarkFailure$1.evaluate(TestRuleMarkFailure.java:47)
	at com.carrotsearch.randomizedtesting.rules.StatementAdapter.evaluate(StatementAdapter.java:36)
	at com.carrotsearch.randomizedtesting.ThreadLeakControl$StatementRunner.run(ThreadLeakControl.java:368)
	at com.carrotsearch.randomizedtesting.ThreadLeakControl.forkTimeoutingTask(ThreadLeakControl.java:817)
	at com.carrotsearch.randomizedtesting.ThreadLeakControl$3.evaluate(ThreadLeakControl.java:468)
	at com.carrotsearch.randomizedtesting.RandomizedRunner.runSingleTest(RandomizedRunner.java:947)
	at com.carrotsearch.randomizedtesting.RandomizedRunner$5.evaluate(RandomizedRunner.java:832)
	at com.carrotsearch.randomizedtesting.RandomizedRunner$6.evaluate(RandomizedRunner.java:883)
	at com.carrotsearch.randomizedtesting.RandomizedRunner$7.evaluate(RandomizedRunner.java:894)
	at com.carrotsearch.randomizedtesting.rules.StatementAdapter.evaluate(StatementAdapter.java:36)
	at com.carrotsearch.randomizedtesting.rules.SystemPropertiesRestoreRule$1.evaluate(SystemPropertiesRestoreRule.java:57)
	at org.apache.lucene.util.AbstractBeforeAfterRule$1.evaluate(AbstractBeforeAfterRule.java:45)
	at com.carrotsearch.randomizedtesting.rules.StatementAdapter.evaluate(StatementAdapter.java:36)
	at org.apache.lucene.util.TestRuleStoreClassName$1.evaluate(TestRuleStoreClassName.java:41)
	at com.carrotsearch.randomizedtesting.rules.NoShadowingOrOverridesOnMethodsRule$1.evaluate(NoShadowingOrOverridesOnMethodsRule.java:40)
	at com.carrotsearch.randomizedtesting.rules.NoShadowingOrOverridesOnMethodsRule$1.evaluate(NoShadowingOrOverridesOnMethodsRule.java:40)
	at com.carrotsearch.randomizedtesting.rules.StatementAdapter.evaluate(StatementAdapter.java:36)
	at com.carrotsearch.randomizedtesting.rules.StatementAdapter.evaluate(StatementAdapter.java:36)
	at org.apache.lucene.util.TestRuleAssertionsRequired$1.evaluate(TestRuleAssertionsRequired.java:53)
	at org.apache.lucene.util.TestRuleMarkFailure$1.evaluate(TestRuleMarkFailure.java:47)
	at org.apache.lucene.util.TestRuleIgnoreAfterMaxFailures$1.evaluate(TestRuleIgnoreAfterMaxFailures.java:64)
	at org.apache.lucene.util.TestRuleIgnoreTestSuites$1.evaluate(TestRuleIgnoreTestSuites.java:54)
	at com.carrotsearch.randomizedtesting.rules.StatementAdapter.evaluate(StatementAdapter.java:36)
	at com.carrotsearch.randomizedtesting.ThreadLeakControl$StatementRunner.run(ThreadLeakControl.java:368)
	at java.base/java.lang.Thread.run(Thread.java:834)




Build Log:
[...truncated 15422 lines...]
   [junit4] Suite: org.apache.solr.search.facet.TestCloudJSONFacetSKG
   [junit4]   2> Creating dataDir: /home/jenkins/workspace/Lucene-Solr-master-Linux/solr/build/solr-core/test/J2/temp/solr.search.facet.TestCloudJSONFacetSKG_200BDD0A84D4DD47-001/init-core-data-001
   [junit4]   2> 2375319 INFO  (SUITE-TestCloudJSONFacetSKG-seed#[200BDD0A84D4DD47]-worker) [     ] o.a.s.c.MiniSolrCloudCluster Starting cluster of 2 servers in /home/jenkins/workspace/Lucene-Solr-master-Linux/solr/build/solr-core/test/J2/temp/solr.search.facet.TestCloudJSONFacetSKG_200BDD0A84D4DD47-001/tempDir-001
   [junit4]   2> 2375320 INFO  (SUITE-TestCloudJSONFacetSKG-seed#[200BDD0A84D4DD47]-worker) [     ] o.a.s.c.ZkTestServer STARTING ZK TEST SERVER
   [junit4]   2> 2375320 INFO  (ZkTestServer Run Thread) [     ] o.a.s.c.ZkTestServer client port:0.0.0.0/0.0.0.0:0
   [junit4]   2> 2375320 INFO  (ZkTestServer Run Thread) [     ] o.a.s.c.ZkTestServer Starting server
   [junit4]   2> 2375420 INFO  (SUITE-TestCloudJSONFacetSKG-seed#[200BDD0A84D4DD47]-worker) [     ] o.a.s.c.ZkTestServer start zk server on port:40461
   [junit4]   2> 2375420 INFO  (SUITE-TestCloudJSONFacetSKG-seed#[200BDD0A84D4DD47]-worker) [     ] o.a.s.c.ZkTestServer parse host and port list: 127.0.0.1:40461
   [junit4]   2> 2375420 INFO  (SUITE-TestCloudJSONFacetSKG-seed#[200BDD0A84D4DD47]-worker) [     ] o.a.s.c.ZkTestServer connecting to 127.0.0.1 40461
   [junit4]   2> 2375421 INFO  (SUITE-TestCloudJSONFacetSKG-seed#[200BDD0A84D4DD47]-worker) [     ] o.a.s.c.c.ConnectionManager Waiting for client to connect to ZooKeeper
   [junit4]   2> 2375422 INFO  (zkConnectionManagerCallback-21061-thread-1) [     ] o.a.s.c.c.ConnectionManager zkClient has connected
   [junit4]   2> 2375422 INFO  (SUITE-TestCloudJSONFacetSKG-seed#[200BDD0A84D4DD47]-worker) [     ] o.a.s.c.c.ConnectionManager Client is connected to ZooKeeper
   [junit4]   2> 2375424 INFO  (SUITE-TestCloudJSONFacetSKG-seed#[200BDD0A84D4DD47]-worker) [     ] o.a.s.c.c.ConnectionManager Waiting for client to connect to ZooKeeper
   [junit4]   2> 2375434 INFO  (zkConnectionManagerCallback-21063-thread-1) [     ] o.a.s.c.c.ConnectionManager zkClient has connected
   [junit4]   2> 2375434 INFO  (SUITE-TestCloudJSONFacetSKG-seed#[200BDD0A84D4DD47]-worker) [     ] o.a.s.c.c.ConnectionManager Client is connected to ZooKeeper
   [junit4]   2> 2375435 INFO  (SUITE-TestCloudJSONFacetSKG-seed#[200BDD0A84D4DD47]-worker) [     ] o.a.s.c.c.ConnectionManager Waiting for client to connect to ZooKeeper
   [junit4]   2> 2375436 INFO  (zkConnectionManagerCallback-21065-thread-1) [     ] o.a.s.c.c.ConnectionManager zkClient has connected
   [junit4]   2> 2375436 INFO  (SUITE-TestCloudJSONFacetSKG-seed#[200BDD0A84D4DD47]-worker) [     ] o.a.s.c.c.ConnectionManager Client is connected to ZooKeeper
   [junit4]   2> 2375538 WARN  (jetty-launcher-21066-thread-1) [     ] o.e.j.s.AbstractConnector Ignoring deprecated socket close linger time
   [junit4]   2> 2375538 WARN  (jetty-launcher-21066-thread-2) [     ] o.e.j.s.AbstractConnector Ignoring deprecated socket close linger time
   [junit4]   2> 2375539 INFO  (jetty-launcher-21066-thread-1) [     ] o.a.s.c.s.e.JettySolrRunner Start Jetty (original configured port=0)
   [junit4]   2> 2375539 INFO  (jetty-launcher-21066-thread-2) [     ] o.a.s.c.s.e.JettySolrRunner Start Jetty (original configured port=0)
   [junit4]   2> 2375539 INFO  (jetty-launcher-21066-thread-1) [     ] o.a.s.c.s.e.JettySolrRunner Trying to start Jetty on port 0 try number 1 ...
   [junit4]   2> 2375539 INFO  (jetty-launcher-21066-thread-2) [     ] o.a.s.c.s.e.JettySolrRunner Trying to start Jetty on port 0 try number 1 ...
   [junit4]   2> 2375539 INFO  (jetty-launcher-21066-thread-1) [     ] o.e.j.s.Server jetty-9.4.19.v20190610; built: 2019-06-10T16:30:51.723Z; git: afcf563148970e98786327af5e07c261fda175d3; jvm 11.0.3+7
   [junit4]   2> 2375539 INFO  (jetty-launcher-21066-thread-2) [     ] o.e.j.s.Server jetty-9.4.19.v20190610; built: 2019-06-10T16:30:51.723Z; git: afcf563148970e98786327af5e07c261fda175d3; jvm 11.0.3+7
   [junit4]   2> 2375544 INFO  (jetty-launcher-21066-thread-2) [     ] o.e.j.s.session DefaultSessionIdManager workerName=node0
   [junit4]   2> 2375544 INFO  (jetty-launcher-21066-thread-2) [     ] o.e.j.s.session No SessionScavenger set, using defaults
   [junit4]   2> 2375544 INFO  (jetty-launcher-21066-thread-1) [     ] o.e.j.s.session DefaultSessionIdManager workerName=node0
   [junit4]   2> 2375544 INFO  (jetty-launcher-21066-thread-1) [     ] o.e.j.s.session No SessionScavenger set, using defaults
   [junit4]   2> 2375544 INFO  (jetty-launcher-21066-thread-1) [     ] o.e.j.s.session node0 Scavenging every 660000ms
   [junit4]   2> 2375544 INFO  (jetty-launcher-21066-thread-2) [     ] o.e.j.s.session node0 Scavenging every 660000ms
   [junit4]   2> 2375544 INFO  (jetty-launcher-21066-thread-1) [     ] o.e.j.s.h.ContextHandler Started o.e.j.s.ServletContextHandler@5ae5cec5{/solr,null,AVAILABLE}
   [junit4]   2> 2375544 INFO  (jetty-launcher-21066-thread-2) [     ] o.e.j.s.h.ContextHandler Started o.e.j.s.ServletContextHandler@9e5f4e2{/solr,null,AVAILABLE}
   [junit4]   2> 2375544 INFO  (jetty-launcher-21066-thread-2) [     ] o.e.j.s.AbstractConnector Started ServerConnector@1e3478a2{HTTP/1.1,[http/1.1, h2c]}{127.0.0.1:46293}
   [junit4]   2> 2375544 INFO  (jetty-launcher-21066-thread-2) [     ] o.e.j.s.Server Started @2375591ms
   [junit4]   2> 2375544 INFO  (jetty-launcher-21066-thread-1) [     ] o.e.j.s.AbstractConnector Started ServerConnector@70c319b7{HTTP/1.1,[http/1.1, h2c]}{127.0.0.1:36385}
   [junit4]   2> 2375544 INFO  (jetty-launcher-21066-thread-1) [     ] o.e.j.s.Server Started @2375591ms
   [junit4]   2> 2375544 INFO  (jetty-launcher-21066-thread-2) [     ] o.a.s.c.s.e.JettySolrRunner Jetty properties: {hostContext=/solr, hostPort=46293}
   [junit4]   2> 2375544 INFO  (jetty-launcher-21066-thread-1) [     ] o.a.s.c.s.e.JettySolrRunner Jetty properties: {hostContext=/solr, hostPort=36385}
   [junit4]   2> 2375545 ERROR (jetty-launcher-21066-thread-1) [     ] o.a.s.u.StartupLoggingUtils Missing Java Option solr.log.dir. Logging may be missing or incomplete.
   [junit4]   2> 2375545 ERROR (jetty-launcher-21066-thread-2) [     ] o.a.s.u.StartupLoggingUtils Missing Java Option solr.log.dir. Logging may be missing or incomplete.
   [junit4]   2> 2375545 INFO  (jetty-launcher-21066-thread-2) [     ] o.a.s.s.SolrDispatchFilter Using logger factory org.apache.logging.slf4j.Log4jLoggerFactory
   [junit4]   2> 2375545 INFO  (jetty-launcher-21066-thread-1) [     ] o.a.s.s.SolrDispatchFilter Using logger factory org.apache.logging.slf4j.Log4jLoggerFactory
   [junit4]   2> 2375545 INFO  (jetty-launcher-21066-thread-2) [     ] o.a.s.s.SolrDispatchFilter  ___      _       Welcome to Apache Solr? version 9.0.0
   [junit4]   2> 2375545 INFO  (jetty-launcher-21066-thread-1) [     ] o.a.s.s.SolrDispatchFilter  ___      _       Welcome to Apache Solr? version 9.0.0
   [junit4]   2> 2375545 INFO  (jetty-launcher-21066-thread-2) [     ] o.a.s.s.SolrDispatchFilter / __| ___| |_ _   Starting in cloud mode on port null
   [junit4]   2> 2375545 INFO  (jetty-launcher-21066-thread-1) [     ] o.a.s.s.SolrDispatchFilter / __| ___| |_ _   Starting in cloud mode on port null
   [junit4]   2> 2375545 INFO  (jetty-launcher-21066-thread-2) [     ] o.a.s.s.SolrDispatchFilter \__ \/ _ \ | '_|  Install dir: null
   [junit4]   2> 2375545 INFO  (jetty-launcher-21066-thread-1) [     ] o.a.s.s.SolrDispatchFilter \__ \/ _ \ | '_|  Install dir: null
   [junit4]   2> 2375545 INFO  (jetty-launcher-21066-thread-1) [     ] o.a.s.s.SolrDispatchFilter |___/\___/_|_|    Start time: 2019-07-26T00:51:47.065256Z
   [junit4]   2> 2375545 INFO  (jetty-launcher-21066-thread-2) [     ] o.a.s.s.SolrDispatchFilter |___/\___/_|_|    Start time: 2019-07-26T00:51:47.065256Z
   [junit4]   2> 2375551 INFO  (jetty-launcher-21066-thread-2) [     ] o.a.s.c.c.ConnectionManager Waiting for client to connect to ZooKeeper
   [junit4]   2> 2375551 INFO  (jetty-launcher-21066-thread-1) [     ] o.a.s.c.c.ConnectionManager Waiting for client to connect to ZooKeeper
   [junit4]   2> 2375551 INFO  (zkConnectionManagerCallback-21069-thread-1) [     ] o.a.s.c.c.ConnectionManager zkClient has connected
   [junit4]   2> 2375551 INFO  (jetty-launcher-21066-thread-2) [     ] o.a.s.c.c.ConnectionManager Client is connected to ZooKeeper
   [junit4]   2> 2375551 INFO  (zkConnectionManagerCallback-21070-thread-1) [     ] o.a.s.c.c.ConnectionManager zkClient has connected
   [junit4]   2> 2375551 INFO  (jetty-launcher-21066-thread-1) [     ] o.a.s.c.c.ConnectionManager Client is connected to ZooKeeper
   [junit4]   2> 2375552 INFO  (jetty-launcher-21066-thread-2) [     ] o.a.s.s.SolrDispatchFilter solr.xml found in ZooKeeper. Loading...
   [junit4]   2> 2375552 INFO  (jetty-launcher-21066-thread-1) [     ] o.a.s.s.SolrDispatchFilter solr.xml found in ZooKeeper. Loading...
   [junit4]   2> 2375751 INFO  (jetty-launcher-21066-thread-1) [     ] o.a.s.h.c.HttpShardHandlerFactory Host whitelist initialized: WhitelistHostChecker [whitelistHosts=null, whitelistHostCheckingEnabled=true]
   [junit4]   2> 2375751 WARN  (jetty-launcher-21066-thread-1) [     ] o.e.j.u.s.S.config Trusting all certificates configured for Client@2f1f9504[provider=null,keyStore=null,trustStore=null]
   [junit4]   2> 2375751 WARN  (jetty-launcher-21066-thread-1) [     ] o.e.j.u.s.S.config No Client EndPointIdentificationAlgorithm configured for Client@2f1f9504[provider=null,keyStore=null,trustStore=null]
   [junit4]   2> 2375753 WARN  (jetty-launcher-21066-thread-1) [     ] o.e.j.u.s.S.config Trusting all certificates configured for Client@5c3db0a2[provider=null,keyStore=null,trustStore=null]
   [junit4]   2> 2375753 WARN  (jetty-launcher-21066-thread-1) [     ] o.e.j.u.s.S.config No Client EndPointIdentificationAlgorithm configured for Client@5c3db0a2[provider=null,keyStore=null,trustStore=null]
   [junit4]   2> 2375754 INFO  (jetty-launcher-21066-thread-1) [     ] o.a.s.c.ZkContainer Zookeeper client=127.0.0.1:40461/solr
   [junit4]   2> 2375755 INFO  (jetty-launcher-21066-thread-1) [     ] o.a.s.c.c.ConnectionManager Waiting for client to connect to ZooKeeper
   [junit4]   2> 2375756 INFO  (zkConnectionManagerCallback-21077-thread-1) [     ] o.a.s.c.c.ConnectionManager zkClient has connected
   [junit4]   2> 2375756 INFO  (jetty-launcher-21066-thread-1) [     ] o.a.s.c.c.ConnectionManager Client is connected to ZooKeeper
   [junit4]   2> 2375824 INFO  (jetty-launcher-21066-thread-2) [     ] o.a.s.h.c.HttpShardHandlerFactory Host whitelist initialized: WhitelistHostChecker [whitelistHosts=null, whitelistHostCheckingEnabled=true]
   [junit4]   2> 2375824 WARN  (jetty-launcher-21066-thread-2) [     ] o.e.j.u.s.S.config Trusting all certificates configured for Client@570b6df[provider=null,keyStore=null,trustStore=null]
   [junit4]   2> 2375824 WARN  (jetty-launcher-21066-thread-2) [     ] o.e.j.u.s.S.config No Client EndPointIdentificationAlgorithm configured for Client@570b6df[provider=null,keyStore=null,trustStore=null]
   [junit4]   2> 2375826 WARN  (jetty-launcher-21066-thread-2) [     ] o.e.j.u.s.S.config Trusting all certificates configured for Client@6baf49dd[provider=null,keyStore=null,trustStore=null]
   [junit4]   2> 2375826 WARN  (jetty-launcher-21066-thread-2) [     ] o.e.j.u.s.S.config No Client EndPointIdentificationAlgorithm configured for Client@6baf49dd[provider=null,keyStore=null,trustStore=null]
   [junit4]   2> 2375827 INFO  (jetty-launcher-21066-thread-2) [     ] o.a.s.c.ZkContainer Zookeeper client=127.0.0.1:40461/solr
   [junit4]   2> 2375827 INFO  (jetty-launcher-21066-thread-2) [     ] o.a.s.c.c.ConnectionManager Waiting for client to connect to ZooKeeper
   [junit4]   2> 2375828 INFO  (zkConnectionManagerCallback-21084-thread-1) [     ] o.a.s.c.c.ConnectionManager zkClient has connected
   [junit4]   2> 2375828 INFO  (jetty-launcher-21066-thread-2) [     ] o.a.s.c.c.ConnectionManager Client is connected to ZooKeeper
   [junit4]   2> 2375857 INFO  (jetty-launcher-21066-thread-1) [n:127.0.0.1:36385_solr     ] o.a.s.c.c.ConnectionManager Waiting for client to connect to ZooKeeper
   [junit4]   2> 2375858 INFO  (zkConnectionManagerCallback-21086-thread-1) [     ] o.a.s.c.c.ConnectionManager zkClient has connected
   [junit4]   2> 2375858 INFO  (jetty-launcher-21066-thread-1) [n:127.0.0.1:36385_solr     ] o.a.s.c.c.ConnectionManager Client is connected to ZooKeeper
   [junit4]   2> 2375904 INFO  (jetty-launcher-21066-thread-1) [n:127.0.0.1:36385_solr     ] o.a.s.c.OverseerElectionContext I am going to be the leader 127.0.0.1:36385_solr
   [junit4]   2> 2375905 INFO  (jetty-launcher-21066-thread-1) [n:127.0.0.1:36385_solr     ] o.a.s.c.Overseer Overseer (id=72063537243684871-127.0.0.1:36385_solr-n_0000000000) starting
   [junit4]   2> 2375907 INFO  (jetty-launcher-21066-thread-1) [n:127.0.0.1:36385_solr     ] o.a.s.c.c.ConnectionManager Waiting for client to connect to ZooKeeper
   [junit4]   2> 2375908 INFO  (zkConnectionManagerCallback-21093-thread-1) [     ] o.a.s.c.c.ConnectionManager zkClient has connected
   [junit4]   2> 2375908 INFO  (jetty-launcher-21066-thread-1) [n:127.0.0.1:36385_solr     ] o.a.s.c.c.ConnectionManager Client is connected to ZooKeeper
   [junit4]   2> 2375909 INFO  (jetty-launcher-21066-thread-1) [n:127.0.0.1:36385_solr     ] o.a.s.c.s.i.ZkClientClusterStateProvider Cluster at 127.0.0.1:40461/solr ready
   [junit4]   2> 2375909 INFO  (OverseerStateUpdate-72063537243684871-127.0.0.1:36385_solr-n_0000000000) [n:127.0.0.1:36385_solr     ] o.a.s.c.Overseer Starting to work on the main queue : 127.0.0.1:36385_solr
   [junit4]   2> 2375909 INFO  (jetty-launcher-21066-thread-1) [n:127.0.0.1:36385_solr     ] o.a.s.c.ZkController Register node as live in ZooKeeper:/live_nodes/127.0.0.1:36385_solr
   [junit4]   2> 2375910 INFO  (zkCallback-21085-thread-1) [     ] o.a.s.c.c.ZkStateReader Updated live nodes from ZooKeeper... (0) -> (1)
   [junit4]   2> 2375910 INFO  (zkCallback-21092-thread-1) [     ] o.a.s.c.c.ZkStateReader Updated live nodes from ZooKeeper... (0) -> (1)
   [junit4]   2> 2375911 INFO  (jetty-launcher-21066-thread-1) [n:127.0.0.1:36385_solr     ] o.a.s.c.LibListener clusterprops.json changed , version -1
   [junit4]   2> 2375921 INFO  (jetty-launcher-21066-thread-1) [n:127.0.0.1:36385_solr     ] o.a.s.h.a.MetricsHistoryHandler No .system collection, keeping metrics history in memory.
   [junit4]   2> 2375934 INFO  (jetty-launcher-21066-thread-1) [n:127.0.0.1:36385_solr     ] o.a.s.m.r.SolrJmxReporter JMX monitoring for 'solr_36385.solr.node' (registry 'solr.node') enabled at server: com.sun.jmx.mbeanserver.JmxMBeanServer@1dcbdae1
   [junit4]   2> 2375940 INFO  (jetty-launcher-21066-thread-1) [n:127.0.0.1:36385_solr     ] o.a.s.m.r.SolrJmxReporter JMX monitoring for 'solr_36385.solr.jvm' (registry 'solr.jvm') enabled at server: com.sun.jmx.mbeanserver.JmxMBeanServer@1dcbdae1
   [junit4]   2> 2375940 INFO  (jetty-launcher-21066-thread-1) [n:127.0.0.1:36385_solr     ] o.a.s.m.r.SolrJmxReporter JMX monitoring for 'solr_36385.solr.jetty' (registry 'solr.jetty') enabled at server: com.sun.jmx.mbeanserver.JmxMBeanServer@1dcbdae1
   [junit4]   2> 2375941 INFO  (jetty-launcher-21066-thread-1) [n:127.0.0.1:36385_solr     ] o.a.s.c.CorePropertiesLocator Found 0 core definitions underneath /home/jenkins/workspace/Lucene-Solr-master-Linux/solr/build/solr-core/test/J2/temp/solr.search.facet.TestCloudJSONFacetSKG_200BDD0A84D4DD47-001/tempDir-001/node1/.
   [junit4]   2> 2375957 INFO  (jetty-launcher-21066-thread-2) [n:127.0.0.1:46293_solr     ] o.a.s.c.c.ConnectionManager Waiting for client to connect to ZooKeeper
   [junit4]   2> 2375958 INFO  (zkConnectionManagerCallback-21096-thread-1) [     ] o.a.s.c.c.ConnectionManager zkClient has connected
   [junit4]   2> 2375958 INFO  (jetty-launcher-21066-thread-2) [n:127.0.0.1:46293_solr     ] o.a.s.c.c.ConnectionManager Client is connected to ZooKeeper
   [junit4]   2> 2375961 INFO  (jetty-launcher-21066-thread-2) [n:127.0.0.1:46293_solr     ] o.a.s.c.c.ZkStateReader Updated live nodes from ZooKeeper... (0) -> (1)
   [junit4]   2> 2375962 INFO  (jetty-launcher-21066-thread-2) [n:127.0.0.1:46293_solr     ] o.a.s.c.ZkController Publish node=127.0.0.1:46293_solr as DOWN
   [junit4]   2> 2375963 INFO  (jetty-launcher-21066-thread-2) [n:127.0.0.1:46293_solr     ] o.a.s.c.TransientSolrCoreCacheDefault Allocating transient cache for 2147483647 transient cores
   [junit4]   2> 2375963 INFO  (jetty-launcher-21066-thread-2) [n:127.0.0.1:46293_solr     ] o.a.s.c.ZkController Register node as live in ZooKeeper:/live_nodes/127.0.0.1:46293_solr
   [junit4]   2> 2375963 INFO  (zkCallback-21085-thread-1) [     ] o.a.s.c.c.ZkStateReader Updated live nodes from ZooKeeper... (1) -> (2)
   [junit4]   2> 2375963 INFO  (zkCallback-21092-thread-1) [     ] o.a.s.c.c.ZkStateReader Updated live nodes from ZooKeeper... (1) -> (2)
   [junit4]   2> 2375963 INFO  (zkCallback-21095-thread-1) [     ] o.a.s.c.c.ZkStateReader Updated live nodes from ZooKeeper... (1) -> (2)
   [junit4]   2> 2375964 INFO  (jetty-launcher-21066-thread-2) [n:127.0.0.1:46293_solr     ] o.a.s.c.c.ConnectionManager Waiting for client to connect to ZooKeeper
   [junit4]   2> 2375967 INFO  (zkConnectionManagerCallback-21103-thread-1) [     ] o.a.s.c.c.ConnectionManager zkClient has connected
   [junit4]   2> 2375967 INFO  (jetty-launcher-21066-thread-2) [n:127.0.0.1:46293_solr     ] o.a.s.c.c.ConnectionManager Client is connected to ZooKeeper
   [junit4]   2> 2375968 INFO  (jetty-launcher-21066-thread-2) [n:127.0.0.1:46293_solr     ] o.a.s.c.c.ZkStateReader Updated live nodes from ZooKeeper... (0) -> (2)
   [junit4]   2> 2375968 INFO  (jetty-launcher-21066-thread-2) [n:127.0.0.1:46293_solr     ] o.a.s.c.s.i.ZkClientClusterStateProvider Cluster at 127.0.0.1:40461/solr ready
   [junit4]   2> 2375968 INFO  (jetty-launcher-21066-thread-2) [n:127.0.0.1:46293_solr     ] o.a.s.c.LibListener clusterprops.json changed , version -1
   [junit4]   2> 2375979 INFO  (jetty-launcher-21066-thread-2) [n:127.0.0.1:46293_solr     ] o.a.s.h.a.MetricsHistoryHandler No .system collection, keeping metrics history in memory.
   [junit4]   2> 2375989 INFO  (jetty-launcher-21066-thread-2) [n:127.0.0.1:46293_solr     ] o.a.s.m.r.SolrJmxReporter JMX monitoring for 'solr_46293.solr.node' (registry 'solr.node') enabled at server: com.sun.jmx.mbeanserver.JmxMBeanServer@1dcbdae1
   [junit4]   2> 2375996 INFO  (jetty-launcher-21066-thread-2) [n:127.0.0.1:46293_solr     ] o.a.s.m.r.SolrJmxReporter JMX monitoring for 'solr_46293.solr.jvm' (registry 'solr.jvm') enabled at server: com.sun.jmx.mbeanserver.JmxMBeanServer@1dcbdae1
   [junit4]   2> 2375996 INFO  (jetty-launcher-21066-thread-2) [n:127.0.0.1:46293_solr     ] o.a.s.m.r.SolrJmxReporter JMX monitoring for 'solr_46293.solr.jetty' (registry 'solr.jetty') enabled at server: com.sun.jmx.mbeanserver.JmxMBeanServer@1dcbdae1
   [junit4]   2> 2375997 INFO  (jetty-launcher-21066-thread-2) [n:127.0.0.1:46293_solr     ] o.a.s.c.CorePropertiesLocator Found 0 core definitions underneath /home/jenkins/workspace/Lucene-Solr-master-Linux/solr/build/solr-core/test/J2/temp/solr.search.facet.TestCloudJSONFacetSKG_200BDD0A84D4DD47-001/tempDir-001/node2/.
   [junit4]   2> 2376019 INFO  (SUITE-TestCloudJSONFacetSKG-seed#[200BDD0A84D4DD47]-worker) [     ] o.a.s.c.c.ConnectionManager Waiting for client to connect to ZooKeeper
   [junit4]   2> 2376019 INFO  (zkConnectionManagerCallback-21109-thread-1) [     ] o.a.s.c.c.ConnectionManager zkClient has connected
   [junit4]   2> 2376019 INFO  (SUITE-TestCloudJSONFacetSKG-seed#[200BDD0A84D4DD47]-worker) [     ] o.a.s.c.c.ConnectionManager Client is connected to ZooKeeper
   [junit4]   2> 2376020 INFO  (SUITE-TestCloudJSONFacetSKG-seed#[200BDD0A84D4DD47]-worker) [     ] o.a.s.c.c.ZkStateReader Updated live nodes from ZooKeeper... (0) -> (2)
   [junit4]   2> 2376021 INFO  (SUITE-TestCloudJSONFacetSKG-seed#[200BDD0A84D4DD47]-worker) [     ] o.a.s.c.s.i.ZkClientClusterStateProvider Cluster at 127.0.0.1:40461/solr ready
   [junit4]   2> 2376329 INFO  (qtp2114254855-54069) [n:127.0.0.1:36385_solr     ] o.a.s.h.a.CollectionsHandler Invoked Collection Action :create with params property.schema=schema_latest.xml&property.config=solrconfig-tlog.xml&collection.configName=org.apache.solr.search.facet.TestCloudJSONFacetSKG_config-set&name=org.apache.solr.search.facet.TestCloudJSONFacetSKG_collection&nrtReplicas=1&action=CREATE&numShards=2&wt=javabin&version=2 and sendToOCPQueue=true
   [junit4]   2> 2376331 INFO  (OverseerThreadFactory-14095-thread-1-processing-n:127.0.0.1:36385_solr) [n:127.0.0.1:36385_solr     ] o.a.s.c.a.c.CreateCollectionCmd Create collection org.apache.solr.search.facet.TestCloudJSONFacetSKG_collection
   [junit4]   2> 2376434 INFO  (OverseerStateUpdate-72063537243684871-127.0.0.1:36385_solr-n_0000000000) [n:127.0.0.1:36385_solr     ] o.a.s.c.o.SliceMutator createReplica() {
   [junit4]   2>   "operation":"ADDREPLICA",
   [junit4]   2>   "collection":"org.apache.solr.search.facet.TestCloudJSONFacetSKG_collection",
   [junit4]   2>   "shard":"shard1",
   [junit4]   2>   "core":"org.apache.solr.search.facet.TestCloudJSONFacetSKG_collection_shard1_replica_n1",
   [junit4]   2>   "state":"down",
   [junit4]   2>   "base_url":"http://127.0.0.1:46293/solr",
   [junit4]   2>   "type":"NRT",
   [junit4]   2>   "waitForFinalState":"false"} 
   [junit4]   2> 2376435 INFO  (OverseerStateUpdate-72063537243684871-127.0.0.1:36385_solr-n_0000000000) [n:127.0.0.1:36385_solr     ] o.a.s.c.o.SliceMutator createReplica() {
   [junit4]   2>   "operation":"ADDREPLICA",
   [junit4]   2>   "collection":"org.apache.solr.search.facet.TestCloudJSONFacetSKG_collection",
   [junit4]   2>   "shard":"shard2",
   [junit4]   2>   "core":"org.apache.solr.search.facet.TestCloudJSONFacetSKG_collection_shard2_replica_n2",
   [junit4]   2>   "state":"down",
   [junit4]   2>   "base_url":"http://127.0.0.1:36385/solr",
   [junit4]   2>   "type":"NRT",
   [junit4]   2>   "waitForFinalState":"false"} 
   [junit4]   2> 2376664 INFO  (qtp2114254855-54067) [n:127.0.0.1:36385_solr    x:org.apache.solr.search.facet.TestCloudJSONFacetSKG_collection_shard2_replica_n2 ] o.a.s.h.a.CoreAdminOperation core create command qt=/admin/cores&collection.configName=org.apache.solr.search.facet.TestCloudJSONFacetSKG_config-set&newCollection=true&collection=org.apache.solr.search.facet.TestCloudJSONFacetSKG_collection&version=2&replicaType=NRT&property.schema=schema_latest.xml&property.config=solrconfig-tlog.xml&coreNodeName=core_node4&name=org.apache.solr.search.facet.TestCloudJSONFacetSKG_collection_shard2_replica_n2&action=CREATE&numShards=2&shard=shard2&wt=javabin
   [junit4]   2> 2376665 INFO  (qtp2114254855-54067) [n:127.0.0.1:36385_solr    x:org.apache.solr.search.facet.TestCloudJSONFacetSKG_collection_shard2_replica_n2 ] o.a.s.c.TransientSolrCoreCacheDefault Allocating transient cache for 2147483647 transient cores
   [junit4]   2> 2376667 INFO  (qtp284394700-54068) [n:127.0.0.1:46293_solr    x:org.apache.solr.search.facet.TestCloudJSONFacetSKG_collection_shard1_replica_n1 ] o.a.s.h.a.CoreAdminOperation core create command qt=/admin/cores&collection.configName=org.apache.solr.search.facet.TestCloudJSONFacetSKG_config-set&newCollection=true&collection=org.apache.solr.search.facet.TestCloudJSONFacetSKG_collection&version=2&replicaType=NRT&property.schema=schema_latest.xml&property.config=solrconfig-tlog.xml&coreNodeName=core_node3&name=org.apache.solr.search.facet.TestCloudJSONFacetSKG_collection_shard1_replica_n1&action=CREATE&numShards=2&shard=shard1&wt=javabin
   [junit4]   2> 2377710 INFO  (qtp2114254855-54067) [n:127.0.0.1:36385_solr c:org.apache.solr.search.facet.TestCloudJSONFacetSKG_collection s:shard2 r:core_node4 x:org.apache.solr.search.facet.TestCloudJSONFacetSKG_collection_shard2_replica_n2 ] o.a.s.c.SolrConfig Using Lucene MatchVersion: 9.0.0
   [junit4]   2> 2377712 INFO  (qtp284394700-54068) [n:127.0.0.1:46293_solr c:org.apache.solr.search.facet.TestCloudJSONFacetSKG_collection s:shard1 r:core_node3 x:org.apache.solr.search.facet.TestCloudJSONFacetSKG_collection_shard1_replica_n1 ] o.a.s.c.SolrConfig Using Lucene MatchVersion: 9.0.0
   [junit4]   2> 2377772 INFO  (qtp2114254855-54067) [n:127.0.0.1:36385_solr c:org.apache.solr.search.facet.TestCloudJSONFacetSKG_collection s:shard2 r:core_node4 x:org.apache.solr.search.facet.TestCloudJSONFacetSKG_collection_shard2_replica_n2 ] o.a.s.s.IndexSchema [org.apache.solr.search.facet.TestCloudJSONFacetSKG_collection_shard2_replica_n2] Schema name=example
   [junit4]   2> 2377772 INFO  (qtp284394700-54068) [n:127.0.0.1:46293_solr c:org.apache.solr.search.facet.TestCloudJSONFacetSKG_collection s:shard1 r:core_node3 x:org.apache.solr.search.facet.TestCloudJSONFacetSKG_collection_shard1_replica_n1 ] o.a.s.s.IndexSchema [org.apache.solr.search.facet.TestCloudJSONFacetSKG_collection_shard1_replica_n1] Schema name=example
   [junit4]   2> 2377879 INFO  (qtp2114254855-54067) [n:127.0.0.1:36385_solr c:org.apache.solr.search.facet.TestCloudJSONFacetSKG_collection s:shard2 r:core_node4 x:org.apache.solr.search.facet.TestCloudJSONFacetSKG_collection_shard2_replica_n2 ] o.a.s.s.IndexSchema Loaded schema example/1.6 with uniqueid field id
   [junit4]   2> 2377883 INFO  (qtp284394700-54068) [n:127.0.0.1:46293_solr c:org.apache.solr.search.facet.TestCloudJSONFacetSKG_collection s:shard1 r:core_node3 x:org.apache.solr.search.facet.TestCloudJSONFacetSKG_collection_shard1_replica_n1 ] o.a.s.s.IndexSchema Loaded schema example/1.6 with uniqueid field id
   [junit4]   2> 2377898 INFO  (qtp2114254855-54067) [n:127.0.0.1:36385_solr c:org.apache.solr.search.facet.TestCloudJSONFacetSKG_collection s:shard2 r:core_node4 x:org.apache.solr.search.facet.TestCloudJSONFacetSKG_collection_shard2_replica_n2 ] o.a.s.c.CoreContainer Creating SolrCore 'org.apache.solr.search.facet.TestCloudJSONFacetSKG_collection_shard2_replica_n2' using configuration from collection org.apache.solr.search.facet.TestCloudJSONFacetSKG_collection, trusted=true
   [junit4]   2> 2377898 INFO  (qtp2114254855-54067) [n:127.0.0.1:36385_solr c:org.apache.solr.search.facet.TestCloudJSONFacetSKG_collection s:shard2 r:core_node4 x:org.apache.solr.search.facet.TestCloudJSONFacetSKG_collection_shard2_replica_n2 ] o.a.s.m.r.SolrJmxReporter JMX monitoring for 'solr_36385.solr.core.org.apache.solr.search.facet.TestCloudJSONFacetSKG_collection.shard2.replica_n2' (registry 'solr.core.org.apache.solr.search.facet.TestCloudJSONFacetSKG_collection.shard2.replica_n2') enabled at server: com.sun.jmx.mbeanserver.JmxMBeanServer@1dcbdae1
   [junit4]   2> 2377898 INFO 

[...truncated too long message...]

l
   [junit4]   2> 152123 INFO  (jetty-closer-117-thread-2) [     ] o.a.s.m.SolrMetricManager Closing metric reporters for registry=solr.cluster, tag=null
   [junit4]   2> 152146 INFO  (closeThreadPool-124-thread-1) [     ] o.a.s.c.Overseer Overseer (id=72063643477999623-127.0.0.1:33851_solr-n_0000000000) closing
   [junit4]   2> 152146 INFO  (OverseerStateUpdate-72063643477999623-127.0.0.1:33851_solr-n_0000000000) [n:127.0.0.1:33851_solr     ] o.a.s.c.Overseer Overseer Loop exiting : 127.0.0.1:33851_solr
   [junit4]   2> 152156 INFO  (OverseerAutoScalingTriggerThread-72063643477999623-127.0.0.1:33851_solr-n_0000000000) [     ] o.a.s.c.a.OverseerTriggerThread OverseerTriggerThread woken up but we are closed, exiting.
   [junit4]   2> 152158 INFO  (closeThreadPool-124-thread-2) [     ] o.a.s.c.Overseer Overseer (id=72063643477999623-127.0.0.1:33851_solr-n_0000000000) closing
   [junit4]   2> 152159 INFO  (zkCallback-96-thread-1) [     ] o.a.s.c.c.ZkStateReader Updated live nodes from ZooKeeper... (2) -> (1)
   [junit4]   2> 152163 INFO  (zkCallback-89-thread-3) [     ] o.a.s.c.c.ZkStateReader Updated live nodes from ZooKeeper... (2) -> (1)
   [junit4]   2> 152357 INFO  (jetty-closer-117-thread-2) [     ] o.e.j.s.AbstractConnector Stopped ServerConnector@589f7993{HTTP/1.1,[http/1.1, h2c]}{127.0.0.1:0}
   [junit4]   2> 152358 INFO  (jetty-closer-117-thread-2) [     ] o.e.j.s.h.ContextHandler Stopped o.e.j.s.ServletContextHandler@3bbfb0c9{/solr,null,UNAVAILABLE}
   [junit4]   2> 152358 INFO  (jetty-closer-117-thread-2) [     ] o.e.j.s.session node0 Stopped scavenging
   [junit4]   2> 152456 INFO  (jetty-closer-117-thread-1) [     ] o.a.s.c.Overseer Overseer (id=72063643477999623-127.0.0.1:33851_solr-n_0000000000) closing
   [junit4]   2> 152457 INFO  (jetty-closer-117-thread-1) [     ] o.e.j.s.AbstractConnector Stopped ServerConnector@6fb2e69d{HTTP/1.1,[http/1.1, h2c]}{127.0.0.1:0}
   [junit4]   2> 152457 INFO  (jetty-closer-117-thread-1) [     ] o.e.j.s.h.ContextHandler Stopped o.e.j.s.ServletContextHandler@2bb66694{/solr,null,UNAVAILABLE}
   [junit4]   2> 152457 INFO  (jetty-closer-117-thread-1) [     ] o.e.j.s.session node0 Stopped scavenging
   [junit4]   2> 152460 INFO  (SUITE-TestCloudJSONFacetSKG-seed#[200BDD0A84D4DD47]-worker) [     ] o.a.s.c.ZkTestServer Shutting down ZkTestServer.
   [junit4]   2> 152662 WARN  (ZkTestServer Run Thread) [     ] o.a.s.c.ZkTestServer Watch limit violations: 
   [junit4]   2> Maximum concurrent create/delete watches above limit:
   [junit4]   2> 
   [junit4]   2> 	5	/solr/aliases.json
   [junit4]   2> 	5	/solr/clusterprops.json
   [junit4]   2> 	3	/solr/collections/org.apache.solr.search.facet.TestCloudJSONFacetSKG_collection/terms/shard1
   [junit4]   2> 	3	/solr/collections/org.apache.solr.search.facet.TestCloudJSONFacetSKG_collection/terms/shard2
   [junit4]   2> 	2	/solr/collections/org.apache.solr.search.facet.TestCloudJSONFacetSKG_collection/collectionprops.json
   [junit4]   2> 	2	/solr/security.json
   [junit4]   2> 	2	/solr/configs/org.apache.solr.search.facet.TestCloudJSONFacetSKG_config-set
   [junit4]   2> 
   [junit4]   2> Maximum concurrent data watches above limit:
   [junit4]   2> 
   [junit4]   2> 	25	/solr/collections/org.apache.solr.search.facet.TestCloudJSONFacetSKG_collection/state.json
   [junit4]   2> 	5	/solr/clusterstate.json
   [junit4]   2> 
   [junit4]   2> Maximum concurrent children watches above limit:
   [junit4]   2> 
   [junit4]   2> 	17	/solr/overseer/queue
   [junit4]   2> 	12	/solr/live_nodes
   [junit4]   2> 	10	/solr/collections
   [junit4]   2> 	4	/solr/overseer/collection-queue-work
   [junit4]   2> 
   [junit4]   2> 152667 INFO  (SUITE-TestCloudJSONFacetSKG-seed#[200BDD0A84D4DD47]-worker) [     ] o.a.s.c.ZkTestServer parse host and port list: 127.0.0.1:37499
   [junit4]   2> 152667 INFO  (SUITE-TestCloudJSONFacetSKG-seed#[200BDD0A84D4DD47]-worker) [     ] o.a.s.c.ZkTestServer connecting to 127.0.0.1 37499
   [junit4]   2> NOTE: leaving temporary files on disk at: /home/jenkins/workspace/Lucene-Solr-master-Linux/solr/build/solr-core/test/J0/temp/solr.search.facet.TestCloudJSONFacetSKG_200BDD0A84D4DD47-002
   [junit4]   2> Jul 26, 2019 1:19:32 AM com.carrotsearch.randomizedtesting.ThreadLeakControl checkThreadLeaks
   [junit4]   2> WARNING: Will linger awaiting termination of 1 leaked thread(s).
   [junit4]   2> NOTE: test params are: codec=Asserting(Lucene80): {field_4_sds=PostingsFormat(name=Direct), field_10_sds=PostingsFormat(name=Asserting), field_13_sds=TestBloomFilteredLucenePostings(BloomFilteringPostingsFormat(Lucene50(blocksize=128))), field_1_sds=PostingsFormat(name=Asserting), _root_=TestBloomFilteredLucenePostings(BloomFilteringPostingsFormat(Lucene50(blocksize=128))), field_7_sds=BlockTreeOrds(blocksize=128), field_12_ss=BlockTreeOrds(blocksize=128), field_6_ss=PostingsFormat(name=Direct), field_9_ss=PostingsFormat(name=Asserting), field_8_sdsS=BlockTreeOrds(blocksize=128), field_5_sdsS=PostingsFormat(name=Direct), field_2_sdsS=PostingsFormat(name=Asserting), field_3_ss=BlockTreeOrds(blocksize=128), field_0_ss=TestBloomFilteredLucenePostings(BloomFilteringPostingsFormat(Lucene50(blocksize=128))), field_14_sdsS=PostingsFormat(name=Direct), field_11_sdsS=PostingsFormat(name=Asserting), id=PostingsFormat(name=Asserting)}, docValues:{field_10_sds=DocValuesFormat(name=Lucene80), field_1_sds=DocValuesFormat(name=Lucene80), field_7_sds=DocValuesFormat(name=Asserting), field_1_ids=DocValuesFormat(name=Asserting), field_8_sdsS=DocValuesFormat(name=Asserting), field_12_is=DocValuesFormat(name=Lucene80), field_9_is=DocValuesFormat(name=Asserting), field_7_ids=DocValuesFormat(name=Lucene80), field_3_is=DocValuesFormat(name=Lucene80), field_4_sds=DocValuesFormat(name=Lucene80), field_13_sds=DocValuesFormat(name=Direct), field_8_idsS=DocValuesFormat(name=Lucene80), field_13_ids=DocValuesFormat(name=Lucene80), field_5_sdsS=DocValuesFormat(name=Lucene80), field_2_sdsS=DocValuesFormat(name=Lucene80), _version_=DocValuesFormat(name=Direct), field_11_idsS=DocValuesFormat(name=Asserting), field_14_sdsS=DocValuesFormat(name=Lucene80), field_11_sdsS=DocValuesFormat(name=Lucene80), field_14_idsS=DocValuesFormat(name=Direct), field_4_ids=DocValuesFormat(name=Direct), field_5_idsS=DocValuesFormat(name=Direct), field_0_is=DocValuesFormat(name=Lucene80), field_2_idsS=DocValuesFormat(name=Asserting), field_10_ids=DocValuesFormat(name=Asserting), field_6_is=DocValuesFormat(name=Direct)}, maxPointsInLeafNode=1551, maxMBSortInHeap=5.805885852683117, sim=Asserting(org.apache.lucene.search.similarities.AssertingSimilarity@134c0140), locale=ar-MA, timezone=Australia/Brisbane
   [junit4]   2> NOTE: Linux 4.18.0-25-generic amd64/AdoptOpenJDK 11.0.3 (64-bit)/cpus=8,threads=1,free=97443352,total=536870912
   [junit4]   2> NOTE: All tests run in this JVM: [TestCloudJSONFacetSKG, TestCloudJSONFacetSKG]
   [junit4] Completed [5/5 (5!)] on J0 in 45.31s, 2 tests, 1 error <<< FAILURES!
   [junit4] 
   [junit4] 
   [junit4] Tests with failures [seed: 200BDD0A84D4DD47]:
   [junit4]   - org.apache.solr.search.facet.TestCloudJSONFacetSKG.testRandom
   [junit4]   - org.apache.solr.search.facet.TestCloudJSONFacetSKG.testBespoke
   [junit4]   - org.apache.solr.search.facet.TestCloudJSONFacetSKG.testRandom
   [junit4]   - org.apache.solr.search.facet.TestCloudJSONFacetSKG.testRandom
   [junit4]   - org.apache.solr.search.facet.TestCloudJSONFacetSKG.testRandom
   [junit4]   - org.apache.solr.search.facet.TestCloudJSONFacetSKG.testBespoke
   [junit4]   - org.apache.solr.search.facet.TestCloudJSONFacetSKG.testRandom
   [junit4] 
   [junit4] 
   [junit4] JVM J0:     1.28 ..   157.68 =   156.39s
   [junit4] JVM J1:     1.29 ..   155.75 =   154.46s
   [junit4] JVM J2:     1.28 ..   111.11 =   109.82s
   [junit4] Execution time total: 2 minutes 37 seconds
   [junit4] Tests summary: 5 suites, 10 tests, 7 errors

BUILD FAILED
/home/jenkins/workspace/Lucene-Solr-master-Linux/lucene/common-build.xml:1492: The following error occurred while executing this line:
/home/jenkins/workspace/Lucene-Solr-master-Linux/lucene/common-build.xml:1019: There were test failures: 5 suites, 10 tests, 7 errors [seed: 200BDD0A84D4DD47]

Total time: 2 minutes 39 seconds

[repro] Setting last failure code to 256

[repro] Failures:
[repro]   5/5 failed: org.apache.solr.search.facet.TestCloudJSONFacetSKG
[repro] Exiting with code 256
+ mv lucene/build lucene/build.repro
+ mv solr/build solr/build.repro
+ mv lucene/build.orig lucene/build
+ mv solr/build.orig solr/build
Archiving artifacts
Setting ANT_1_8_2_HOME=/home/jenkins/tools/hudson.tasks.Ant_AntInstallation/ANT_1.8.2
[WARNINGS] Parsing warnings in console log with parser Java Compiler (javac)
Setting ANT_1_8_2_HOME=/home/jenkins/tools/hudson.tasks.Ant_AntInstallation/ANT_1.8.2
No credentials specified
Setting ANT_1_8_2_HOME=/home/jenkins/tools/hudson.tasks.Ant_AntInstallation/ANT_1.8.2
<Git Blamer> Using GitBlamer to create author and commit information for all warnings.
<Git Blamer> GIT_COMMIT=c20988907f28954967de3395ea5421ee56ec4b35, workspace=/home/jenkins/workspace/Lucene-Solr-master-Linux
[WARNINGS] Computing warning deltas based on reference build #24447
Recording test results
Setting ANT_1_8_2_HOME=/home/jenkins/tools/hudson.tasks.Ant_AntInstallation/ANT_1.8.2
Build step 'Publish JUnit test result report' changed build result to UNSTABLE
Email was triggered for: Unstable (Test Failures)
Sending email for trigger: Unstable (Test Failures)
Setting ANT_1_8_2_HOME=/home/jenkins/tools/hudson.tasks.Ant_AntInstallation/ANT_1.8.2
Setting ANT_1_8_2_HOME=/home/jenkins/tools/hudson.tasks.Ant_AntInstallation/ANT_1.8.2
Setting ANT_1_8_2_HOME=/home/jenkins/tools/hudson.tasks.Ant_AntInstallation/ANT_1.8.2
Setting ANT_1_8_2_HOME=/home/jenkins/tools/hudson.tasks.Ant_AntInstallation/ANT_1.8.2
Setting ANT_1_8_2_HOME=/home/jenkins/tools/hudson.tasks.Ant_AntInstallation/ANT_1.8.2
Setting ANT_1_8_2_HOME=/home/jenkins/tools/hudson.tasks.Ant_AntInstallation/ANT_1.8.2

Mime
View raw message