lucene-dev mailing list archives

Site index · List index
Message view « Date » · « Thread »
Top « Date » · « Thread »
From Policeman Jenkins Server <jenk...@thetaphi.de>
Subject [JENKINS] Lucene-Solr-8.x-Windows (64bit/jdk1.8.0_201) - Build # 381 - Still Unstable!
Date Thu, 25 Jul 2019 23:10:18 GMT
Build: https://jenkins.thetaphi.de/job/Lucene-Solr-8.x-Windows/381/
Java: 64bit/jdk1.8.0_201 -XX:+UseCompressedOops -XX:+UseG1GC

5 tests failed.
FAILED:  org.apache.solr.client.solrj.io.stream.StreamExpressionTest.testFileStreamDirectoryCrawl

Error Message:
expected:<directory1[/]secondLevel1.txt> but was:<directory1[\]secondLevel1.txt>

Stack Trace:
org.junit.ComparisonFailure: expected:<directory1[/]secondLevel1.txt> but was:<directory1[\]secondLevel1.txt>
	at __randomizedtesting.SeedInfo.seed([79AAEAD38DA0EBD7:DD43243F41AF8C32]:0)
	at org.junit.Assert.assertEquals(Assert.java:115)
	at org.junit.Assert.assertEquals(Assert.java:144)
	at org.apache.solr.client.solrj.io.stream.StreamExpressionTest.testFileStreamDirectoryCrawl(StreamExpressionTest.java:3128)
	at sun.reflect.NativeMethodAccessorImpl.invoke0(Native Method)
	at sun.reflect.NativeMethodAccessorImpl.invoke(NativeMethodAccessorImpl.java:62)
	at sun.reflect.DelegatingMethodAccessorImpl.invoke(DelegatingMethodAccessorImpl.java:43)
	at java.lang.reflect.Method.invoke(Method.java:498)
	at com.carrotsearch.randomizedtesting.RandomizedRunner.invoke(RandomizedRunner.java:1750)
	at com.carrotsearch.randomizedtesting.RandomizedRunner$8.evaluate(RandomizedRunner.java:938)
	at com.carrotsearch.randomizedtesting.RandomizedRunner$9.evaluate(RandomizedRunner.java:974)
	at com.carrotsearch.randomizedtesting.RandomizedRunner$10.evaluate(RandomizedRunner.java:988)
	at com.carrotsearch.randomizedtesting.rules.SystemPropertiesRestoreRule$1.evaluate(SystemPropertiesRestoreRule.java:57)
	at org.apache.lucene.util.TestRuleSetupTeardownChained$1.evaluate(TestRuleSetupTeardownChained.java:49)
	at org.apache.lucene.util.AbstractBeforeAfterRule$1.evaluate(AbstractBeforeAfterRule.java:45)
	at org.apache.lucene.util.TestRuleThreadAndTestName$1.evaluate(TestRuleThreadAndTestName.java:48)
	at org.apache.lucene.util.TestRuleIgnoreAfterMaxFailures$1.evaluate(TestRuleIgnoreAfterMaxFailures.java:64)
	at org.apache.lucene.util.TestRuleMarkFailure$1.evaluate(TestRuleMarkFailure.java:47)
	at com.carrotsearch.randomizedtesting.rules.StatementAdapter.evaluate(StatementAdapter.java:36)
	at com.carrotsearch.randomizedtesting.ThreadLeakControl$StatementRunner.run(ThreadLeakControl.java:368)
	at com.carrotsearch.randomizedtesting.ThreadLeakControl.forkTimeoutingTask(ThreadLeakControl.java:817)
	at com.carrotsearch.randomizedtesting.ThreadLeakControl$3.evaluate(ThreadLeakControl.java:468)
	at com.carrotsearch.randomizedtesting.RandomizedRunner.runSingleTest(RandomizedRunner.java:947)
	at com.carrotsearch.randomizedtesting.RandomizedRunner$5.evaluate(RandomizedRunner.java:832)
	at com.carrotsearch.randomizedtesting.RandomizedRunner$6.evaluate(RandomizedRunner.java:883)
	at com.carrotsearch.randomizedtesting.RandomizedRunner$7.evaluate(RandomizedRunner.java:894)
	at com.carrotsearch.randomizedtesting.rules.StatementAdapter.evaluate(StatementAdapter.java:36)
	at com.carrotsearch.randomizedtesting.rules.SystemPropertiesRestoreRule$1.evaluate(SystemPropertiesRestoreRule.java:57)
	at org.apache.lucene.util.AbstractBeforeAfterRule$1.evaluate(AbstractBeforeAfterRule.java:45)
	at com.carrotsearch.randomizedtesting.rules.StatementAdapter.evaluate(StatementAdapter.java:36)
	at org.apache.lucene.util.TestRuleStoreClassName$1.evaluate(TestRuleStoreClassName.java:41)
	at com.carrotsearch.randomizedtesting.rules.NoShadowingOrOverridesOnMethodsRule$1.evaluate(NoShadowingOrOverridesOnMethodsRule.java:40)
	at com.carrotsearch.randomizedtesting.rules.NoShadowingOrOverridesOnMethodsRule$1.evaluate(NoShadowingOrOverridesOnMethodsRule.java:40)
	at com.carrotsearch.randomizedtesting.rules.StatementAdapter.evaluate(StatementAdapter.java:36)
	at com.carrotsearch.randomizedtesting.rules.StatementAdapter.evaluate(StatementAdapter.java:36)
	at com.carrotsearch.randomizedtesting.rules.StatementAdapter.evaluate(StatementAdapter.java:36)
	at org.apache.lucene.util.TestRuleAssertionsRequired$1.evaluate(TestRuleAssertionsRequired.java:53)
	at org.apache.lucene.util.TestRuleMarkFailure$1.evaluate(TestRuleMarkFailure.java:47)
	at org.apache.lucene.util.TestRuleIgnoreAfterMaxFailures$1.evaluate(TestRuleIgnoreAfterMaxFailures.java:64)
	at org.apache.lucene.util.TestRuleIgnoreTestSuites$1.evaluate(TestRuleIgnoreTestSuites.java:54)
	at com.carrotsearch.randomizedtesting.rules.StatementAdapter.evaluate(StatementAdapter.java:36)
	at com.carrotsearch.randomizedtesting.ThreadLeakControl$StatementRunner.run(ThreadLeakControl.java:368)
	at java.lang.Thread.run(Thread.java:748)


FAILED:  org.apache.solr.client.solrj.io.stream.StreamExpressionTest.testFileStreamDirectoryCrawl

Error Message:
expected:<directory1[/]secondLevel1.txt> but was:<directory1[\]secondLevel1.txt>

Stack Trace:
org.junit.ComparisonFailure: expected:<directory1[/]secondLevel1.txt> but was:<directory1[\]secondLevel1.txt>
	at __randomizedtesting.SeedInfo.seed([79AAEAD38DA0EBD7:DD43243F41AF8C32]:0)
	at org.junit.Assert.assertEquals(Assert.java:115)
	at org.junit.Assert.assertEquals(Assert.java:144)
	at org.apache.solr.client.solrj.io.stream.StreamExpressionTest.testFileStreamDirectoryCrawl(StreamExpressionTest.java:3128)
	at sun.reflect.NativeMethodAccessorImpl.invoke0(Native Method)
	at sun.reflect.NativeMethodAccessorImpl.invoke(NativeMethodAccessorImpl.java:62)
	at sun.reflect.DelegatingMethodAccessorImpl.invoke(DelegatingMethodAccessorImpl.java:43)
	at java.lang.reflect.Method.invoke(Method.java:498)
	at com.carrotsearch.randomizedtesting.RandomizedRunner.invoke(RandomizedRunner.java:1750)
	at com.carrotsearch.randomizedtesting.RandomizedRunner$8.evaluate(RandomizedRunner.java:938)
	at com.carrotsearch.randomizedtesting.RandomizedRunner$9.evaluate(RandomizedRunner.java:974)
	at com.carrotsearch.randomizedtesting.RandomizedRunner$10.evaluate(RandomizedRunner.java:988)
	at com.carrotsearch.randomizedtesting.rules.SystemPropertiesRestoreRule$1.evaluate(SystemPropertiesRestoreRule.java:57)
	at org.apache.lucene.util.TestRuleSetupTeardownChained$1.evaluate(TestRuleSetupTeardownChained.java:49)
	at org.apache.lucene.util.AbstractBeforeAfterRule$1.evaluate(AbstractBeforeAfterRule.java:45)
	at org.apache.lucene.util.TestRuleThreadAndTestName$1.evaluate(TestRuleThreadAndTestName.java:48)
	at org.apache.lucene.util.TestRuleIgnoreAfterMaxFailures$1.evaluate(TestRuleIgnoreAfterMaxFailures.java:64)
	at org.apache.lucene.util.TestRuleMarkFailure$1.evaluate(TestRuleMarkFailure.java:47)
	at com.carrotsearch.randomizedtesting.rules.StatementAdapter.evaluate(StatementAdapter.java:36)
	at com.carrotsearch.randomizedtesting.ThreadLeakControl$StatementRunner.run(ThreadLeakControl.java:368)
	at com.carrotsearch.randomizedtesting.ThreadLeakControl.forkTimeoutingTask(ThreadLeakControl.java:817)
	at com.carrotsearch.randomizedtesting.ThreadLeakControl$3.evaluate(ThreadLeakControl.java:468)
	at com.carrotsearch.randomizedtesting.RandomizedRunner.runSingleTest(RandomizedRunner.java:947)
	at com.carrotsearch.randomizedtesting.RandomizedRunner$5.evaluate(RandomizedRunner.java:832)
	at com.carrotsearch.randomizedtesting.RandomizedRunner$6.evaluate(RandomizedRunner.java:883)
	at com.carrotsearch.randomizedtesting.RandomizedRunner$7.evaluate(RandomizedRunner.java:894)
	at com.carrotsearch.randomizedtesting.rules.StatementAdapter.evaluate(StatementAdapter.java:36)
	at com.carrotsearch.randomizedtesting.rules.SystemPropertiesRestoreRule$1.evaluate(SystemPropertiesRestoreRule.java:57)
	at org.apache.lucene.util.AbstractBeforeAfterRule$1.evaluate(AbstractBeforeAfterRule.java:45)
	at com.carrotsearch.randomizedtesting.rules.StatementAdapter.evaluate(StatementAdapter.java:36)
	at org.apache.lucene.util.TestRuleStoreClassName$1.evaluate(TestRuleStoreClassName.java:41)
	at com.carrotsearch.randomizedtesting.rules.NoShadowingOrOverridesOnMethodsRule$1.evaluate(NoShadowingOrOverridesOnMethodsRule.java:40)
	at com.carrotsearch.randomizedtesting.rules.NoShadowingOrOverridesOnMethodsRule$1.evaluate(NoShadowingOrOverridesOnMethodsRule.java:40)
	at com.carrotsearch.randomizedtesting.rules.StatementAdapter.evaluate(StatementAdapter.java:36)
	at com.carrotsearch.randomizedtesting.rules.StatementAdapter.evaluate(StatementAdapter.java:36)
	at com.carrotsearch.randomizedtesting.rules.StatementAdapter.evaluate(StatementAdapter.java:36)
	at org.apache.lucene.util.TestRuleAssertionsRequired$1.evaluate(TestRuleAssertionsRequired.java:53)
	at org.apache.lucene.util.TestRuleMarkFailure$1.evaluate(TestRuleMarkFailure.java:47)
	at org.apache.lucene.util.TestRuleIgnoreAfterMaxFailures$1.evaluate(TestRuleIgnoreAfterMaxFailures.java:64)
	at org.apache.lucene.util.TestRuleIgnoreTestSuites$1.evaluate(TestRuleIgnoreTestSuites.java:54)
	at com.carrotsearch.randomizedtesting.rules.StatementAdapter.evaluate(StatementAdapter.java:36)
	at com.carrotsearch.randomizedtesting.ThreadLeakControl$StatementRunner.run(ThreadLeakControl.java:368)
	at java.lang.Thread.run(Thread.java:748)


FAILED:  org.apache.solr.client.solrj.io.stream.StreamExpressionTest.testFileStreamDirectoryCrawl

Error Message:
expected:<directory1[/]secondLevel1.txt> but was:<directory1[\]secondLevel1.txt>

Stack Trace:
org.junit.ComparisonFailure: expected:<directory1[/]secondLevel1.txt> but was:<directory1[\]secondLevel1.txt>
	at __randomizedtesting.SeedInfo.seed([79AAEAD38DA0EBD7:DD43243F41AF8C32]:0)
	at org.junit.Assert.assertEquals(Assert.java:115)
	at org.junit.Assert.assertEquals(Assert.java:144)
	at org.apache.solr.client.solrj.io.stream.StreamExpressionTest.testFileStreamDirectoryCrawl(StreamExpressionTest.java:3128)
	at sun.reflect.NativeMethodAccessorImpl.invoke0(Native Method)
	at sun.reflect.NativeMethodAccessorImpl.invoke(NativeMethodAccessorImpl.java:62)
	at sun.reflect.DelegatingMethodAccessorImpl.invoke(DelegatingMethodAccessorImpl.java:43)
	at java.lang.reflect.Method.invoke(Method.java:498)
	at com.carrotsearch.randomizedtesting.RandomizedRunner.invoke(RandomizedRunner.java:1750)
	at com.carrotsearch.randomizedtesting.RandomizedRunner$8.evaluate(RandomizedRunner.java:938)
	at com.carrotsearch.randomizedtesting.RandomizedRunner$9.evaluate(RandomizedRunner.java:974)
	at com.carrotsearch.randomizedtesting.RandomizedRunner$10.evaluate(RandomizedRunner.java:988)
	at com.carrotsearch.randomizedtesting.rules.SystemPropertiesRestoreRule$1.evaluate(SystemPropertiesRestoreRule.java:57)
	at org.apache.lucene.util.TestRuleSetupTeardownChained$1.evaluate(TestRuleSetupTeardownChained.java:49)
	at org.apache.lucene.util.AbstractBeforeAfterRule$1.evaluate(AbstractBeforeAfterRule.java:45)
	at org.apache.lucene.util.TestRuleThreadAndTestName$1.evaluate(TestRuleThreadAndTestName.java:48)
	at org.apache.lucene.util.TestRuleIgnoreAfterMaxFailures$1.evaluate(TestRuleIgnoreAfterMaxFailures.java:64)
	at org.apache.lucene.util.TestRuleMarkFailure$1.evaluate(TestRuleMarkFailure.java:47)
	at com.carrotsearch.randomizedtesting.rules.StatementAdapter.evaluate(StatementAdapter.java:36)
	at com.carrotsearch.randomizedtesting.ThreadLeakControl$StatementRunner.run(ThreadLeakControl.java:368)
	at com.carrotsearch.randomizedtesting.ThreadLeakControl.forkTimeoutingTask(ThreadLeakControl.java:817)
	at com.carrotsearch.randomizedtesting.ThreadLeakControl$3.evaluate(ThreadLeakControl.java:468)
	at com.carrotsearch.randomizedtesting.RandomizedRunner.runSingleTest(RandomizedRunner.java:947)
	at com.carrotsearch.randomizedtesting.RandomizedRunner$5.evaluate(RandomizedRunner.java:832)
	at com.carrotsearch.randomizedtesting.RandomizedRunner$6.evaluate(RandomizedRunner.java:883)
	at com.carrotsearch.randomizedtesting.RandomizedRunner$7.evaluate(RandomizedRunner.java:894)
	at com.carrotsearch.randomizedtesting.rules.StatementAdapter.evaluate(StatementAdapter.java:36)
	at com.carrotsearch.randomizedtesting.rules.SystemPropertiesRestoreRule$1.evaluate(SystemPropertiesRestoreRule.java:57)
	at org.apache.lucene.util.AbstractBeforeAfterRule$1.evaluate(AbstractBeforeAfterRule.java:45)
	at com.carrotsearch.randomizedtesting.rules.StatementAdapter.evaluate(StatementAdapter.java:36)
	at org.apache.lucene.util.TestRuleStoreClassName$1.evaluate(TestRuleStoreClassName.java:41)
	at com.carrotsearch.randomizedtesting.rules.NoShadowingOrOverridesOnMethodsRule$1.evaluate(NoShadowingOrOverridesOnMethodsRule.java:40)
	at com.carrotsearch.randomizedtesting.rules.NoShadowingOrOverridesOnMethodsRule$1.evaluate(NoShadowingOrOverridesOnMethodsRule.java:40)
	at com.carrotsearch.randomizedtesting.rules.StatementAdapter.evaluate(StatementAdapter.java:36)
	at com.carrotsearch.randomizedtesting.rules.StatementAdapter.evaluate(StatementAdapter.java:36)
	at com.carrotsearch.randomizedtesting.rules.StatementAdapter.evaluate(StatementAdapter.java:36)
	at org.apache.lucene.util.TestRuleAssertionsRequired$1.evaluate(TestRuleAssertionsRequired.java:53)
	at org.apache.lucene.util.TestRuleMarkFailure$1.evaluate(TestRuleMarkFailure.java:47)
	at org.apache.lucene.util.TestRuleIgnoreAfterMaxFailures$1.evaluate(TestRuleIgnoreAfterMaxFailures.java:64)
	at org.apache.lucene.util.TestRuleIgnoreTestSuites$1.evaluate(TestRuleIgnoreTestSuites.java:54)
	at com.carrotsearch.randomizedtesting.rules.StatementAdapter.evaluate(StatementAdapter.java:36)
	at com.carrotsearch.randomizedtesting.ThreadLeakControl$StatementRunner.run(ThreadLeakControl.java:368)
	at java.lang.Thread.run(Thread.java:748)


FAILED:  org.apache.solr.client.solrj.io.stream.StreamExpressionTest.testFileStreamDirectoryCrawl

Error Message:
expected:<directory1[/]secondLevel1.txt> but was:<directory1[\]secondLevel1.txt>

Stack Trace:
org.junit.ComparisonFailure: expected:<directory1[/]secondLevel1.txt> but was:<directory1[\]secondLevel1.txt>
	at __randomizedtesting.SeedInfo.seed([79AAEAD38DA0EBD7:DD43243F41AF8C32]:0)
	at org.junit.Assert.assertEquals(Assert.java:115)
	at org.junit.Assert.assertEquals(Assert.java:144)
	at org.apache.solr.client.solrj.io.stream.StreamExpressionTest.testFileStreamDirectoryCrawl(StreamExpressionTest.java:3128)
	at sun.reflect.NativeMethodAccessorImpl.invoke0(Native Method)
	at sun.reflect.NativeMethodAccessorImpl.invoke(NativeMethodAccessorImpl.java:62)
	at sun.reflect.DelegatingMethodAccessorImpl.invoke(DelegatingMethodAccessorImpl.java:43)
	at java.lang.reflect.Method.invoke(Method.java:498)
	at com.carrotsearch.randomizedtesting.RandomizedRunner.invoke(RandomizedRunner.java:1750)
	at com.carrotsearch.randomizedtesting.RandomizedRunner$8.evaluate(RandomizedRunner.java:938)
	at com.carrotsearch.randomizedtesting.RandomizedRunner$9.evaluate(RandomizedRunner.java:974)
	at com.carrotsearch.randomizedtesting.RandomizedRunner$10.evaluate(RandomizedRunner.java:988)
	at com.carrotsearch.randomizedtesting.rules.SystemPropertiesRestoreRule$1.evaluate(SystemPropertiesRestoreRule.java:57)
	at org.apache.lucene.util.TestRuleSetupTeardownChained$1.evaluate(TestRuleSetupTeardownChained.java:49)
	at org.apache.lucene.util.AbstractBeforeAfterRule$1.evaluate(AbstractBeforeAfterRule.java:45)
	at org.apache.lucene.util.TestRuleThreadAndTestName$1.evaluate(TestRuleThreadAndTestName.java:48)
	at org.apache.lucene.util.TestRuleIgnoreAfterMaxFailures$1.evaluate(TestRuleIgnoreAfterMaxFailures.java:64)
	at org.apache.lucene.util.TestRuleMarkFailure$1.evaluate(TestRuleMarkFailure.java:47)
	at com.carrotsearch.randomizedtesting.rules.StatementAdapter.evaluate(StatementAdapter.java:36)
	at com.carrotsearch.randomizedtesting.ThreadLeakControl$StatementRunner.run(ThreadLeakControl.java:368)
	at com.carrotsearch.randomizedtesting.ThreadLeakControl.forkTimeoutingTask(ThreadLeakControl.java:817)
	at com.carrotsearch.randomizedtesting.ThreadLeakControl$3.evaluate(ThreadLeakControl.java:468)
	at com.carrotsearch.randomizedtesting.RandomizedRunner.runSingleTest(RandomizedRunner.java:947)
	at com.carrotsearch.randomizedtesting.RandomizedRunner$5.evaluate(RandomizedRunner.java:832)
	at com.carrotsearch.randomizedtesting.RandomizedRunner$6.evaluate(RandomizedRunner.java:883)
	at com.carrotsearch.randomizedtesting.RandomizedRunner$7.evaluate(RandomizedRunner.java:894)
	at com.carrotsearch.randomizedtesting.rules.StatementAdapter.evaluate(StatementAdapter.java:36)
	at com.carrotsearch.randomizedtesting.rules.SystemPropertiesRestoreRule$1.evaluate(SystemPropertiesRestoreRule.java:57)
	at org.apache.lucene.util.AbstractBeforeAfterRule$1.evaluate(AbstractBeforeAfterRule.java:45)
	at com.carrotsearch.randomizedtesting.rules.StatementAdapter.evaluate(StatementAdapter.java:36)
	at org.apache.lucene.util.TestRuleStoreClassName$1.evaluate(TestRuleStoreClassName.java:41)
	at com.carrotsearch.randomizedtesting.rules.NoShadowingOrOverridesOnMethodsRule$1.evaluate(NoShadowingOrOverridesOnMethodsRule.java:40)
	at com.carrotsearch.randomizedtesting.rules.NoShadowingOrOverridesOnMethodsRule$1.evaluate(NoShadowingOrOverridesOnMethodsRule.java:40)
	at com.carrotsearch.randomizedtesting.rules.StatementAdapter.evaluate(StatementAdapter.java:36)
	at com.carrotsearch.randomizedtesting.rules.StatementAdapter.evaluate(StatementAdapter.java:36)
	at com.carrotsearch.randomizedtesting.rules.StatementAdapter.evaluate(StatementAdapter.java:36)
	at org.apache.lucene.util.TestRuleAssertionsRequired$1.evaluate(TestRuleAssertionsRequired.java:53)
	at org.apache.lucene.util.TestRuleMarkFailure$1.evaluate(TestRuleMarkFailure.java:47)
	at org.apache.lucene.util.TestRuleIgnoreAfterMaxFailures$1.evaluate(TestRuleIgnoreAfterMaxFailures.java:64)
	at org.apache.lucene.util.TestRuleIgnoreTestSuites$1.evaluate(TestRuleIgnoreTestSuites.java:54)
	at com.carrotsearch.randomizedtesting.rules.StatementAdapter.evaluate(StatementAdapter.java:36)
	at com.carrotsearch.randomizedtesting.ThreadLeakControl$StatementRunner.run(ThreadLeakControl.java:368)
	at java.lang.Thread.run(Thread.java:748)


FAILED:  org.apache.solr.client.solrj.io.stream.StreamExpressionTest.testFileStreamDirectoryCrawl

Error Message:
expected:<directory1[/]secondLevel1.txt> but was:<directory1[\]secondLevel1.txt>

Stack Trace:
org.junit.ComparisonFailure: expected:<directory1[/]secondLevel1.txt> but was:<directory1[\]secondLevel1.txt>
	at __randomizedtesting.SeedInfo.seed([79AAEAD38DA0EBD7:DD43243F41AF8C32]:0)
	at org.junit.Assert.assertEquals(Assert.java:115)
	at org.junit.Assert.assertEquals(Assert.java:144)
	at org.apache.solr.client.solrj.io.stream.StreamExpressionTest.testFileStreamDirectoryCrawl(StreamExpressionTest.java:3128)
	at sun.reflect.NativeMethodAccessorImpl.invoke0(Native Method)
	at sun.reflect.NativeMethodAccessorImpl.invoke(NativeMethodAccessorImpl.java:62)
	at sun.reflect.DelegatingMethodAccessorImpl.invoke(DelegatingMethodAccessorImpl.java:43)
	at java.lang.reflect.Method.invoke(Method.java:498)
	at com.carrotsearch.randomizedtesting.RandomizedRunner.invoke(RandomizedRunner.java:1750)
	at com.carrotsearch.randomizedtesting.RandomizedRunner$8.evaluate(RandomizedRunner.java:938)
	at com.carrotsearch.randomizedtesting.RandomizedRunner$9.evaluate(RandomizedRunner.java:974)
	at com.carrotsearch.randomizedtesting.RandomizedRunner$10.evaluate(RandomizedRunner.java:988)
	at com.carrotsearch.randomizedtesting.rules.SystemPropertiesRestoreRule$1.evaluate(SystemPropertiesRestoreRule.java:57)
	at org.apache.lucene.util.TestRuleSetupTeardownChained$1.evaluate(TestRuleSetupTeardownChained.java:49)
	at org.apache.lucene.util.AbstractBeforeAfterRule$1.evaluate(AbstractBeforeAfterRule.java:45)
	at org.apache.lucene.util.TestRuleThreadAndTestName$1.evaluate(TestRuleThreadAndTestName.java:48)
	at org.apache.lucene.util.TestRuleIgnoreAfterMaxFailures$1.evaluate(TestRuleIgnoreAfterMaxFailures.java:64)
	at org.apache.lucene.util.TestRuleMarkFailure$1.evaluate(TestRuleMarkFailure.java:47)
	at com.carrotsearch.randomizedtesting.rules.StatementAdapter.evaluate(StatementAdapter.java:36)
	at com.carrotsearch.randomizedtesting.ThreadLeakControl$StatementRunner.run(ThreadLeakControl.java:368)
	at com.carrotsearch.randomizedtesting.ThreadLeakControl.forkTimeoutingTask(ThreadLeakControl.java:817)
	at com.carrotsearch.randomizedtesting.ThreadLeakControl$3.evaluate(ThreadLeakControl.java:468)
	at com.carrotsearch.randomizedtesting.RandomizedRunner.runSingleTest(RandomizedRunner.java:947)
	at com.carrotsearch.randomizedtesting.RandomizedRunner$5.evaluate(RandomizedRunner.java:832)
	at com.carrotsearch.randomizedtesting.RandomizedRunner$6.evaluate(RandomizedRunner.java:883)
	at com.carrotsearch.randomizedtesting.RandomizedRunner$7.evaluate(RandomizedRunner.java:894)
	at com.carrotsearch.randomizedtesting.rules.StatementAdapter.evaluate(StatementAdapter.java:36)
	at com.carrotsearch.randomizedtesting.rules.SystemPropertiesRestoreRule$1.evaluate(SystemPropertiesRestoreRule.java:57)
	at org.apache.lucene.util.AbstractBeforeAfterRule$1.evaluate(AbstractBeforeAfterRule.java:45)
	at com.carrotsearch.randomizedtesting.rules.StatementAdapter.evaluate(StatementAdapter.java:36)
	at org.apache.lucene.util.TestRuleStoreClassName$1.evaluate(TestRuleStoreClassName.java:41)
	at com.carrotsearch.randomizedtesting.rules.NoShadowingOrOverridesOnMethodsRule$1.evaluate(NoShadowingOrOverridesOnMethodsRule.java:40)
	at com.carrotsearch.randomizedtesting.rules.NoShadowingOrOverridesOnMethodsRule$1.evaluate(NoShadowingOrOverridesOnMethodsRule.java:40)
	at com.carrotsearch.randomizedtesting.rules.StatementAdapter.evaluate(StatementAdapter.java:36)
	at com.carrotsearch.randomizedtesting.rules.StatementAdapter.evaluate(StatementAdapter.java:36)
	at com.carrotsearch.randomizedtesting.rules.StatementAdapter.evaluate(StatementAdapter.java:36)
	at org.apache.lucene.util.TestRuleAssertionsRequired$1.evaluate(TestRuleAssertionsRequired.java:53)
	at org.apache.lucene.util.TestRuleMarkFailure$1.evaluate(TestRuleMarkFailure.java:47)
	at org.apache.lucene.util.TestRuleIgnoreAfterMaxFailures$1.evaluate(TestRuleIgnoreAfterMaxFailures.java:64)
	at org.apache.lucene.util.TestRuleIgnoreTestSuites$1.evaluate(TestRuleIgnoreTestSuites.java:54)
	at com.carrotsearch.randomizedtesting.rules.StatementAdapter.evaluate(StatementAdapter.java:36)
	at com.carrotsearch.randomizedtesting.ThreadLeakControl$StatementRunner.run(ThreadLeakControl.java:368)
	at java.lang.Thread.run(Thread.java:748)




Build Log:
[...truncated 17142 lines...]
   [junit4] Suite: org.apache.solr.client.solrj.io.stream.StreamExpressionTest
   [junit4]   2> Creating dataDir: C:\Users\jenkins\workspace\Lucene-Solr-8.x-Windows\solr\build\solr-solrj\test\J0\temp\solr.client.solrj.io.stream.StreamExpressionTest_79AAEAD38DA0EBD7-001\init-core-data-001
   [junit4]   2> 477707 WARN  (SUITE-StreamExpressionTest-seed#[79AAEAD38DA0EBD7]-worker) [     ] o.a.s.SolrTestCaseJ4 startTrackingSearchers: numOpens=4 numCloses=4
   [junit4]   2> 477707 INFO  (SUITE-StreamExpressionTest-seed#[79AAEAD38DA0EBD7]-worker) [     ] o.a.s.SolrTestCaseJ4 Using PointFields (NUMERIC_POINTS_SYSPROP=true) w/NUMERIC_DOCVALUES_SYSPROP=false
   [junit4]   2> 477712 INFO  (SUITE-StreamExpressionTest-seed#[79AAEAD38DA0EBD7]-worker) [     ] o.a.s.SolrTestCaseJ4 Randomized ssl (false) and clientAuth (false) via: @org.apache.solr.SolrTestCaseJ4$SuppressSSL(bugUrl=None)
   [junit4]   2> 477712 INFO  (SUITE-StreamExpressionTest-seed#[79AAEAD38DA0EBD7]-worker) [     ] o.a.s.SolrTestCaseJ4 SecureRandom sanity checks: test.solr.allowed.securerandom=null & java.security.egd=file:/dev/./urandom
   [junit4]   2> 477713 INFO  (SUITE-StreamExpressionTest-seed#[79AAEAD38DA0EBD7]-worker) [     ] o.a.s.c.MiniSolrCloudCluster Starting cluster of 4 servers in C:\Users\jenkins\workspace\Lucene-Solr-8.x-Windows\solr\build\solr-solrj\test\J0\temp\solr.client.solrj.io.stream.StreamExpressionTest_79AAEAD38DA0EBD7-001\tempDir-001
   [junit4]   2> 477714 INFO  (SUITE-StreamExpressionTest-seed#[79AAEAD38DA0EBD7]-worker) [     ] o.a.s.c.ZkTestServer STARTING ZK TEST SERVER
   [junit4]   2> 477715 INFO  (ZkTestServer Run Thread) [     ] o.a.s.c.ZkTestServer client port:0.0.0.0/0.0.0.0:0
   [junit4]   2> 477715 INFO  (ZkTestServer Run Thread) [     ] o.a.s.c.ZkTestServer Starting server
   [junit4]   2> 477820 INFO  (SUITE-StreamExpressionTest-seed#[79AAEAD38DA0EBD7]-worker) [     ] o.a.s.c.ZkTestServer start zk server on port:55311
   [junit4]   2> 477820 INFO  (SUITE-StreamExpressionTest-seed#[79AAEAD38DA0EBD7]-worker) [     ] o.a.s.c.ZkTestServer parse host and port list: 127.0.0.1:55311
   [junit4]   2> 477820 INFO  (SUITE-StreamExpressionTest-seed#[79AAEAD38DA0EBD7]-worker) [     ] o.a.s.c.ZkTestServer connecting to 127.0.0.1 55311
   [junit4]   2> 477822 INFO  (SUITE-StreamExpressionTest-seed#[79AAEAD38DA0EBD7]-worker) [     ] o.a.s.c.c.ConnectionManager Waiting for client to connect to ZooKeeper
   [junit4]   2> 477831 INFO  (zkConnectionManagerCallback-5286-thread-1) [     ] o.a.s.c.c.ConnectionManager zkClient has connected
   [junit4]   2> 477831 INFO  (SUITE-StreamExpressionTest-seed#[79AAEAD38DA0EBD7]-worker) [     ] o.a.s.c.c.ConnectionManager Client is connected to ZooKeeper
   [junit4]   2> 477840 INFO  (SUITE-StreamExpressionTest-seed#[79AAEAD38DA0EBD7]-worker) [     ] o.a.s.c.c.ConnectionManager Waiting for client to connect to ZooKeeper
   [junit4]   2> 477846 INFO  (zkConnectionManagerCallback-5288-thread-1) [     ] o.a.s.c.c.ConnectionManager zkClient has connected
   [junit4]   2> 477846 INFO  (SUITE-StreamExpressionTest-seed#[79AAEAD38DA0EBD7]-worker) [     ] o.a.s.c.c.ConnectionManager Client is connected to ZooKeeper
   [junit4]   2> 477847 INFO  (SUITE-StreamExpressionTest-seed#[79AAEAD38DA0EBD7]-worker) [     ] o.a.s.c.c.ConnectionManager Waiting for client to connect to ZooKeeper
   [junit4]   2> 477851 INFO  (zkConnectionManagerCallback-5290-thread-1) [     ] o.a.s.c.c.ConnectionManager zkClient has connected
   [junit4]   2> 477851 INFO  (SUITE-StreamExpressionTest-seed#[79AAEAD38DA0EBD7]-worker) [     ] o.a.s.c.c.ConnectionManager Client is connected to ZooKeeper
   [junit4]   2> 477960 WARN  (jetty-launcher-5291-thread-1) [     ] o.e.j.s.AbstractConnector Ignoring deprecated socket close linger time
   [junit4]   2> 477961 INFO  (jetty-launcher-5291-thread-1) [     ] o.a.s.c.s.e.JettySolrRunner Start Jetty (original configured port=0)
   [junit4]   2> 477961 INFO  (jetty-launcher-5291-thread-1) [     ] o.a.s.c.s.e.JettySolrRunner Trying to start Jetty on port 0 try number 1 ...
   [junit4]   2> 477961 INFO  (jetty-launcher-5291-thread-1) [     ] o.e.j.s.Server jetty-9.4.19.v20190610; built: 2019-06-10T16:30:51.723Z; git: afcf563148970e98786327af5e07c261fda175d3; jvm 1.8.0_201-b09
   [junit4]   2> 477961 INFO  (jetty-launcher-5291-thread-1) [     ] o.e.j.s.session DefaultSessionIdManager workerName=node0
   [junit4]   2> 477961 INFO  (jetty-launcher-5291-thread-1) [     ] o.e.j.s.session No SessionScavenger set, using defaults
   [junit4]   2> 477961 INFO  (jetty-launcher-5291-thread-1) [     ] o.e.j.s.session node0 Scavenging every 600000ms
   [junit4]   2> 477962 INFO  (jetty-launcher-5291-thread-1) [     ] o.e.j.s.h.ContextHandler Started o.e.j.s.ServletContextHandler@5730b588{/solr,null,AVAILABLE}
   [junit4]   2> 477965 WARN  (jetty-launcher-5291-thread-2) [     ] o.e.j.s.AbstractConnector Ignoring deprecated socket close linger time
   [junit4]   2> 477965 INFO  (jetty-launcher-5291-thread-2) [     ] o.a.s.c.s.e.JettySolrRunner Start Jetty (original configured port=0)
   [junit4]   2> 477965 INFO  (jetty-launcher-5291-thread-2) [     ] o.a.s.c.s.e.JettySolrRunner Trying to start Jetty on port 0 try number 1 ...
   [junit4]   2> 477965 INFO  (jetty-launcher-5291-thread-2) [     ] o.e.j.s.Server jetty-9.4.19.v20190610; built: 2019-06-10T16:30:51.723Z; git: afcf563148970e98786327af5e07c261fda175d3; jvm 1.8.0_201-b09
   [junit4]   2> 477966 INFO  (jetty-launcher-5291-thread-2) [     ] o.e.j.s.session DefaultSessionIdManager workerName=node0
   [junit4]   2> 477966 INFO  (jetty-launcher-5291-thread-2) [     ] o.e.j.s.session No SessionScavenger set, using defaults
   [junit4]   2> 477966 INFO  (jetty-launcher-5291-thread-2) [     ] o.e.j.s.session node0 Scavenging every 660000ms
   [junit4]   2> 477966 INFO  (jetty-launcher-5291-thread-2) [     ] o.e.j.s.h.ContextHandler Started o.e.j.s.ServletContextHandler@1609b614{/solr,null,AVAILABLE}
   [junit4]   2> 477968 WARN  (jetty-launcher-5291-thread-3) [     ] o.e.j.s.AbstractConnector Ignoring deprecated socket close linger time
   [junit4]   2> 477968 INFO  (jetty-launcher-5291-thread-3) [     ] o.a.s.c.s.e.JettySolrRunner Start Jetty (original configured port=0)
   [junit4]   2> 477968 INFO  (jetty-launcher-5291-thread-3) [     ] o.a.s.c.s.e.JettySolrRunner Trying to start Jetty on port 0 try number 1 ...
   [junit4]   2> 477968 INFO  (jetty-launcher-5291-thread-3) [     ] o.e.j.s.Server jetty-9.4.19.v20190610; built: 2019-06-10T16:30:51.723Z; git: afcf563148970e98786327af5e07c261fda175d3; jvm 1.8.0_201-b09
   [junit4]   2> 477969 INFO  (jetty-launcher-5291-thread-3) [     ] o.e.j.s.session DefaultSessionIdManager workerName=node0
   [junit4]   2> 477969 INFO  (jetty-launcher-5291-thread-3) [     ] o.e.j.s.session No SessionScavenger set, using defaults
   [junit4]   2> 477969 INFO  (jetty-launcher-5291-thread-3) [     ] o.e.j.s.session node0 Scavenging every 600000ms
   [junit4]   2> 477969 INFO  (jetty-launcher-5291-thread-3) [     ] o.e.j.s.h.ContextHandler Started o.e.j.s.ServletContextHandler@5edf3784{/solr,null,AVAILABLE}
   [junit4]   2> 477971 WARN  (jetty-launcher-5291-thread-4) [     ] o.e.j.s.AbstractConnector Ignoring deprecated socket close linger time
   [junit4]   2> 477973 INFO  (jetty-launcher-5291-thread-4) [     ] o.a.s.c.s.e.JettySolrRunner Start Jetty (original configured port=0)
   [junit4]   2> 477973 INFO  (jetty-launcher-5291-thread-4) [     ] o.a.s.c.s.e.JettySolrRunner Trying to start Jetty on port 0 try number 1 ...
   [junit4]   2> 477973 INFO  (jetty-launcher-5291-thread-4) [     ] o.e.j.s.Server jetty-9.4.19.v20190610; built: 2019-06-10T16:30:51.723Z; git: afcf563148970e98786327af5e07c261fda175d3; jvm 1.8.0_201-b09
   [junit4]   2> 477973 INFO  (jetty-launcher-5291-thread-4) [     ] o.e.j.s.session DefaultSessionIdManager workerName=node0
   [junit4]   2> 477973 INFO  (jetty-launcher-5291-thread-4) [     ] o.e.j.s.session No SessionScavenger set, using defaults
   [junit4]   2> 477973 INFO  (jetty-launcher-5291-thread-4) [     ] o.e.j.s.session node0 Scavenging every 600000ms
   [junit4]   2> 477973 INFO  (jetty-launcher-5291-thread-4) [     ] o.e.j.s.h.ContextHandler Started o.e.j.s.ServletContextHandler@1a9e4d37{/solr,null,AVAILABLE}
   [junit4]   2> 477974 INFO  (jetty-launcher-5291-thread-1) [     ] o.e.j.s.AbstractConnector Started ServerConnector@2da2ae2f{HTTP/1.1,[http/1.1, h2c]}{127.0.0.1:55325}
   [junit4]   2> 477974 INFO  (jetty-launcher-5291-thread-1) [     ] o.e.j.s.Server Started @492593ms
   [junit4]   2> 477974 INFO  (jetty-launcher-5291-thread-1) [     ] o.a.s.c.s.e.JettySolrRunner Jetty properties: {hostContext=/solr, hostPort=55325}
   [junit4]   2> 477974 ERROR (jetty-launcher-5291-thread-1) [     ] o.a.s.u.StartupLoggingUtils Missing Java Option solr.log.dir. Logging may be missing or incomplete.
   [junit4]   2> 477974 INFO  (jetty-launcher-5291-thread-1) [     ] o.a.s.s.SolrDispatchFilter Using logger factory org.apache.logging.slf4j.Log4jLoggerFactory
   [junit4]   2> 477974 INFO  (jetty-launcher-5291-thread-1) [     ] o.a.s.s.SolrDispatchFilter  ___      _       Welcome to Apache Solr™ version 8.3.0
   [junit4]   2> 477974 INFO  (jetty-launcher-5291-thread-1) [     ] o.a.s.s.SolrDispatchFilter / __| ___| |_ _   Starting in cloud mode on port null
   [junit4]   2> 477974 INFO  (jetty-launcher-5291-thread-1) [     ] o.a.s.s.SolrDispatchFilter \__ \/ _ \ | '_|  Install dir: null
   [junit4]   2> 477974 INFO  (jetty-launcher-5291-thread-1) [     ] o.a.s.s.SolrDispatchFilter |___/\___/_|_|    Start time: 2019-07-25T22:38:34.466Z
   [junit4]   2> 477976 INFO  (jetty-launcher-5291-thread-1) [     ] o.a.s.c.c.ConnectionManager Waiting for client to connect to ZooKeeper
   [junit4]   2> 477978 INFO  (jetty-launcher-5291-thread-2) [     ] o.e.j.s.AbstractConnector Started ServerConnector@6c4071b7{HTTP/1.1,[http/1.1, h2c]}{127.0.0.1:55328}
   [junit4]   2> 477978 INFO  (jetty-launcher-5291-thread-2) [     ] o.e.j.s.Server Started @492596ms
   [junit4]   2> 477978 INFO  (jetty-launcher-5291-thread-2) [     ] o.a.s.c.s.e.JettySolrRunner Jetty properties: {hostContext=/solr, hostPort=55328}
   [junit4]   2> 477979 ERROR (jetty-launcher-5291-thread-2) [     ] o.a.s.u.StartupLoggingUtils Missing Java Option solr.log.dir. Logging may be missing or incomplete.
   [junit4]   2> 477979 INFO  (jetty-launcher-5291-thread-2) [     ] o.a.s.s.SolrDispatchFilter Using logger factory org.apache.logging.slf4j.Log4jLoggerFactory
   [junit4]   2> 477979 INFO  (jetty-launcher-5291-thread-2) [     ] o.a.s.s.SolrDispatchFilter  ___      _       Welcome to Apache Solr™ version 8.3.0
   [junit4]   2> 477979 INFO  (jetty-launcher-5291-thread-2) [     ] o.a.s.s.SolrDispatchFilter / __| ___| |_ _   Starting in cloud mode on port null
   [junit4]   2> 477979 INFO  (jetty-launcher-5291-thread-2) [     ] o.a.s.s.SolrDispatchFilter \__ \/ _ \ | '_|  Install dir: null
   [junit4]   2> 477979 INFO  (jetty-launcher-5291-thread-2) [     ] o.a.s.s.SolrDispatchFilter |___/\___/_|_|    Start time: 2019-07-25T22:38:34.471Z
   [junit4]   2> 477982 INFO  (jetty-launcher-5291-thread-2) [     ] o.a.s.c.c.ConnectionManager Waiting for client to connect to ZooKeeper
   [junit4]   2> 477982 INFO  (jetty-launcher-5291-thread-3) [     ] o.e.j.s.AbstractConnector Started ServerConnector@72b71df7{HTTP/1.1,[http/1.1, h2c]}{127.0.0.1:55332}
   [junit4]   2> 477982 INFO  (jetty-launcher-5291-thread-3) [     ] o.e.j.s.Server Started @492600ms
   [junit4]   2> 477982 INFO  (jetty-launcher-5291-thread-3) [     ] o.a.s.c.s.e.JettySolrRunner Jetty properties: {hostContext=/solr, hostPort=55332}
   [junit4]   2> 477982 ERROR (jetty-launcher-5291-thread-3) [     ] o.a.s.u.StartupLoggingUtils Missing Java Option solr.log.dir. Logging may be missing or incomplete.
   [junit4]   2> 477982 INFO  (jetty-launcher-5291-thread-3) [     ] o.a.s.s.SolrDispatchFilter Using logger factory org.apache.logging.slf4j.Log4jLoggerFactory
   [junit4]   2> 477982 INFO  (jetty-launcher-5291-thread-3) [     ] o.a.s.s.SolrDispatchFilter  ___      _       Welcome to Apache Solr™ version 8.3.0
   [junit4]   2> 477982 INFO  (jetty-launcher-5291-thread-3) [     ] o.a.s.s.SolrDispatchFilter / __| ___| |_ _   Starting in cloud mode on port null
   [junit4]   2> 477982 INFO  (jetty-launcher-5291-thread-3) [     ] o.a.s.s.SolrDispatchFilter \__ \/ _ \ | '_|  Install dir: null
   [junit4]   2> 477982 INFO  (jetty-launcher-5291-thread-3) [     ] o.a.s.s.SolrDispatchFilter |___/\___/_|_|    Start time: 2019-07-25T22:38:34.474Z
   [junit4]   2> 477987 INFO  (jetty-launcher-5291-thread-4) [     ] o.e.j.s.AbstractConnector Started ServerConnector@5b4df150{HTTP/1.1,[http/1.1, h2c]}{127.0.0.1:55335}
   [junit4]   2> 477987 INFO  (jetty-launcher-5291-thread-4) [     ] o.e.j.s.Server Started @492604ms
   [junit4]   2> 477987 INFO  (jetty-launcher-5291-thread-3) [     ] o.a.s.c.c.ConnectionManager Waiting for client to connect to ZooKeeper
   [junit4]   2> 477987 INFO  (jetty-launcher-5291-thread-4) [     ] o.a.s.c.s.e.JettySolrRunner Jetty properties: {hostContext=/solr, hostPort=55335}
   [junit4]   2> 477987 ERROR (jetty-launcher-5291-thread-4) [     ] o.a.s.u.StartupLoggingUtils Missing Java Option solr.log.dir. Logging may be missing or incomplete.
   [junit4]   2> 477987 INFO  (jetty-launcher-5291-thread-4) [     ] o.a.s.s.SolrDispatchFilter Using logger factory org.apache.logging.slf4j.Log4jLoggerFactory
   [junit4]   2> 477987 INFO  (jetty-launcher-5291-thread-4) [     ] o.a.s.s.SolrDispatchFilter  ___      _       Welcome to Apache Solr™ version 8.3.0
   [junit4]   2> 477987 INFO  (jetty-launcher-5291-thread-4) [     ] o.a.s.s.SolrDispatchFilter / __| ___| |_ _   Starting in cloud mode on port null
   [junit4]   2> 477987 INFO  (jetty-launcher-5291-thread-4) [     ] o.a.s.s.SolrDispatchFilter \__ \/ _ \ | '_|  Install dir: null
   [junit4]   2> 477987 INFO  (jetty-launcher-5291-thread-4) [     ] o.a.s.s.SolrDispatchFilter |___/\___/_|_|    Start time: 2019-07-25T22:38:34.479Z
   [junit4]   2> 477990 INFO  (jetty-launcher-5291-thread-4) [     ] o.a.s.c.c.ConnectionManager Waiting for client to connect to ZooKeeper
   [junit4]   2> 477996 INFO  (zkConnectionManagerCallback-5293-thread-1) [     ] o.a.s.c.c.ConnectionManager zkClient has connected
   [junit4]   2> 477996 INFO  (jetty-launcher-5291-thread-1) [     ] o.a.s.c.c.ConnectionManager Client is connected to ZooKeeper
   [junit4]   2> 477996 INFO  (jetty-launcher-5291-thread-1) [     ] o.a.s.s.SolrDispatchFilter solr.xml found in ZooKeeper. Loading...
   [junit4]   2> 478002 INFO  (zkConnectionManagerCallback-5295-thread-1) [     ] o.a.s.c.c.ConnectionManager zkClient has connected
   [junit4]   2> 478002 INFO  (jetty-launcher-5291-thread-2) [     ] o.a.s.c.c.ConnectionManager Client is connected to ZooKeeper
   [junit4]   2> 478004 INFO  (jetty-launcher-5291-thread-2) [     ] o.a.s.s.SolrDispatchFilter solr.xml found in ZooKeeper. Loading...
   [junit4]   2> 478007 INFO  (zkConnectionManagerCallback-5297-thread-1) [     ] o.a.s.c.c.ConnectionManager zkClient has connected
   [junit4]   2> 478007 INFO  (jetty-launcher-5291-thread-3) [     ] o.a.s.c.c.ConnectionManager Client is connected to ZooKeeper
   [junit4]   2> 478009 INFO  (zkConnectionManagerCallback-5299-thread-1) [     ] o.a.s.c.c.ConnectionManager zkClient has connected
   [junit4]   2> 478009 INFO  (jetty-launcher-5291-thread-4) [     ] o.a.s.c.c.ConnectionManager Client is connected to ZooKeeper
   [junit4]   2> 478138 INFO  (jetty-launcher-5291-thread-4) [     ] o.a.s.s.SolrDispatchFilter solr.xml found in ZooKeeper. Loading...
   [junit4]   2> 478138 INFO  (jetty-launcher-5291-thread-3) [     ] o.a.s.s.SolrDispatchFilter solr.xml found in ZooKeeper. Loading...
   [junit4]   2> 478197 INFO  (jetty-launcher-5291-thread-1) [     ] o.a.s.h.c.HttpShardHandlerFactory Host whitelist initialized: WhitelistHostChecker [whitelistHosts=null, whitelistHostCheckingEnabled=true]
   [junit4]   2> 478201 WARN  (jetty-launcher-5291-thread-1) [     ] o.e.j.u.s.S.config Trusting all certificates configured for Client@7209cded[provider=null,keyStore=null,trustStore=null]
   [junit4]   2> 478201 WARN  (jetty-launcher-5291-thread-1) [     ] o.e.j.u.s.S.config No Client EndPointIdentificationAlgorithm configured for Client@7209cded[provider=null,keyStore=null,trustStore=null]
   [junit4]   2> 478219 WARN  (jetty-launcher-5291-thread-1) [     ] o.e.j.u.s.S.config Trusting all certificates configured for Client@778e2dd0[provider=null,keyStore=null,trustStore=null]
   [junit4]   2> 478219 WARN  (jetty-launcher-5291-thread-1) [     ] o.e.j.u.s.S.config No Client EndPointIdentificationAlgorithm configured for Client@778e2dd0[provider=null,keyStore=null,trustStore=null]
   [junit4]   2> 478219 INFO  (jetty-launcher-5291-thread-1) [     ] o.a.s.c.ZkContainer Zookeeper client=127.0.0.1:55311/solr
   [junit4]   2> 478222 INFO  (jetty-launcher-5291-thread-1) [     ] o.a.s.c.c.ConnectionManager Waiting for client to connect to ZooKeeper
   [junit4]   2> 478290 INFO  (zkConnectionManagerCallback-5306-thread-1) [     ] o.a.s.c.c.ConnectionManager zkClient has connected
   [junit4]   2> 478290 INFO  (jetty-launcher-5291-thread-1) [     ] o.a.s.c.c.ConnectionManager Client is connected to ZooKeeper
   [junit4]   2> 478351 INFO  (jetty-launcher-5291-thread-2) [     ] o.a.s.h.c.HttpShardHandlerFactory Host whitelist initialized: WhitelistHostChecker [whitelistHosts=null, whitelistHostCheckingEnabled=true]
   [junit4]   2> 478355 WARN  (jetty-launcher-5291-thread-2) [     ] o.e.j.u.s.S.config Trusting all certificates configured for Client@1e32a32a[provider=null,keyStore=null,trustStore=null]
   [junit4]   2> 478355 WARN  (jetty-launcher-5291-thread-2) [     ] o.e.j.u.s.S.config No Client EndPointIdentificationAlgorithm configured for Client@1e32a32a[provider=null,keyStore=null,trustStore=null]
   [junit4]   2> 478380 WARN  (jetty-launcher-5291-thread-2) [     ] o.e.j.u.s.S.config Trusting all certificates configured for Client@6bcb2a04[provider=null,keyStore=null,trustStore=null]
   [junit4]   2> 478380 WARN  (jetty-launcher-5291-thread-2) [     ] o.e.j.u.s.S.config No Client EndPointIdentificationAlgorithm configured for Client@6bcb2a04[provider=null,keyStore=null,trustStore=null]
   [junit4]   2> 478380 INFO  (jetty-launcher-5291-thread-2) [     ] o.a.s.c.ZkContainer Zookeeper client=127.0.0.1:55311/solr
   [junit4]   2> 478381 INFO  (jetty-launcher-5291-thread-2) [     ] o.a.s.c.c.ConnectionManager Waiting for client to connect to ZooKeeper
   [junit4]   2> 478441 INFO  (zkConnectionManagerCallback-5314-thread-1) [     ] o.a.s.c.c.ConnectionManager zkClient has connected
   [junit4]   2> 478441 INFO  (jetty-launcher-5291-thread-2) [     ] o.a.s.c.c.ConnectionManager Client is connected to ZooKeeper
   [junit4]   2> 478543 INFO  (jetty-launcher-5291-thread-4) [     ] o.a.s.h.c.HttpShardHandlerFactory Host whitelist initialized: WhitelistHostChecker [whitelistHosts=null, whitelistHostCheckingEnabled=true]
   [junit4]   2> 478545 WARN  (jetty-launcher-5291-thread-4) [     ] o.e.j.u.s.S.config Trusting all certificates configured for Client@6455635a[provider=null,keyStore=null,trustStore=null]
   [junit4]   2> 478545 WARN  (jetty-launcher-5291-thread-4) [     ] o.e.j.u.s.S.config No Client EndPointIdentificationAlgorithm configured for Client@6455635a[provider=null,keyStore=null,trustStore=null]
   [junit4]   2> 478573 WARN  (jetty-launcher-5291-thread-4) [     ] o.e.j.u.s.S.config Trusting all certificates configured for Client@1e45590f[provider=null,keyStore=null,trustStore=null]
   [junit4]   2> 478573 WARN  (jetty-launcher-5291-thread-4) [     ] o.e.j.u.s.S.config No Client EndPointIdentificationAlgorithm configured for Client@1e45590f[provider=null,keyStore=null,trustStore=null]
   [junit4]   2> 478573 INFO  (jetty-launcher-5291-thread-4) [     ] o.a.s.c.ZkContainer Zookeeper client=127.0.0.1:55311/solr
   [junit4]   2> 478573 INFO  (jetty-launcher-5291-thread-4) [     ] o.a.s.c.c.ConnectionManager Waiting for client to connect to ZooKeeper
   [junit4]   2> 478581 INFO  (jetty-launcher-5291-thread-1) [n:127.0.0.1:55325_solr     ] o.a.s.c.c.ConnectionManager Waiting for client to connect to ZooKeeper
   [junit4]   2> 478611 INFO  (zkConnectionManagerCallback-5321-thread-1) [     ] o.a.s.c.c.ConnectionManager zkClient has connected
   [junit4]   2> 478611 INFO  (jetty-launcher-5291-thread-4) [     ] o.a.s.c.c.ConnectionManager Client is connected to ZooKeeper
   [junit4]   2> 478612 INFO  (zkConnectionManagerCallback-5323-thread-1) [     ] o.a.s.c.c.ConnectionManager zkClient has connected
   [junit4]   2> 478612 INFO  (jetty-launcher-5291-thread-1) [n:127.0.0.1:55325_solr     ] o.a.s.c.c.ConnectionManager Client is connected to ZooKeeper
   [junit4]   2> 478634 WARN  (jetty-launcher-5291-thread-1) [n:127.0.0.1:55325_solr     ] o.a.s.c.ZkController The _default configset could not be uploaded. Please provide 'solr.default.confdir' parameter that points to a configset intended to be the default. Current 'solr.default.confdir' value: null
   [junit4]   2> 478643 INFO  (jetty-launcher-5291-thread-1) [n:127.0.0.1:55325_solr     ] o.a.s.c.OverseerElectionContext I am going to be the leader 127.0.0.1:55325_solr
   [junit4]   2> 478645 INFO  (jetty-launcher-5291-thread-1) [n:127.0.0.1:55325_solr     ] o.a.s.c.Overseer Overseer (id=72144657400791050-127.0.0.1:55325_solr-n_0000000000) starting
   [junit4]   2> 478655 INFO  (jetty-launcher-5291-thread-1) [n:127.0.0.1:55325_solr     ] o.a.s.c.c.ConnectionManager Waiting for client to connect to ZooKeeper
   [junit4]   2> 478669 INFO  (zkConnectionManagerCallback-5330-thread-1) [     ] o.a.s.c.c.ConnectionManager zkClient has connected
   [junit4]   2> 478672 INFO  (jetty-launcher-5291-thread-1) [n:127.0.0.1:55325_solr     ] o.a.s.c.c.ConnectionManager Client is connected to ZooKeeper
   [junit4]   2> 478680 INFO  (jetty-launcher-5291-thread-1) [n:127.0.0.1:55325_solr     ] o.a.s.c.s.i.ZkClientClusterStateProvider Cluster at 127.0.0.1:55311/solr ready
   [junit4]   2> 478681 INFO  (jetty-launcher-5291-thread-1) [n:127.0.0.1:55325_solr     ] o.a.s.c.ZkController Register node as live in ZooKeeper:/live_nodes/127.0.0.1:55325_solr
   [junit4]   2> 478682 INFO  (jetty-launcher-5291-thread-1) [n:127.0.0.1:55325_solr     ] o.a.s.c.LibListener clusterprops.json changed , version -1
   [junit4]   2> 478696 INFO  (jetty-launcher-5291-thread-2) [n:127.0.0.1:55328_solr     ] o.a.s.c.c.ConnectionManager Waiting for client to connect to ZooKeeper
   [junit4]   2> 478739 INFO  (jetty-launcher-5291-thread-3) [     ] o.a.s.h.c.HttpShardHandlerFactory Host whitelist initialized: WhitelistHostChecker [whitelistHosts=null, whitelistHostCheckingEnabled=true]
   [junit4]   2> 478747 INFO  (OverseerStateUpdate-72144657400791050-127.0.0.1:55325_solr-n_0000000000) [n:127.0.0.1:55325_solr     ] o.a.s.c.Overseer Starting to work on the main queue : 127.0.0.1:55325_solr
   [junit4]   2> 478747 INFO  (OverseerStateUpdate-72144657400791050-127.0.0.1:55325_solr-n_0000000000) [n:127.0.0.1:55325_solr     ] o.a.s.c.c.ZkStateReader Updated live nodes from ZooKeeper... (0) -> (1)
   [junit4]   2> 478756 INFO  (jetty-launcher-5291-thread-1) [n:127.0.0.1:55325_solr     ] o.a.s.h.a.MetricsHistoryHandler No .system collection, keeping metrics history in memory.
   [junit4]   2> 478820 INFO  (jetty-launcher-5291-thread-1) [n:127.0.0.1:55325_solr     ] o.a.s.m.r.SolrJmxReporter JMX monitoring for 'solr_55325.solr.node' (registry 'solr.node') enabled at server: com.sun.jmx.mbeanserver.JmxMBeanServer@18627a84
   [junit4]   2> 478828 INFO  (jetty-launcher-5291-thread-1) [n:127.0.0.1:55325_solr     ] o.a.s.m.r.SolrJmxReporter JMX monitoring for 'solr_55325.solr.jvm' (registry 'solr.jvm') enabled at server: com.sun.jmx.mbeanserver.JmxMBeanServer@18627a84
   [junit4]   2> 478828 INFO  (jetty-launcher-5291-thread-1) [n:127.0.0.1:55325_solr     ] o.a.s.m.r.SolrJmxReporter JMX monitoring for 'solr_55325.solr.jetty' (registry 'solr.jetty') enabled at server: com.sun.jmx.mbeanserver.JmxMBeanServer@18627a84
   [junit4]   2> 478830 INFO  (jetty-launcher-5291-thread-1) [n:127.0.0.1:55325_solr     ] o.a.s.c.CorePropertiesLocator Found 0 core definitions underneath C:\Users\jenkins\workspace\Lucene-Solr-8.x-Windows\solr\build\solr-solrj\test\J0\temp\solr.client.solrj.io.stream.StreamExpressionTest_79AAEAD38DA0EBD7-001\tempDir-001\node1\.
   [junit4]   2> 478863 INFO  (jetty-launcher-5291-thread-4) [n:127.0.0.1:55335_solr     ] o.a.s.c.c.ConnectionManager Waiting for client to connect to ZooKeeper
   [junit4]   2> 478871 INFO  (zkCallback-5329-thread-1) [     ] o.a.s.c.c.ZkStateReader Updated live nodes from ZooKeeper... (0) -> (1)
   [junit4]   2> 478871 WARN  (jetty-launcher-5291-thread-3) [     ] o.e.j.u.s.S.config Trusting all certificates configured for Client@7a1a76c7[provider=null,keyStore=null,trustStore=null]
   [junit4]   2> 478871 WARN  (jetty-launcher-5291-thread-3) [     ] o.e.j.u.s.S.config No Client EndPointIdentificationAlgorithm configured for Client@7a1a76c7[provider=null,keyStore=null,trustStore=null]
   [junit4]   2> 478902 WARN  (jetty-launcher-5291-thread-3) [     ] o.e.j.u.s.S.config Trusting all certificates configured for Client@393dcfb[provider=null,keyStore=null,trustStore=null]
   [junit4]   2> 478902 WARN  (jetty-launcher-5291-thread-3) [     ] o.e.j.u.s.S.config No Client EndPointIdentificationAlgorithm configured for Client@393dcfb[provider=null,keyStore=null,trustStore=null]
   [junit4]   2> 478904 INFO  (jetty-launcher-5291-thread-3) [     ] o.a.s.c.ZkContainer Zookeeper client=127.0.0.1:55311/solr
   [junit4]   2> 478904 INFO  (jetty-launcher-5291-thread-3) [     ] o.a.s.c.c.ConnectionManager Waiting for client to connect to ZooKeeper
   [junit4]   2> 478904 INFO  (zkConnectionManagerCallback-5332-thread-1) [     ] o.a.s.c.c.ConnectionManager zkClient has connected
   [junit4]   2> 478904 INFO  (jetty-launcher-5291-thread-2) [n:127.0.0.1:55328_solr     ] o.a.s.c.c.ConnectionManager Client is connected to ZooKeeper
   [junit4]   2> 478906 INFO  (zkConnectionManagerCallback-5336-thread-1) [     ] o.a.s.c.c.ConnectionManager zkClient has connected
   [junit4]   2> 478906 INFO  (jetty-launcher-5291-thread-4) [n:127.0.0.1:55335_solr     ] o.a.s.c.c.ConnectionManager Client is connected to ZooKeeper
   [junit4]   2> 478915 WARN  (jetty-launcher-5291-thread-2) [n:127.0.0.1:55328_solr     ] o.a.s.c.ZkController The _default configset could not be uploaded. Please provide 'solr.default.confdir' parameter that points to a configset intended to be the default. Current 'solr.default.confdir' value: null
   [junit4]   2> 478915 WARN  (jetty-launcher-5291-thread-4) [n:127.0.0.1:55335_solr     ] o.a.s.c.ZkController The _default configset could not be uploaded. Please provide 'solr.default.confdir' parameter that points to a configset intended to be the default. Current 'solr.default.confdir' value: null
   [junit4]   2> 478915 INFO  (jetty-launcher-5291-thread-4) [n:127.0.0.1:55335_solr     ] o.a.s.c.c.ZkStateReader Updated live nodes from ZooKeeper... (0) -> (1)
   [junit4]   2> 478915 INFO  (jetty-launcher-5291-thread-2) [n:127.0.0.1:55328_solr     ] o.a.s.c.c.ZkStateReader Updated live nodes from ZooKeeper... (0) -> (1)
   [junit4]   2> 478920 INFO  (jetty-launcher-5291-thread-2) [n:127.0.0.1:55328_solr     ] o.a.s.c.ZkController Publish node=127.0.0.1:55328_solr as DOWN
   [junit4]   2> 478920 INFO  (jetty-launcher-5291-thread-4) [n:127.0.0.1:55335_solr     ] o.a.s.c.ZkController Publish node=127.0.0.1:55335_solr as DOWN
   [junit4]   2> 478920 INFO  (jetty-launcher-5291-thread-4) [n:127.0.0.1:55335_solr     ] o.a.s.c.TransientSolrCoreCacheDefault Allocating transient cache for 2147483647 transient cores
   [junit4]   2> 478920 INFO  (jetty-launcher-5291-thread-4) [n:127.0.0.1:55335_solr     ] o.a.s.c.ZkController Register node as live in ZooKeeper:/live_nodes/127.0.0.1:55335_solr
   [junit4]   2> 478926 INFO  (jetty-launcher-5291-thread-2) [n:127.0.0.1:55328_solr     ] o.a.s.c.TransientSolrCoreCacheDefault Allocating transient cache for 2147483647 transient cores
   [junit4]   2> 478926 INFO  (jetty-launcher-5291-thread-2) [n:127.0.0.1:55328_solr     ] o.a.s.c.ZkController Register node as live in ZooKeeper:/live_nodes/127.0.0.1:55328_solr
   [junit4]   2> 478929 INFO  (zkCallback-5329-thread-1) [     ] o.a.s.c.c.ZkStateReader Updated live nodes from ZooKeeper... (1) -> (3)
   [junit4]   2> 478929 INFO  (zkCallback-5322-thread-1) [     ] o.a.s.c.c.ZkStateReader Updated live nodes from ZooKeeper... (1) -> (3)
   [junit4]   2> 478931 INFO  (jetty-launcher-5291-thread-4) [n:127.0.0.1:55335_solr     ] o.a.s.c.c.ConnectionManager Waiting for client to connect to ZooKeeper
   [junit4]   2> 478932 INFO  (jetty-launcher-5291-thread-2) [n:127.0.0.1:55328_solr     ] o.a.s.c.c.ConnectionManager Waiting for client to connect to ZooKeeper
   [junit4]   2> 478942 INFO  (zkConnectionManagerCallback-5341-thread-1) [     ] o.a.s.c.c.ConnectionManager zkClient has connected
   [junit4]   2> 478942 INFO  (jetty-launcher-5291-thread-3) [     ] o.a.s.c.c.ConnectionManager Client is connected to ZooKeeper
   [junit4]   2> 478959 INFO  (zkConnectionManagerCallback-5350-thread-1) [     ] o.a.s.c.c.ConnectionManager zkClient has connected
   [junit4]   2> 478959 INFO  (jetty-launcher-5291-thread-4) [n:127.0.0.1:55335_solr     ] o.a.s.c.c.ConnectionManager Client is connected to ZooKeeper
   [junit4]   2> 478960 INFO  (zkConnectionManagerCallback-5355-thread-1) [     ] o.a.s.c.c.ConnectionManager zkClient has connected
   [junit4]   2> 478960 INFO  (jetty-launcher-5291-thread-2) [n:127.0.0.1:55328_solr     ] o.a.s.c.c.ConnectionManager Client is connected to ZooKeeper
   [junit4]   2> 479052 INFO  (jetty-launcher-5291-thread-3) [n:127.0.0.1:55332_solr     ] o.a.s.c.c.ConnectionManager Waiting for client to connect to ZooKeeper
   [junit4]   2> 479054 INFO  (zkCallback-5331-thread-1) [     ] o.a.s.c.c.ZkStateReader Updated live nodes from ZooKeeper... (1) -> (3)
   [junit4]   2> 479055 INFO  (zkCallback-5335-thread-1) [     ] o.a.s.c.c.ZkStateReader Updated live nodes from ZooKeeper... (1) -> (3)
   [junit4]   2> 479057 INFO  (jetty-launcher-5291-thread-4) [n:127.0.0.1:55335_solr     ] o.a.s.c.c.ZkStateReader Updated live nodes from ZooKeeper... (0) -> (3)
   [junit4]   2> 479057 INFO  (jetty-launcher-5291-thread-2) [n:127.0.0.1:55328_solr     ] o.a.s.c.c.ZkStateReader Updated live nodes from ZooKeeper... (0) -> (3)
   [junit4]   2> 479059 INFO  (jetty-launcher-5291-thread-2) [n:127.0.0.1:55328_solr     ] o.a.s.c.s.i.ZkClientClusterStateProvider Cluster at 127.0.0.1:55311/solr ready
   [junit4]   2> 479059 INFO  (jetty-launcher-5291-thread-2) [n:127.0.0.1:55328_solr     ] o.a.s.c.LibListener clusterprops.json changed , version -1
   [junit4]   2> 479059 INFO  (jetty-launcher-5291-thread-4) [n:127.0.0.1:55335_solr     ] o.a.s.c.s.i.ZkClientClusterStateProvider Cluster at 127.0.0.1:55311/solr ready
   [junit4]   2> 479059 INFO  (jetty-launcher-5291-thread-4) [n:127.0.0.1:55335_solr     ] o.a.s.c.LibListener clusterprops.json changed , version -1
   [junit4]   2> 479144 INFO  (jetty-launcher-5291-thread-4) [n:127.0.0.1:55335_solr     ] o.a.s.h.a.MetricsHistoryHandler No .system collection, keeping metrics history in memory.
   [junit4]   2> 479144 INFO  (jetty-launcher-5291-thread-2) [n:127.0.0.1:55328_solr     ] o.a.s.h.a.MetricsHistoryHandler No .system collection, keeping metrics history in memory.
   [junit4]   2> 479179 INFO  (jetty-launcher-5291-thread-2) [n:127.0.0.1:55328_solr     ] o.a.s.m.r.SolrJmxReporter JMX monitoring for 'solr_55328.solr.node' (registry 'solr.node') enabled at server: com.sun.jmx.mbeanserver.JmxMBeanServer@18627a84
   [junit4]   2> 479184 INFO  (jetty-launcher-5291-thread-2) [n:127.0.0.1:55328_solr     ] o.a.s.m.r.SolrJmxReporter JMX monitoring for 'solr_55328.solr.jvm' (registry 'solr.jvm') enabled at server: com.sun.jmx.mbeanserver.JmxMBeanServer@18627a84
   [junit4]   2> 479184 INFO  (jetty-launcher-5291-thread-2) [n:127.0.0.1:55328_solr     ] o.a.s.m.r.SolrJmxReporter JMX monitoring for 'solr_55328.solr.jetty' (registry 'solr.jetty') enabled at server: com.sun.jmx.mbeanserver.JmxMBeanServer@18627a84
   [junit4]   2> 479186 INFO  (jetty-launcher-5291-thread-2) [n:127.0.0.1:55328_solr     ] o.a.s.c.CorePropertiesLocator Found 0 core definitions underneath C:\Users\jenkins\workspace\Lucene-Solr-8.x-Windows\solr\build\solr-solrj\test\J0\temp\solr.client.solrj.io.stream.StreamExpressionTest_79AAEAD38DA0EBD7-001\tempDir-001\node2\.
   [junit4]   2> 479189 INFO  (jetty-launcher-5291-thread-4) [n:127.0.0.1:55335_solr     ] o.a.s.m.r.SolrJmxReporter JMX monitoring for 'solr_55335.solr.node' (registry 'solr.node') enabled at server: com.sun.jmx.mbeanserver.JmxMBeanServer@18627a84
   [junit4]   2> 479195 INFO  (jetty-launcher-5291-thread-4) [n:127.0.0.1:55335_solr     ] o.a.s.m.r.SolrJmxReporter JMX monitoring for 'solr_55335.solr.jvm' (registry 'solr.jvm') enabled at server: com.sun.jmx.mbeanserver.JmxMBeanServer@18627a84
   [junit4]   2> 479195 INFO  (jetty-launcher-5291-thread-4) [n:127.0.0.1:55335_solr     ] o.a.s.m.r.SolrJmxReporter JMX monitoring for 'solr_55335.solr.jetty' (registry 'solr.jetty') enabled at server: com.sun.jmx.mbeanserver.JmxMBeanServer@18627a84
   [junit4]   2> 479197 INFO  (jetty-launcher-5291-thread-4) [n:127.0.0.1:55335_solr     ] o.a.s.c.CorePropertiesLocator Found 0 core definitions underneath C:\Users\jenkins\workspace\Lucene-Solr-8.x-Windows\solr\build\solr-solrj\test\J0\temp\solr.client.solrj.io.stream.StreamExpressionTest_79AAEAD38DA0EBD7-001\tempDir-001\node4\.
   [junit4]   2> 479249 INFO  (zkConnectionManagerCallback-5357-thread-1) [     ] o.a.s.c.c.ConnectionManager zkClient has connected
   [junit4]   2> 479249 INFO  (jetty-launcher-5291-thread-3) [n:127.0.0.1:55332_solr     ] o.a.s.c.c.ConnectionManager Client is connected to ZooKeeper
   [junit4]   2> 479257 WARN  (jetty-launcher-5291-thread-3) [n:127.0.0.1:55332_solr     ] o.a.s.c.ZkController The _default configset could not be uploaded. Please provide 'solr.default.confdir' parameter that points to a configset intended to be the default. Current 'solr.default.confdir' value: null
   [junit4]   2> 479262 INFO  (jetty-launcher-5291-thread-3) [n:127.0.0.1:55332_solr     ] o.a.s.c.c.ZkStateReader Updated live nodes from ZooKeeper... (0) -> (3)
   [junit4]   2> 479267 INFO  (jetty-launcher-5291-thread-3) [n:127.0.0.1:55332_solr     ] o.a.s.c.ZkController Publish node=127.0.0.1:55332_solr as DOWN
   [junit4]   2> 479269 INFO  (jetty-launcher-5291-thread-3) [n:127.0.0.1:55332_solr     ] o.a.s.c.TransientSolrCoreCacheDefault Allocating transient cache for 2147483647 transient cores
   [junit4]   2> 479269 INFO  (jetty-launcher-5291-thread-3) [n:127.0.0.1:55332_solr     ] o.a.s.c.ZkController Register node as live in ZooKeeper:/live_nodes/127.0.0.1:55332_solr
   [junit4]   2> 479272 INFO  (zkCallback-5335-thread-1) [     ] o.a.s.c.c.ZkStateReader Updated live nodes from ZooKeeper... (3) -> (4)
   [junit4]   2> 479272 INFO  (zkCallback-5322-thread-1) [     ] o.a.s.c.c.ZkStateReader Updated live nodes from ZooKeeper... (3) -> (4)
   [junit4]   2> 479272 INFO  (zkCallback-5331-thread-1) [     ] o.a.s.c.c.ZkStateReader Updated live nodes from ZooKeeper... (3) -> (4)
   [junit4]   2> 479272 INFO  (zkCallback-5329-thread-1) [     ] o.a.s.c.c.ZkStateReader Updated live nodes from ZooKeeper... (3) -> (4)
   [junit4]   2> 479272 INFO  (jetty-launcher-5291-thread-3) [n:127.0.0.1:55332_solr     ] o.a.s.c.c.ConnectionManager Waiting for client to connect to ZooKeeper
   [junit4]   2> 479280 INFO  (zkCallback-5356-thread-1) [     ] o.a.s.c.c.ZkStateReader Updated live nodes from ZooKeeper... (3) -> (4)
   [junit4]   2> 479287 INFO  (zkCallback-5354-thread-1) [     ] o.a.s.c.c.ZkStateReader Updated live nodes from ZooKeeper... (3) -> (4)
   [junit4]   2> 479287 INFO  (zkCallback-5349-thread-1) [     ] o.a.s.c.c.ZkStateReader Updated live nodes from ZooKeeper... (3) -> (4)
   [junit4]   2> 479292 INFO  (zkConnectionManagerCallback-5366-thread-1) [     ] o.a.s.c.c.ConnectionManager zkClient has connected
   [junit4]   2> 479292 INFO  (jetty-launcher-5291-thread-3) [n:127.0.0.1:55332_solr     ] o.a.s.c.c.ConnectionManager Client is connected to ZooKeeper
   [junit4]   2> 479293 INFO  (jetty-launcher-5291-thread-3) [n:127.0.0.1:55332_solr     ] o.a.s.c.c.ZkStateReader Updated live nodes from ZooKeeper... (0) -> (4)
   [junit4]   2> 479295 INFO  (jetty-launcher-5291-thread-3) [n:127.0.0.1:55332_solr     ] o.a.s.c.s.i.ZkClientClusterStateProvider Cluster at 127.0.0.1:55311/solr ready
   [junit4]   2> 479296 INFO  (jetty-launcher-5291-thread-3) [n:127.0.0.1:55332_solr     ] o.a.s.c.LibListener clusterprops.json changed , version -1
   [junit4]   2> 479393 INFO  (jetty-launcher-5291-thread-3) [n:127.0.0.1:55332_solr     ] o.a.s.h.a.MetricsHistoryHandler No .system collection, keeping metrics history in memory.
   [junit4]   2> 479425 INFO  (jetty-launcher-5291-thread-3) [n:127.0.0.1:55332_solr     ] o.a.s.m.r.SolrJmxReporter JMX monitoring for 'solr_55332.solr.node' (registry 'solr.node') enabled at server: com.sun.jmx.mbeanserver.JmxMBeanServer@18627a84
   [junit4]   2> 479434 INFO  (jetty-launcher-5291-thread-3) [n:127.0.0.1:55332_solr     ] o.a.s.m.r.SolrJmxReporter JMX monitoring for 'solr_55332.solr.jvm' (registry 'solr.jvm') enabled at server: com.sun.jmx.mbeanserver.JmxMBeanServer@18627a84
   [junit4]   2> 479435 INFO  (jetty-launcher-5291-thread-3) [n:127.0.0.1:55332_solr     ] o.a.s.m.r.SolrJmxReporter JMX monitoring for 'solr_55332.solr.jetty' (registry 'solr.jetty') enabled at server: com.sun.jmx.mbeanserver.JmxMBeanServer@18627a84
   [junit4]   2> 479436 INFO  (jetty-launcher-5291-thread-3) [n:127.0.0.1:55332_solr     ] o.a.s.c.CorePropertiesLocator Found 0 core definitions underneath C:\Users\jenkins\workspace\Lucene-Solr-8.x-Windows\solr\build\solr-solrj\test\J0\temp\solr.client.solrj.io.stream.StreamExpressionTest_79AAEAD38DA0EBD7-001\tempDir-001\node3\.
   [junit4]   2> 479504 INFO  (SUITE-StreamExpressionTest-seed#[79AAEAD38DA0EBD7]-worker) [     ] o.a.s.c.c.ConnectionManager Waiting for client to connect to ZooKeeper
   [junit4]   2> 479524 INFO  (zkConnectionManagerCallback-5372-thread-1) [     ] o.a.s.c.c.ConnectionManager zkClient has connected
   [junit4]   2> 479524 INFO  (SUITE-StreamExpressionTest-seed#[79AAEAD38DA0EBD7]-worker) [     ] o.a.s.c.c.ConnectionManager Client is connected to ZooKeeper
   [junit4]   2> 479527 INFO  (SUITE-StreamExpressionTest-seed#[79AAEAD38DA0EBD7]-worker) [     ] o.a.s.c.c.ZkStateReader Updated live nodes from ZooKeeper... (0) -> (4)
   [junit4]   2> 479527 INFO  (SUITE-StreamExpressionTest-seed#[79AAEAD38DA0EBD7]-worker) [     ] o.a.s.c.s.i.ZkClientClusterStateProvider Cluster at 127.0.0.1:55311/solr ready
   [junit4]   2> 479542 INFO  (qtp593843251-10935) [n:127.0.0.1:55325_solr     ] o.a.s.h.a.CollectionsHandler Invoked Collection Action :create with params collection.configName=conf&name=collection1_collection&nrtReplicas=1&action=CREATE&numShards=2&wt=javabin&version=2 and sendToOCPQueue=true
   [junit4]   2> 479566 INFO  (OverseerThreadFactory-2190-thread-1-processing-n:127.0.0.1:55325_solr) [n:127.0.0.1:55325_solr     ] o.a.s.c.a.c.CreateCollectionCmd Create collection collection1_collection
   [junit4]   2> 479691 INFO  (OverseerStateUpdate-72144657400791050-127.0.0.1:55325_solr-n_0000000000) [n:127.0.0.1:55325_solr     ] o.a.s.c.o.SliceMutator createReplica() {
   [junit4]   2>   "operation":"ADDREPLICA",
   [junit4]   2>   "collection":"collection1_collection",
   [junit4]   2>   "shard":"shard1",
   [junit4]   2>   "core":"collection1_collection_shard1_replica_n1",
   [junit4]   2>   "state":"down",
   [junit4]   2>   "base_url":"http://127.0.0.1:55325/solr",
   [junit4]   2>   "type":"NRT",
   [junit4]   2>   "waitForFinalState":"false"} 
   [junit4]   2> 479696 INFO  (OverseerStateUpdate-72144657400791050-127.0.0.1:55325_solr-n_0000000000) [n:127.0.0.1:55325_solr     ] o.a.s.c.o.SliceMutator createReplica() {
   [junit4]   2>   "operation":"ADDREPLICA",
   [junit4]   2>   "collection":"collection1_collection",
   [junit4]   2>   "shard":"shard2",
   [junit4]   2>   "core":"collection1_collection_shard2_replica_n2",
   [junit4]   2>   "state":"down",
   [junit4]   2>   "base_url":"http://127.0.0.1:55332/solr",
   [junit4]   2>   "type":"NRT",
   [junit4]   2>   "waitForFinalState":"false"} 
   [junit4]   2> 479924 INFO  (qtp593843251-10937) [n:127.0.0.1:55325_solr    x:collection1_collection_shard1_replica_n1 ] o.a.s.h.a.CoreAdminOperation core create command qt=/admin/cores&coreNodeName=core_node3&collection.configName=conf&newCollection=true&name=collection1_collection_shard1_replica_n1&action=CREATE&numShards=2&collection=collection1_collection&shard=shard1&wt=javabin&version=2&replicaType=NRT
   [junit4]   2> 479929 INFO  (qtp593843251-10937) [n:127.0.0.1:55325_solr    x:collection1_collection_shard1_replica_n1 ] o.a.s.c.TransientSolrCoreCacheDefault Allocating transient cache for 2147483647 transient cores
   [junit4]   2> 479930 INFO  (qtp2087779337-10954) [n:127.0.0.1:55332_solr    x:collection1_collection_shard2_replica_n2 ] o.a.s.h.a.CoreAdminOperation core create command qt=/admin/cores&coreNodeName=core_node4&collection.configName=conf&newCollection=true&name=collection1_collection_shard2_replica_n2&action=CREATE&numShards=2&collection=collection1_collection&shard=shard2&wt=javabin&version=2&replicaType=NRT
   [junit4]   2> 481009 INFO  (qtp593843251-10937) [n:127.0.0.1:55325_solr c:collection1_collection s:shard1 r:core_node3 x:collection1_collection_shard1_replica_n1 ] o.a.s.c.SolrConfig Using Lucene MatchVersion: 8.3.0
   [junit4]   2> 481019 INFO  (qtp593843251-10937) [n:127.0.0.1:55325_solr c:collection1_collection s:shard1 r:core_node3 x:collection1_collection_shard1_replica_n1 ] o.a.s.s.IndexSchema [collection1_collection_shard1_replica_n1] Schema name=test
   [junit4]   2> 481056 WARN  (qtp593843251-10937) [n:127.0.0.1:55325_solr c:collection1_collection s:shard1 r:core_node3 x:collection1_collection_shard1_replica_n1 ] o.a.s.s.IndexSchema Field lowerfilt1and2 is not multivalued and destination for multiple copyFields (2)
   [junit4]   2> 481056 WARN  (qtp593843251-10937) [n:127.0.0.1:55325_solr c:collection1_collection s:shard1 r:core_node3 x:collection1_collection_shard1_replica_n1 ] o.a.s.s.IndexSchema Field text is not multivalued and destination for multiple copyFields (3)
   [junit4]   2> 481056 INFO  (qtp593843251-10937) [n:127.0.0.1:55325_solr c:collection1_collection s:shard1 r:core_node3 x:collection1_collection_shard1_replica_n1 ] o.a.s.s.IndexSchema Loaded schema test/1.6 with uniqueid field id
   [junit4]   2> 481056 INFO  (qtp593843251-10937) [n:127.0.0.1:55325_solr c:collection1_collection s:shard1 r:core_node3 x:collection1_collection_shard1_replica_n1 ] o.a.s.c.CoreContainer Creating SolrCore 'collection1_collection_shard1_replica_n1' using configuration from collection collection1_collection, trusted=true
   [junit4]   2> 481056 INFO  (qtp593843251-10937) [n:127.0.0.1:55325_solr c:collection1_collection s:shard1 r:core_node3 x:collection1_collection_shard1_replica_n1 ] o.a.s.m.r.SolrJmxReporter JMX monitoring for 'solr_55325.solr.core.collection1_collection.shard1.replica_n1' (registry 'solr.core.collection1_collection.shard1.replica_n1') enabled at server: com.sun.jmx.mbeanserver.JmxMBeanServer@18627a84
   [junit4]   2> 481056 INFO  (qtp593843251-10937) [n:127.0.0.1:55325_solr c:collection1_collection s:shard1 r:core_node3 x:collection1_collection_shard1_replica_n1 ] o.a.s.c.SolrCore [[collection1_collection_shard1_replica_n1] ] Opening new SolrCore at [C:\Users\jenkins\workspace\Lucene-Solr-8.x-Windows\solr\build\solr-solrj\test\J0\temp\solr.client.solrj.io.stream.StreamExpressionTest_79AAEAD38DA0EBD7-001\tempDir-001\node1\collection1_collection_shard1_replica_n1], dataDir=[C:\Users\jenkins\workspace\Lucene-Solr-8.x-Windows\solr\build\solr-solrj\test\J0\temp\solr.client.solrj.io.stream.StreamExpressionTest_79AAEAD38DA0EBD7-001\tempDir-001\node1\.\collection1_collection_shard1_replica_n1\data\]
   [junit4]   2> 481082 INFO  (qtp2087779337-10954) [n:127.0.0.1:55332_solr c:collection1_collection s:shard2 r:core_node4 x:collection1_collection_shard2_replica_n2 ] o.a.s.c.SolrConfig Using Lucene MatchVersion: 8.3.0
   [junit4]   2> 481091 INFO  (qtp2087779337-10954) [n:127.0.0.1:55332_solr c:collection1_collection s:shard2 r:core_node4 x:collection1_collection_shard2_replica_n2 ] o.a.s.s.IndexSchema [collection1_collection_shard2_replica_n2] Schema name=test
   [junit4]   2> 481147 WARN  (qtp2087779337-10954) [n:127.0.0.1:55332_solr c:collection1_collection s:shard2 r:core_node4 x:collection1_collection_shard2_replica_n2 ] o.a.s.s.IndexSchema Field lowerfilt1and2 is not multivalued and destination for multiple copyFields (2)
   [junit4]   2> 481147 WARN  (qtp2087779337-10954) [n:127.0.0.1:55332_solr c:collection1_collection s:shard2 r:core_node4 x:collection1_collection_shard2_replica_n2 ] o.a.s.s.IndexSchema Field text is not multivalued and destination for multiple copyFields (3)
   [junit4]   2> 481147 INFO  (qtp2087779337-10954) [n:127.0.0.1:55332_solr c:collection1_collection s:shard2 r:core_node4 x:collection1_collection_shard2_replica_n2 ] o.a.s.s.IndexSchema Loaded schema test/1.6 with uniqueid field id
   [junit4]   2> 481147 INFO  (qtp2087779337-10954) [n:127.0.0.1:55332_solr c:collection1_collection s:shard2 r:core_node4 x:collection1_collection_shard2_replica_n2 ] o.a.s.c.CoreContainer Creating SolrCore 'collection1_collection_shard2_replica_n2' using configuration from collection collection1_collection, trusted=true
   [junit4]   2> 481148 INFO  (qtp2087779337-10954) [n:127.0.0.1:55332_solr c:collection1_collection s:shard2 r:core_node4 x:collection1_collection_shard2_replica_n2 ] o.a.s.m.r.SolrJmxReporter JMX monitoring for 'solr_55332.solr.core.collection1_collection.shard2.replica_n2' (registry 'solr.core.collection1_collection.shard2.replica_n2') enabled at server: com.sun.jmx.mbeanserver.JmxMBeanServer@18627a84
   [junit4]   2> 481148 INFO  (qtp2087779337-10954) [n:127.0.0.1:55332_solr c:collection1_collection s:shard2 r:core_node4 x:collection1_collection_shard2_replica_n2 ] o.a.s.c.SolrCore [[collection1_collection_shard2_replica_n2] ] Opening new SolrCore at [C:\Users\jenkins\workspace\Lucene-Solr-8.x-Windows\solr\build\solr-solrj\test\J0\temp\solr.client.solrj.io.stream.StreamExpressionTest_79AAEAD38DA0EBD7-001\tempDir-001\node3\collection1_collection_shard2_replica_n2], dataDir=[C:\Users\jenkins\workspace\Lucene-Solr-8.x-Windows\solr\build\solr-solrj\test\J0\temp\solr.client.solrj.io.stream.StreamExpressionTest_79AAEAD38DA0EBD7-001\tempDir-001\node3\.\collection1_collection_shard2_replica_n2\data\]
   [junit4]   2> 481217 INFO  (qtp593843251-10937) [n:127.0.0.1:55325_solr c:collection1_collection s:shard1 r:core_node3 x:collection1_collection_shard1_replica_n1 ] o.a.s.u.UpdateHandler Using UpdateLog implementation: org.apache.solr.update.UpdateLog
   [junit4]   2> 481217 INFO  (qtp593843251-10937) [n:127.0.0.1:55325_solr c:collection1_collection s:shard1 r:core_node3 x:collection1_collection_shard1_replica_n1 ] o.a.s.u.UpdateLog Initializing UpdateLog: dataDir= defaultSyncLevel=FLUSH numRecordsToKeep=100 maxNumLogsToKeep=10 numVersionBuckets=65536
   [junit4]   2> 481220 INFO  (qtp593843251-10937) [n:127.0.0.1:55325_solr c:collection1_collection s:shard1 r:core_node3 x:collection1_collection_shard1_replica_n1 ] o.a.s.u.CommitTracker Hard AutoCommit: disabled
   [junit4]   2> 481220 INFO  (qtp593843251-10937) [n:127.0.0.1:55325_solr c:collection1_collection s:shard1 r:core_node3 x:collection1_collection_shard1_replica_n1 ] o.a.s.u.CommitTracker Soft AutoCommit: disabled
   [junit4]   2> 481236 INFO  (qtp593843251-10937) [n:127.0.0.1:55325_solr c:collection1_collection s:shard1 r:core_node3 x:collection1_collection_shard1_replica_n1 ] o.a.s.s.SolrIndexSearcher Opening [Searcher@174a8ab1[collection1_collection_shard1_replica_n1] main]
   [junit4]   2> 481237 INFO  (qtp593843251-10937) [n:127.0.0.1:55325_solr c:collection1_collection s:shard1 r:core_node3 x:collection1_collection_shard1_replica_n1 ] o.a.s.r.ManagedResourceStorage Configured ZooKeeperStorageIO with znodeBase: /configs/conf
   [junit4]   2> 481237 INFO  (qtp593843251-10937) [n:127.0.0.1:55325_solr c:collection1_collection s:shard1 r:core_node3 x:collection1_collection_shard1_replica_n1 ] o.a.s.r.ManagedResourceStorage Loaded null at path _rest_managed.json using ZooKeeperStorageIO:path=/configs/conf
   [junit4]   2> 481237 INFO  (qtp593843251-10937) [n:127.0.0.1:55325_solr c:collection1_collection s:shard1 r:core_node3 x:collection1_collection_shard1_replica_n1 ] o.a.s.h.ReplicationHandler Commits will be reserved for 10000ms.
   [junit4]   2> 481237 INFO  (qtp593843251-10937) [n:127.0.0.1:55325_solr c:collection1_collection s:shard1 r:core_node3 x:collection1_collection_shard1_replica_n1 ] o.a.s.u.UpdateLog Could not find max version in index or recent updates, using new clock 1640071763307003904
   [junit4]   2> 481242 INFO  (searcherExecutor-2203-thread-1-processing-n:127.0.0.1:55325_solr x:collection1_collection_shard1_replica_n1 c:collection1_collection s:shard1 r:core_node3) [n:127.0.0.1:55325_solr c:collection1_collection s:shard1 r:core_node3 x:collection1_collection_shard1_replica_n1 ] o.a.s.c.SolrCore [collection1_collection_shard1_replica_n1] Registered new searcher Searcher@174a8ab1[collection1_collection_shard1_replica_n1] main{ExitableDirectoryReader(UninvertingDirectoryReader())}
   [junit4]   2> 481244 INFO  (qtp593843251-10937) [n:127.0.0.1:55325_solr c:collection1_collection s:shard1 r:core_node3 x:collection1_collection_shard1_replica_n1 ] o.a.s.c.ZkShardTerms Successful update of terms at /collections/collection1_collection/terms/shard1 to Terms{values={core_node3=0}, version=0}
   [junit4]   2> 481244 INFO  (qtp593843251-10937) [n:127.0.0.1:55325_solr c:collection1_collection s:shard1 r:core_node3 x:collection1_collection_shard1_replica_n1 ] o.a.s.c.ShardLeaderElectionContextBase make sure parent is created /collections/collection1_collection/leaders/shard1
   [junit4]   2> 481249 INFO  (qtp593843251-10937) [n:127.0.0.1:55325_solr c:collection1_collection s:shard1 r:core_node3 x:collection1_collection_shard1_replica_n1 ] o.a.s.c.ShardLeaderElectionContext Enough replicas found to continue.
   [junit4]   2> 481249 INFO  (qtp593843251-10937) [n:127.0.0.1:55325_solr c:collection1_collection s:shard1 r:core_node3 x:collection1_collection_shard1_replica_n1 ] o.a.s.c.ShardLeaderElectionContext I may be the new leader - try and sync
   [junit4]   2> 481249 INFO  (qtp593843251-10937) [n:127.0.0.1:55325_solr c:collection1_collection s:shard1 r:core_node3 x:collection1_collection_shard1_replica_n1 ] o.a.s.c.SyncStrategy Sync replicas to http://127.0.0.1:55325/solr/collection1_collection_shard1_replica_n1/
   [junit4]   2> 481249 INFO  (qtp593843251-10937) [n:127.0.0.1:55325_solr c:collection1_collection s:shard1 r:core_node3 x:collection1_collection_shard1_replica_n1 ] o.a.s.c.SyncStrategy Sync Success - now sync replicas to me
   [junit4]   2> 481249 INFO  (qtp593843251-10937) [n:127.0.0.1:55325_solr c:collection1_collection s:shard1 r:core_node3 x:collection1_collection_shard1_replica_n1 ] o.a.s.c.SyncStrategy http://127.0.0.1:55325/solr/collection1_collection_shard1_replica_n1/ has no replicas
   [junit4]   2> 481249 INFO  (qtp593843251-10937) [n:127.0.0.1:55325_solr c:collection1_collection s:shard1 r:core_node3 x:collection1_collection_shard1_replica_n1 ] o.a.s.c.ShardLeaderElectionContextBase Creating leader registration node /collections/collection1_collection/leaders/shard1/leader after winning as /collections/collection1_collection/leader_elect/shard1/election/72144657400791050-core_node3-n_0000000000
   [junit4]   2> 481251 INFO  (qtp593843251-10937) [n:127.0.0.1:55325_solr c:collection1_collection s:shard1 r:core_node3 x:collection1_collection_shard1_replica_n1 ] o.a.s.c.ShardLeaderElectionContext I am the new leader: http://127.0.0.1:55325/solr/collection1_collection_shard1_replica_n1/ shard1
   [junit4]   2> 481262 INFO  (qtp2087779337-10954) [n:127.0.0.1:55332_solr c:collection1_collection s:shard2 r:core_node4 x:collection1_collection_shard2_replica_n2 ] o.a.s.u.UpdateHandler Using UpdateLog implementation: org.apache.solr.update.UpdateLog
   [junit4]   2> 481262 INFO  (qtp2087779337-10954) [n:127.0.0.1:55332_solr c:collection1_collection s:shard2 r:core_node4 x:collection1_collection_shard2_replica_n2 ] o.a.s.u.UpdateLog Initializing UpdateLog: dataDir= defaultSyncLevel=FLUSH numRecordsToKeep=100 maxNumLogsToKeep=10 numVersionBuckets=65536
   [junit4]   2> 481264 INFO  (qtp2087779337-10954) [n:127.0.0.1:55332_solr c:collection1_collection s:shard2 r:core_node4 x:collection1_collection_shard2_replica_n2 ] o.a.s.u.CommitTracker Hard AutoCommit: disabled
   [junit4]   2> 481264 INFO  (qtp2087779337-10954) [n:127.0.0.1:55332_solr c:collection1_collection s:shard2 r:core_node4 x:collection1_collection_shard2_replica_n2 ] o.a.s.u.CommitTracker Soft AutoCommit: disabled
   [junit4]   2> 481271 INFO  (qtp2087779337-10954) [n:127.0.0.1:55332_solr c:collection1_collection s:shard2 r:core_node4 x:collection1_collection_shard2_replica_n2 ] o.a.s.s.SolrIndexSearcher Opening [Searcher@a2d026e[collection1_collection_shard2_replica_n2] main]
   [junit4]   2> 481278 INFO  (qtp2087779337-10954) [n:127.0.0.1:55332_solr c:collection1_collection s:shard2 r:core_node4 x:collection1_collection_shard2_replica_n2 ] o.a.s.r.ManagedResourceStorage Configured ZooKeeperStorageIO with znodeBase: /configs/conf
   [junit4]   2> 481280 INFO  (qtp2087779337-10954) [n:127.0.0.1:55332_solr c:collection1_collection s:shard2 r:core_node4 x:collection1_collection_shard2_replica_n2 ] o.a.s.r.ManagedResourceStorage Loaded null at path _rest_managed.json using ZooKeeperStorageIO:path=/configs/conf
   [junit4]   2> 481280 INFO  (qtp2087779337-10954) [n:127.0.0.1:55332_solr c:collection1_collection s:shard2 r:core_node4 x:collection1_collection_shard2_replica_n2 ] o.a.s.h.ReplicationHandler Commits will be reserved for 10000ms.
   [junit4]   2> 481280 INFO  (qtp2087779337-10954) [n:127.0.0.1:55332_solr c:collection1_collection s:shard2 r:core_node4 x:collection1_collection_shard2_replica_n2 ] o.a.s.u.UpdateLog Could not find max version in index or recent updates, using new clock 1640071763352092672
   [junit4]   2> 481283 INFO  (searcherExecutor-2204-thread-1-processing-n:127.0.0.1:55332_solr x:collection1_collection_shard2_replica_n2 c:collection1_collection s:shard2 r:core_node4) [n:127.0.0.1:55332_solr c:collection1_collection s:shard2 r:core_node4 x:collection1_collection_shard2_replica_n2 ] o.a.s.c.SolrCore [collection1_collection_shard2_replica_n2] Registered new searcher Searcher@a2d026e[collection1_collection_shard2_replica_n2] main{ExitableDirectoryReader(UninvertingDirectoryReader())}
   [junit4]   2> 481287 INFO  (qtp2087779337-10954) [n:127.0.0.1:55332_solr c:collection1_collection s:shard2 r:core_node4 x:collection1_collection_shard2_replica_n2 ] o.a.s.c.ZkShardTerms Successful update of terms at /collections/collection1_collection/terms/shard2 to Terms{values={core_node4=0}, version=0}
   [junit4]   2> 481287 INFO  (qtp2087779337-10954) [n:127.0.0.1:55332_solr c:collection1_collection s:shard2 r:core_node4 x:collection1_collection_shard2_replica_n2 ] o.a.s.c.ShardLeaderElectionContextBase make sure parent is created /collections/collection1_collection/leaders/shard2
   [junit4]   2> 481290 INFO  (qtp2087779337-10954) [n:127.0.0.1:55332_solr c:collection1_collection s:shard2 r:core_node4 x:collection1_collection_shard2_replica_n2 ] o.a.s.c.ShardLeaderElectionContext Enough replicas found to continue.
   [junit4]   2> 481290 INFO  (qtp2087779337-10954) [n:127.0.0.1:55332_solr c:collection1_collection s:shard2 r:core_node4 x:collection1_collection_shard2_replica_n2 ] o.a.s.c.ShardLeaderElectionContext I may be the new leader - try and sync
   [junit4]   2> 481290 INFO  (qtp2087779337-10954) [n:127.0.0.1:55332_solr c:collection1_collection s:shard2 r:core_node4 x:collection1_collection_shard2_replica_n2 ] o.a.s.c.SyncStrategy Sync replicas to http://127.0.0.1:55332/solr/collection1_collection_shard2_replica_n2/
   [junit4]   2> 481291 INFO  (qtp2087779337-10954) [n:127.0.0.1:55332_solr c:collection1_collection s:shard2 r:core_node4 x:collection1_collection_shard2_replica_n2 ] o.a.s.c.SyncStrategy Sync Success - now sync replicas to me
   [junit4]   2> 481291 INFO  (qtp2087779337-10954) [n:127.0.0.1:55332_solr c:collection1_collection s:shard2 r:core_node4 x:collection1_collection_shard2_replica_n2 ] o.a.s.c.SyncStrategy http://127.0.0.1:55332/solr/collection1_collection_shard2_replica_n2/ has no replicas
   [junit4]   2> 481291 INFO  (qtp2087779337-10954) [n:127.0.0.1:55332_solr c:collection1_collection s:shard2 r:core_node4 x:collection1_collection_shard2_replica_n2 ] o.a.s.c.ShardLeaderElectionContextBase Creating leader registration node /collections/collection1_collection/leaders/shard2/leader after winning as /collections/collection1_collection/leader_elect/shard2/election/72144657400791057-core_node4-n_0000000000
   [junit4]   2> 481292 INFO  (qtp2087779337-10954) [n:127.0.0.1:55332_solr c:collection1_collection s:shard2 r:core_node4 x:collection1_collection_shard2_replica_n2 ] o.a.s.c.ShardLeaderElectionContext I am the new leader: http://127.0.0.1:55332/solr/collection1_collection_shard2_replica_n2/ shard2
   [junit4]   2> 481400 INFO  (zkCallback-5356-thread-1) [     ] o.a.s.c.c.ZkStateReader A cluster state change: [WatchedEvent state:SyncConnected type:NodeDataChanged path:/collections/collection1_collection/state.json] for collection [collection1_collection] has occurred - updating... (live nodes size: [4])
   [junit4]   2> 481400 INFO  (zkCallback-5322-thread-1) [     ] o.a.s.c.c.ZkStateReader A cluster state change: [WatchedEvent state:SyncConnected type:NodeDataChanged path:/collections/collection1_collection/state.json] for collection [collection1_collection] has occurred - updating... (live nodes size: [4])
   [junit4]   2> 481400 INFO  (zkCallback-5356-thread-2) [     ] o.a.s.c.c.ZkStateReader A cluster state change: [WatchedEvent state:SyncConnected type:NodeDataChanged path:/collections/collection1_collection/state.json] for collection [collection1_collection] has occurred - updating... (live nodes size: [4])
   [junit4]   2> 481400 INFO  (zkCallback-5322-thread-2) [     ] o.a.s.c.c.ZkStateReader A cluster state change: [WatchedEvent state:SyncConnected type:NodeDataChanged path:/collections/collection1_collection/state.json] for collection [collection1_collection] has occurred - updating... (live nodes size: [4])
   [junit4]   2> 481401 INFO  (qtp2087779337-10954) [n:127.0.0.1:55332_solr c:collection1_collection s:shard2 r:core_node4 x:collection1_collection_shard2_replica_n2 ] o.a.s.c.ZkController I am the leader, no recovery necessary
   [junit4]   2> 481401 INFO  (qtp593843251-10937) [n:127.0.0.1:55325_solr c:collection1_collection s:shard1 r:core_node3 x:collection1_collection_shard1_replica_n1 ] o.a.s.c.ZkController I am the leader, no recovery necessary
   [junit4]   2> 481410 INFO  (qtp593843251-10937) [n:127.0.0.1:55325_solr c:collection1_collection s:shard1 r:core_node3 x:collection1_collection_shard1_replica_n1 ] o.a.s.s.HttpSolrCall [admin] webapp=null path=/admin/cores params={qt=/admin/cores&coreNodeName=core_node3&collection.configName=conf&newCollection=true&name=collection1_collection_shard1_replica_n1&action=CREATE&numShards=2&collection=collection1_collection&shard=shard1&wt=javabin&version=2&replicaType=NRT} status=0 QTime=1411
   [junit4]   2> 481410 INFO  (qtp2087779337-10954) [n:127.0.0.1:55332_solr c:collection1_collection s:shard2 r:core_node4 x:collection1_collection_shard2_replica_n2 ] o.a.s.s.HttpSolrCall [admin] webapp=null path=/admin/cores params={qt=/admin/cores&coreNodeName=core_node4&collection.configName=conf&newCollection=true&name=collection1_collection_shard2_replica_n2&action=CREATE&numShards=2&collection=collection1_collection&shard=shard2&wt=javabin&version=2&replicaType=NRT} status=0 QTime=1406
   [junit4]   2> 481412 INFO  (qtp593843251-10935) [n:127.0.0.1:55325_solr     ] o.a.s.h.a.CollectionsHandler Wait for new collection to be active for at most 45 seconds. Check all shard replicas
   [junit4]   2> 481511 INFO  (zkCallback-5322-thread-2) [     ] o.a.s.c.c.ZkStateReader A cluster state change: [WatchedEvent state:SyncConnected type:NodeDataChanged path:/collections/collection1_collection/state.json] for collection [collection1_collection] has occurred - updating... (live nodes size: [4])
   [junit4]   2> 481511 INFO  (zkCallback-5322-thread-3) [     ] o.a.s.c.c.ZkStateReader A cluster state change: [WatchedEvent state:SyncConnected type:NodeDataChanged path:/collections/collection1_collection/state.json] for collection [collection1_collection] has occurred - updating... (live nodes size: [4])
   [junit4]   2> 481511 INFO  (zkCallback-5322-thread-1) [     ] o.a.s.c.c.ZkStateReader A cluster state change: [WatchedEvent state:SyncConnected type:NodeDataChanged path:/collections/collection1_collection/state.json] for collection [collection1_collection] has occurred - updating... (live nodes size: [4])
   [junit4]   2> 481511 INFO  (zkCallback-5356-thread-2) [     ] o.a.s.c.c.ZkStateReader A cluster state change: [WatchedEvent state:SyncConnected type:NodeDataChanged path:/collections/collection1_collection/state.json] for collection [collection1_collection] has occurred - updating... (live nodes size: [4])
   [junit4]   2> 481511 INFO  (zkCallback-5356-thread-1) [     ] o.a.s.c.c.ZkStateReader A cluster state change: [WatchedEvent state:SyncConnected type:NodeDataChanged path:/collections/collection1_collection/state.json] for collection [collection1_collection] has occurred - updating... (live nodes size: [4])
   [junit4]   2> 481513 INFO  (qtp593843251-10935) [n:127.0.0.1:55325_solr     ] o.a.s.s.HttpSolrCall [admin] webapp=null path=/admin/collections params={collection.configName=conf&name=collection1_collection&nrtReplicas=1&action=CREATE&numShards=2&wt=javabin&version=2} status=0 QTime=1873
   [junit4]   2> 481514 INFO  (zkCallback-5356-thread-3) [     ] o.a.s.c.c.ZkStateReader A cluster state change: [WatchedEvent state:SyncConnected type:NodeDataChanged path:/collections/collection1_collection/state.json] for collection [collection1_collection] has occurred - updating... (live nodes size: [4])
   [junit4]   2> 481515 INFO  (qtp593843251-10938) [n:127.0.0.1:55325_solr     ] o.a.s.h.a.CollectionsHandler Invoked Collection Action :createalias with params collections=collection1_collection&name=collection1&action=CREATEALIAS&wt=javabin&version=2 and sendToOCPQueue=true
   [junit4]   2> 481518 INFO  (OverseerCollectionConfigSetProcessor-72144657400791050-127.0.0.1:55325_solr-n_0000000000) [n:127.0.0.1:55325_solr     ] o.a.s.c.OverseerTaskQueue Response ZK path: /overseer/collection-queue-work/qnr-0000000000 doesn't exist.  Requestor may have disconnected from ZooKeeper
   [junit4]   2> 481627 INFO  (qtp593843251-10938) [n:127.0.0.1:55325_solr     ] o.a.s.s.HttpSolrCall [admin] webapp=null path=/admin/collections params={collections=collection1_collection&name=collection1&action=CREATEALIAS&wt=javabin&version=2} status=0 QTime=107
   [junit4]   2> 481628 INFO  (qtp593843251-10939) [n:127.0.0.1:55325_solr     ] o.a.s.h.a.CollectionsHandler Invoked Collection Action :create with params collection.configName=conf&name=filestream_collection&nrtReplicas=1&action=CREATE&numShards=1&wt=javabin&version=2 and sendToOCPQueue=true
   [junit4]   2> 481631 INFO  (OverseerCollectionConfigSetProcessor-72144657400791050-127.0.0.1:55325_solr-n_0000000000) [n:127.0.0.1:55325_solr     ] o.a.s.c.OverseerTaskQueue Response ZK path: /overseer/collection-queue-work/qnr-0000000002 doesn't exist.  Requestor may have disconnected from ZooKeeper
   [junit4]   2> 481633 INFO  (OverseerThreadFactory-2190-thread-3-processing-n:127.0.0.1:55325_solr) [n:127.0.0.1:55325_solr     ] o.a.s.c.a.c.CreateCollectionCmd Create collection filestream_collection
   [junit4]   2> 481857 INFO  (OverseerStateUpdate-72144657400791050-127.0.0.1:55325_solr-n_0000000000) [n:127.0.0.1:55325_solr     ] o.a.s.c.o.SliceMutator createReplica() {
   [junit4]   2>   "operation":"ADDREPLICA",
   [junit4]   2>   "collection":"filestream_collection",
   [junit4]   2>   "shard":"shard1",
   [junit4]   2>   "core":"filestream_collection_shard1_replica_n1",
   [junit4]   2>   "state":"down",
   [junit4]   2>   "base_url":"http://127.0.0.1:55325/solr",
   [junit4]   2>   "type":"NRT",
   [junit4]   2>   "waitForFinalState":"false"} 
   [junit4]   2> 482069 INFO  (qtp593843251-10941) [n:127.0.0.1:55325_solr    x:filestream_collection_shard1_replica_n1 ] o.a.s.h.a.CoreAdminOperation core create command qt=/admin/cores&coreNodeName=core_node2&collection.configName=conf&newCollection=true&name=filestream_collection_shard1_replica_n1&action=CREATE&numShards=1&collection=filestream_collection&shard=shard1&wt=javabin&version=2&replicaType=NRT
   [junit4]   2> 483196 INFO  (qtp593843251-10941) [n:127.0.0.1:55325_solr c:filestream_collection s:shard1 r:core_node2 x:filestream_collection_shard1_replica_n1 ] o.a.s.c.SolrConfig Using Lucene MatchVersion: 8.3.0
   [junit4]   2> 483226 INFO  (qtp593843251-10941) [n:127.0.0.1:55325_solr c:filestream_collection s:shard1 r:core_node2 x:filestream_collection_shard1_replica_n1 ] o.a.s.s.IndexSchema [filestream_collection_shard1_replica_n1] Schema name=test
   [junit4]   2> 483266 WARN  (qtp593843251-10941) [n:127.0.0.1:55325_solr c:filestream_collection s:shard1 r:core_node2 x:filestream_collection_shard1_replica_n1 ] o.a.s.s.IndexSchema Field lowerfilt1and2 is not multivalued and destination for multiple copyFields (2)
   [junit4]   2> 483266 WARN  (qtp593843251-10941) [n:127.0.0.1:55325_solr c:filestream_collection s:shard1 r:core_node2 x:filestream_collection_shard1_replica_n1 ] o.a.s.s.IndexSchema Field text is not multivalued and destination for multiple copyFields (3)
   [junit4]   2> 483266 INFO  (qtp593843251-10941) [n:127.0.0.1:55325_solr c:filestream_collection s:shard1 r:core_node2 x:filestream_collection_shard1_replica_n1 ] o.a.s.s.IndexSchema Loaded schema test/1.6 with uniqueid field id
   [junit4]   2> 483266 INFO  (qtp593843251-10941) [n:127.0.0.1:55325_solr c:filestream_collection s:shard1 r:core_node2 x:filestream_collection_shard1_replica_n1 ] o.a.s.c.CoreContainer Creating SolrCore 'filestream_collection_shard1_replica_n1' using configuration from collection filestream_collection, trusted=true
   [junit4]   2> 483267 INFO  (qtp593843251-10941) [n:127.0.0.1:55325_solr c:filestream_collection s:shard1 r:core_node2 x:filestream_collection_shard1_replica_n1 ] o.a.s.m.r.SolrJmxReporter JMX monitoring for 'solr_55325.solr.core.filestream_collection.shard1.replica_n1' (registry 'solr.core.filestream_collection.shard1.replica_n1') enabled at server: com.sun.jmx.mbeanserver.JmxMBeanServer@18627a84
   [junit4]   2> 483267 INFO  (qtp593843251-10941) [n:127.0.0.1:55325_solr c:filestream_collection s:shard1 r:core_no

[...truncated too long message...]

73-thread-1) [     ] o.a.s.c.Overseer Overseer (id=72144778609098762-127.0.0.1:49266_solr-n_0000000000) closing
   [junit4]   2> 106961 INFO  (jetty-closer-959-thread-1) [     ] o.e.j.s.AbstractConnector Stopped ServerConnector@7b5533f4{HTTP/1.1,[http/1.1, h2c]}{127.0.0.1:0}
   [junit4]   2> 106962 INFO  (jetty-closer-959-thread-1) [     ] o.e.j.s.h.ContextHandler Stopped o.e.j.s.ServletContextHandler@808caa4{/solr,null,UNAVAILABLE}
   [junit4]   2> 106963 INFO  (jetty-closer-959-thread-1) [     ] o.e.j.s.session node0 Stopped scavenging
   [junit4]   2> 107016 INFO  (jetty-closer-959-thread-2) [     ] o.a.s.c.Overseer Overseer (id=72144778609098762-127.0.0.1:49266_solr-n_0000000000) closing
   [junit4]   2> 107359 INFO  (zkCallback-722-thread-1) [     ] o.a.s.c.c.ZkStateReader Updated live nodes from ZooKeeper... (3) -> (0)
   [junit4]   2> 107359 INFO  (zkCallback-698-thread-1) [     ] o.a.s.c.c.ZkStateReader Updated live nodes from ZooKeeper... (3) -> (0)
   [junit4]   2> 107362 INFO  (jetty-closer-959-thread-3) [     ] o.e.j.s.AbstractConnector Stopped ServerConnector@39af8621{HTTP/1.1,[http/1.1, h2c]}{127.0.0.1:0}
   [junit4]   2> 107363 INFO  (jetty-closer-959-thread-3) [     ] o.e.j.s.h.ContextHandler Stopped o.e.j.s.ServletContextHandler@7c39be4f{/solr,null,UNAVAILABLE}
   [junit4]   2> 107364 INFO  (jetty-closer-959-thread-3) [     ] o.e.j.s.session node0 Stopped scavenging
   [junit4]   2> 107478 INFO  (jetty-closer-959-thread-2) [     ] o.e.j.s.AbstractConnector Stopped ServerConnector@51c9aac2{HTTP/1.1,[http/1.1, h2c]}{127.0.0.1:0}
   [junit4]   2> 107479 INFO  (jetty-closer-959-thread-2) [     ] o.e.j.s.h.ContextHandler Stopped o.e.j.s.ServletContextHandler@1558c00d{/solr,null,UNAVAILABLE}
   [junit4]   2> 107479 INFO  (jetty-closer-959-thread-2) [     ] o.e.j.s.session node0 Stopped scavenging
   [junit4]   2> 107593 INFO  (jetty-closer-959-thread-4) [     ] o.e.j.s.AbstractConnector Stopped ServerConnector@2c63c722{HTTP/1.1,[http/1.1, h2c]}{127.0.0.1:0}
   [junit4]   2> 107594 INFO  (jetty-closer-959-thread-4) [     ] o.e.j.s.h.ContextHandler Stopped o.e.j.s.ServletContextHandler@251b1da6{/solr,null,UNAVAILABLE}
   [junit4]   2> 107594 INFO  (jetty-closer-959-thread-4) [     ] o.e.j.s.session node0 Stopped scavenging
   [junit4]   2> 107595 INFO  (SUITE-StreamExpressionTest-seed#[79AAEAD38DA0EBD7]-worker) [     ] o.a.s.c.ZkTestServer Shutting down ZkTestServer.
   [junit4]   2> 107832 WARN  (ZkTestServer Run Thread) [     ] o.a.s.c.ZkTestServer Watch limit violations: 
   [junit4]   2> Maximum concurrent create/delete watches above limit:
   [junit4]   2> 
   [junit4]   2> 	45	/solr/clusterprops.json
   [junit4]   2> 	45	/solr/aliases.json
   [junit4]   2> 	6	/solr/collections/collection2/state.json
   [junit4]   2> 	4	/solr/security.json
   [junit4]   2> 	4	/solr/collections/collection2/terms/shard1
   [junit4]   2> 	3	/solr/configs/conf
   [junit4]   2> 	3	/solr/collections/collection1_collection/terms/shard1
   [junit4]   2> 	3	/solr/collections/collection1_collection/terms/shard2
   [junit4]   2> 	2	/solr/collections/collection1_collection/collectionprops.json
   [junit4]   2> 	2	/solr/collections/collection2/terms/shard2
   [junit4]   2> 	2	/solr/collections/collection2/collectionprops.json
   [junit4]   2> 	2	/solr/collections/filestream_collection/terms/shard1
   [junit4]   2> 
   [junit4]   2> Maximum concurrent data watches above limit:
   [junit4]   2> 
   [junit4]   2> 	45	/solr/clusterstate.json
   [junit4]   2> 	25	/solr/collections/collection1_collection/state.json
   [junit4]   2> 	19	/solr/collections/collection2/state.json
   [junit4]   2> 	13	/solr/collections/filestream_collection/state.json
   [junit4]   2> 	9	/solr/aliases.json
   [junit4]   2> 	2	/solr/overseer_elect/election/72144778609098762-127.0.0.1:49266_solr-n_0000000000
   [junit4]   2> 
   [junit4]   2> Maximum concurrent children watches above limit:
   [junit4]   2> 
   [junit4]   2> 	83	/solr/collections
   [junit4]   2> 	72	/solr/live_nodes
   [junit4]   2> 	44	/solr/overseer/queue
   [junit4]   2> 	17	/solr/overseer/collection-queue-work
   [junit4]   2> 
   [junit4]   2> 107839 INFO  (SUITE-StreamExpressionTest-seed#[79AAEAD38DA0EBD7]-worker) [     ] o.a.s.c.ZkTestServer parse host and port list: 127.0.0.1:49253
   [junit4]   2> 107839 INFO  (SUITE-StreamExpressionTest-seed#[79AAEAD38DA0EBD7]-worker) [     ] o.a.s.c.ZkTestServer connecting to 127.0.0.1 49253
   [junit4]   2> NOTE: leaving temporary files on disk at: C:\Users\jenkins\workspace\Lucene-Solr-8.x-Windows\solr\build\solr-solrj\test\J0\temp\solr.client.solrj.io.stream.StreamExpressionTest_79AAEAD38DA0EBD7-003
   [junit4]   2> NOTE: test params are: codec=Asserting(Lucene80): {level1_s=BlockTreeOrds(blocksize=128), test_t=PostingsFormat(name=MockRandom), s_multi=PostingsFormat(name=MockRandom), level2_s=PostingsFormat(name=Direct), diseases_s=BlockTreeOrds(blocksize=128), a_s=PostingsFormat(name=MockRandom), multiDefault=PostingsFormat(name=LuceneFixedGap), a_t=PostingsFormat(name=Direct), id=BlockTreeOrds(blocksize=128), text=PostingsFormat(name=MockRandom), symptoms_s=PostingsFormat(name=Direct)}, docValues:{i_multi=DocValuesFormat(name=Direct), diseases_s=DocValuesFormat(name=Direct), multiDefault=DocValuesFormat(name=Asserting), price_f=DocValuesFormat(name=Asserting), a_f=DocValuesFormat(name=Asserting), intDefault=DocValuesFormat(name=Lucene80), a_i=DocValuesFormat(name=Direct), test_dt=DocValuesFormat(name=Direct), symptoms_s=DocValuesFormat(name=Lucene80), level1_s=DocValuesFormat(name=Direct), s_multi=DocValuesFormat(name=Lucene80), level2_s=DocValuesFormat(name=Lucene80), a_s=DocValuesFormat(name=Lucene80), _version_=DocValuesFormat(name=Lucene80), id=DocValuesFormat(name=Direct), cases_i=DocValuesFormat(name=Lucene80), timestamp=DocValuesFormat(name=Lucene80)}, maxPointsInLeafNode=1981, maxMBSortInHeap=6.683322664823127, sim=Asserting(org.apache.lucene.search.similarities.AssertingSimilarity@1a4a1f50), locale=sk-SK, timezone=Europe/San_Marino
   [junit4]   2> NOTE: Windows 10 10.0 amd64/Oracle Corporation 1.8.0_201 (64-bit)/cpus=3,threads=1,free=61956712,total=267386880
   [junit4]   2> NOTE: All tests run in this JVM: [StreamExpressionTest, StreamExpressionTest, StreamExpressionTest]
   [junit4] Completed [5/5 (5!)] on J0 in 21.30s, 27 tests, 1 failure, 4 skipped <<< FAILURES!
   [junit4] 
   [junit4] 
   [junit4] Tests with failures [seed: 79AAEAD38DA0EBD7]:
   [junit4]   - org.apache.solr.client.solrj.io.stream.StreamExpressionTest.testFileStreamDirectoryCrawl
   [junit4]   - org.apache.solr.client.solrj.io.stream.StreamExpressionTest.testFileStreamDirectoryCrawl
   [junit4]   - org.apache.solr.client.solrj.io.stream.StreamExpressionTest.testFileStreamDirectoryCrawl
   [junit4]   - org.apache.solr.client.solrj.io.stream.StreamExpressionTest.testFileStreamDirectoryCrawl
   [junit4]   - org.apache.solr.client.solrj.io.stream.StreamExpressionTest.testFileStreamDirectoryCrawl
   [junit4] 
   [junit4] 
   [junit4] JVM J0:     0.46 ..   110.88 =   110.42s
   [junit4] JVM J1:     0.46 ..    89.56 =    89.09s
   [junit4] Execution time total: 1 minute 50 seconds
   [junit4] Tests summary: 5 suites, 135 tests, 5 failures, 20 ignored (20 assumptions)

BUILD FAILED
C:\Users\jenkins\workspace\Lucene-Solr-8.x-Windows\lucene\common-build.xml:1572: The following error occurred while executing this line:
C:\Users\jenkins\workspace\Lucene-Solr-8.x-Windows\lucene\common-build.xml:1099: There were test failures: 5 suites, 135 tests, 5 failures, 20 ignored (20 assumptions) [seed: 79AAEAD38DA0EBD7]

Total time: 1 minute 51 seconds

[repro] Setting last failure code to 1

[repro] Failures:
[repro]   5/5 failed: org.apache.solr.client.solrj.io.stream.StreamExpressionTest
[repro] Exiting with code 1

C:\Users\jenkins\workspace\Lucene-Solr-8.x-Windows>IF EXIST lucene\build move /y lucene\build lucene\build.repro 
        1 dir(s) moved.

C:\Users\jenkins\workspace\Lucene-Solr-8.x-Windows>IF EXIST solr\build move /y solr\build solr\build.repro 
        1 dir(s) moved.

C:\Users\jenkins\workspace\Lucene-Solr-8.x-Windows>IF EXIST lucene\build.orig move /y lucene\build.orig lucene\build 
        1 dir(s) moved.

C:\Users\jenkins\workspace\Lucene-Solr-8.x-Windows>IF EXIST solr\build.orig move /y solr\build.orig solr\build 
        1 dir(s) moved.

C:\Users\jenkins\workspace\Lucene-Solr-8.x-Windows>exit 0 
Archiving artifacts
Setting ANT_1_8_2_HOME=C:\Users\jenkins\tools\hudson.tasks.Ant_AntInstallation\ANT_1.8.2
[WARNINGS] Parsing warnings in console log with parser Java Compiler (javac)
Setting ANT_1_8_2_HOME=C:\Users\jenkins\tools\hudson.tasks.Ant_AntInstallation\ANT_1.8.2
No credentials specified
Setting ANT_1_8_2_HOME=C:\Users\jenkins\tools\hudson.tasks.Ant_AntInstallation\ANT_1.8.2
<Git Blamer> Using GitBlamer to create author and commit information for all warnings.
<Git Blamer> GIT_COMMIT=e4ed92c4c5ccac31e0de83d9395b83f7dda3a775, workspace=C:\Users\jenkins\workspace\Lucene-Solr-8.x-Windows
[WARNINGS] Computing warning deltas based on reference build #380
Recording test results
Setting ANT_1_8_2_HOME=C:\Users\jenkins\tools\hudson.tasks.Ant_AntInstallation\ANT_1.8.2
Build step 'Publish JUnit test result report' changed build result to UNSTABLE
Email was triggered for: Unstable (Test Failures)
Sending email for trigger: Unstable (Test Failures)
Setting ANT_1_8_2_HOME=C:\Users\jenkins\tools\hudson.tasks.Ant_AntInstallation\ANT_1.8.2
Setting ANT_1_8_2_HOME=C:\Users\jenkins\tools\hudson.tasks.Ant_AntInstallation\ANT_1.8.2
Setting ANT_1_8_2_HOME=C:\Users\jenkins\tools\hudson.tasks.Ant_AntInstallation\ANT_1.8.2
Setting ANT_1_8_2_HOME=C:\Users\jenkins\tools\hudson.tasks.Ant_AntInstallation\ANT_1.8.2
Setting ANT_1_8_2_HOME=C:\Users\jenkins\tools\hudson.tasks.Ant_AntInstallation\ANT_1.8.2
Setting ANT_1_8_2_HOME=C:\Users\jenkins\tools\hudson.tasks.Ant_AntInstallation\ANT_1.8.2

Mime
View raw message