lucene-dev mailing list archives

Site index · List index
Message view « Date » · « Thread »
Top « Date » · « Thread »
From Policeman Jenkins Server <jenk...@thetaphi.de>
Subject [JENKINS] Lucene-Solr-8.x-Linux (64bit/jdk1.8.0_201) - Build # 911 - Still Unstable!
Date Tue, 23 Jul 2019 19:10:11 GMT
Build: https://jenkins.thetaphi.de/job/Lucene-Solr-8.x-Linux/911/
Java: 64bit/jdk1.8.0_201 -XX:+UseCompressedOops -XX:+UseConcMarkSweepGC

6 tests failed.
FAILED:  org.apache.solr.search.facet.TestCloudJSONFacetJoinDomain.testRandom

Error Message:
Error from server at https://127.0.0.1:37753/solr/org.apache.solr.search.facet.TestCloudJSONFacetJoinDomain_collection: Error from server at null: Expected mime type application/octet-stream but got text/html. <html> <head> <meta http-equiv="Content-Type" content="text/html;charset=utf-8"/> <title>Error 500 Server Error</title> </head> <body><h2>HTTP ERROR 500</h2> <p>Problem accessing /solr/org.apache.solr.search.facet.TestCloudJSONFacetJoinDomain_collection_shard1_replica_n1/select. Reason: <pre>    Server Error</pre></p><h3>Caused by:</h3><pre>java.lang.AssertionError  at java.util.HashMap$TreeNode.moveRootToFront(HashMap.java:1849)  at java.util.HashMap$TreeNode.putTreeVal(HashMap.java:2014)  at java.util.HashMap.putVal(HashMap.java:638)  at java.util.HashMap.put(HashMap.java:612)  at org.apache.solr.search.LRUCache.put(LRUCache.java:201)  at org.apache.solr.search.SolrIndexSearcher.getDocListC(SolrIndexSearcher.java:1449)  at org.apache.solr.search.SolrIndexSearcher.search(SolrIndexSearcher.java:568)  at org.apache.solr.handler.component.QueryComponent.doProcessUngroupedSearch(QueryComponent.java:1484)  at org.apache.solr.handler.component.QueryComponent.process(QueryComponent.java:398)  at org.apache.solr.handler.component.SearchHandler.handleRequestBody(SearchHandler.java:305)  at org.apache.solr.handler.RequestHandlerBase.handleRequest(RequestHandlerBase.java:199)  at org.apache.solr.core.SolrCore.execute(SolrCore.java:2592)  at org.apache.solr.servlet.HttpSolrCall.execute(HttpSolrCall.java:780)  at org.apache.solr.servlet.HttpSolrCall.call(HttpSolrCall.java:566)  at org.apache.solr.servlet.SolrDispatchFilter.doFilter(SolrDispatchFilter.java:423)  at org.apache.solr.servlet.SolrDispatchFilter.doFilter(SolrDispatchFilter.java:350)  at org.eclipse.jetty.servlet.ServletHandler$CachedChain.doFilter(ServletHandler.java:1610)  at org.apache.solr.client.solrj.embedded.JettySolrRunner$DebugFilter.doFilter(JettySolrRunner.java:165)  at org.eclipse.jetty.servlet.ServletHandler$CachedChain.doFilter(ServletHandler.java:1610)  at org.eclipse.jetty.servlet.ServletHandler.doHandle(ServletHandler.java:540)  at org.eclipse.jetty.server.handler.ScopedHandler.nextHandle(ScopedHandler.java:255)  at org.eclipse.jetty.server.session.SessionHandler.doHandle(SessionHandler.java:1711)  at org.eclipse.jetty.server.handler.ScopedHandler.nextHandle(ScopedHandler.java:255)  at org.eclipse.jetty.server.handler.ContextHandler.doHandle(ContextHandler.java:1347)  at org.eclipse.jetty.server.handler.ScopedHandler.nextScope(ScopedHandler.java:203)  at org.eclipse.jetty.servlet.ServletHandler.doScope(ServletHandler.java:480)  at org.eclipse.jetty.server.session.SessionHandler.doScope(SessionHandler.java:1678)  at org.eclipse.jetty.server.handler.ScopedHandler.nextScope(ScopedHandler.java:201)  at org.eclipse.jetty.server.handler.ContextHandler.doScope(ContextHandler.java:1249)  at org.eclipse.jetty.server.handler.ScopedHandler.handle(ScopedHandler.java:144)  at org.eclipse.jetty.server.handler.gzip.GzipHandler.handle(GzipHandler.java:703)  at org.eclipse.jetty.server.handler.HandlerWrapper.handle(HandlerWrapper.java:132)  at org.eclipse.jetty.server.Server.handle(Server.java:505)  at org.eclipse.jetty.server.HttpChannel.handle(HttpChannel.java:370)  at org.eclipse.jetty.server.HttpConnection.onFillable(HttpConnection.java:267)  at org.eclipse.jetty.io.AbstractConnection$ReadCallback.succeeded(AbstractConnection.java:305)  at org.eclipse.jetty.io.FillInterest.fillable(FillInterest.java:103)  at org.eclipse.jetty.io.ssl.SslConnection$DecryptedEndPoint.onFillable(SslConnection.java:427)  at org.eclipse.jetty.io.ssl.SslConnection.onFillable(SslConnection.java:321)  at org.eclipse.jetty.io.ssl.SslConnection$2.succeeded(SslConnection.java:159)  at org.eclipse.jetty.io.FillInterest.fillable(FillInterest.java:103)  at org.eclipse.jetty.io.ChannelEndPoint$2.run(ChannelEndPoint.java:117)  at org.eclipse.jetty.util.thread.QueuedThreadPool.runJob(QueuedThreadPool.java:781)  at org.eclipse.jetty.util.thread.QueuedThreadPool$Runner.run(QueuedThreadPool.java:917)  at java.lang.Thread.run(Thread.java:748) </pre> <hr><a href="http://eclipse.org/jetty">Powered by Jetty:// 9.4.19.v20190610</a><hr/>  </body> </html> 

Stack Trace:
org.apache.solr.client.solrj.impl.HttpSolrClient$RemoteSolrException: Error from server at https://127.0.0.1:37753/solr/org.apache.solr.search.facet.TestCloudJSONFacetJoinDomain_collection: Error from server at null: Expected mime type application/octet-stream but got text/html. <html>
<head>
<meta http-equiv="Content-Type" content="text/html;charset=utf-8"/>
<title>Error 500 Server Error</title>
</head>
<body><h2>HTTP ERROR 500</h2>
<p>Problem accessing /solr/org.apache.solr.search.facet.TestCloudJSONFacetJoinDomain_collection_shard1_replica_n1/select. Reason:
<pre>    Server Error</pre></p><h3>Caused by:</h3><pre>java.lang.AssertionError
	at java.util.HashMap$TreeNode.moveRootToFront(HashMap.java:1849)
	at java.util.HashMap$TreeNode.putTreeVal(HashMap.java:2014)
	at java.util.HashMap.putVal(HashMap.java:638)
	at java.util.HashMap.put(HashMap.java:612)
	at org.apache.solr.search.LRUCache.put(LRUCache.java:201)
	at org.apache.solr.search.SolrIndexSearcher.getDocListC(SolrIndexSearcher.java:1449)
	at org.apache.solr.search.SolrIndexSearcher.search(SolrIndexSearcher.java:568)
	at org.apache.solr.handler.component.QueryComponent.doProcessUngroupedSearch(QueryComponent.java:1484)
	at org.apache.solr.handler.component.QueryComponent.process(QueryComponent.java:398)
	at org.apache.solr.handler.component.SearchHandler.handleRequestBody(SearchHandler.java:305)
	at org.apache.solr.handler.RequestHandlerBase.handleRequest(RequestHandlerBase.java:199)
	at org.apache.solr.core.SolrCore.execute(SolrCore.java:2592)
	at org.apache.solr.servlet.HttpSolrCall.execute(HttpSolrCall.java:780)
	at org.apache.solr.servlet.HttpSolrCall.call(HttpSolrCall.java:566)
	at org.apache.solr.servlet.SolrDispatchFilter.doFilter(SolrDispatchFilter.java:423)
	at org.apache.solr.servlet.SolrDispatchFilter.doFilter(SolrDispatchFilter.java:350)
	at org.eclipse.jetty.servlet.ServletHandler$CachedChain.doFilter(ServletHandler.java:1610)
	at org.apache.solr.client.solrj.embedded.JettySolrRunner$DebugFilter.doFilter(JettySolrRunner.java:165)
	at org.eclipse.jetty.servlet.ServletHandler$CachedChain.doFilter(ServletHandler.java:1610)
	at org.eclipse.jetty.servlet.ServletHandler.doHandle(ServletHandler.java:540)
	at org.eclipse.jetty.server.handler.ScopedHandler.nextHandle(ScopedHandler.java:255)
	at org.eclipse.jetty.server.session.SessionHandler.doHandle(SessionHandler.java:1711)
	at org.eclipse.jetty.server.handler.ScopedHandler.nextHandle(ScopedHandler.java:255)
	at org.eclipse.jetty.server.handler.ContextHandler.doHandle(ContextHandler.java:1347)
	at org.eclipse.jetty.server.handler.ScopedHandler.nextScope(ScopedHandler.java:203)
	at org.eclipse.jetty.servlet.ServletHandler.doScope(ServletHandler.java:480)
	at org.eclipse.jetty.server.session.SessionHandler.doScope(SessionHandler.java:1678)
	at org.eclipse.jetty.server.handler.ScopedHandler.nextScope(ScopedHandler.java:201)
	at org.eclipse.jetty.server.handler.ContextHandler.doScope(ContextHandler.java:1249)
	at org.eclipse.jetty.server.handler.ScopedHandler.handle(ScopedHandler.java:144)
	at org.eclipse.jetty.server.handler.gzip.GzipHandler.handle(GzipHandler.java:703)
	at org.eclipse.jetty.server.handler.HandlerWrapper.handle(HandlerWrapper.java:132)
	at org.eclipse.jetty.server.Server.handle(Server.java:505)
	at org.eclipse.jetty.server.HttpChannel.handle(HttpChannel.java:370)
	at org.eclipse.jetty.server.HttpConnection.onFillable(HttpConnection.java:267)
	at org.eclipse.jetty.io.AbstractConnection$ReadCallback.succeeded(AbstractConnection.java:305)
	at org.eclipse.jetty.io.FillInterest.fillable(FillInterest.java:103)
	at org.eclipse.jetty.io.ssl.SslConnection$DecryptedEndPoint.onFillable(SslConnection.java:427)
	at org.eclipse.jetty.io.ssl.SslConnection.onFillable(SslConnection.java:321)
	at org.eclipse.jetty.io.ssl.SslConnection$2.succeeded(SslConnection.java:159)
	at org.eclipse.jetty.io.FillInterest.fillable(FillInterest.java:103)
	at org.eclipse.jetty.io.ChannelEndPoint$2.run(ChannelEndPoint.java:117)
	at org.eclipse.jetty.util.thread.QueuedThreadPool.runJob(QueuedThreadPool.java:781)
	at org.eclipse.jetty.util.thread.QueuedThreadPool$Runner.run(QueuedThreadPool.java:917)
	at java.lang.Thread.run(Thread.java:748)
</pre>
<hr><a href="http://eclipse.org/jetty">Powered by Jetty:// 9.4.19.v20190610</a><hr/>

</body>
</html>

	at __randomizedtesting.SeedInfo.seed([B292FDDCA6F4D6F2:C0DED8D317946081]:0)
	at org.apache.solr.client.solrj.impl.HttpSolrClient.executeMethod(HttpSolrClient.java:656)
	at org.apache.solr.client.solrj.impl.HttpSolrClient.request(HttpSolrClient.java:262)
	at org.apache.solr.client.solrj.impl.HttpSolrClient.request(HttpSolrClient.java:245)
	at org.apache.solr.client.solrj.SolrRequest.process(SolrRequest.java:211)
	at org.apache.solr.client.solrj.SolrClient.query(SolrClient.java:987)
	at org.apache.solr.client.solrj.SolrClient.query(SolrClient.java:1002)
	at org.apache.solr.search.facet.TestCloudJSONFacetJoinDomain.assertFacetCountsAreCorrect(TestCloudJSONFacetJoinDomain.java:504)
	at org.apache.solr.search.facet.TestCloudJSONFacetJoinDomain.assertFacetCountsAreCorrect(TestCloudJSONFacetJoinDomain.java:462)
	at org.apache.solr.search.facet.TestCloudJSONFacetJoinDomain.testRandom(TestCloudJSONFacetJoinDomain.java:401)
	at sun.reflect.NativeMethodAccessorImpl.invoke0(Native Method)
	at sun.reflect.NativeMethodAccessorImpl.invoke(NativeMethodAccessorImpl.java:62)
	at sun.reflect.DelegatingMethodAccessorImpl.invoke(DelegatingMethodAccessorImpl.java:43)
	at java.lang.reflect.Method.invoke(Method.java:498)
	at com.carrotsearch.randomizedtesting.RandomizedRunner.invoke(RandomizedRunner.java:1750)
	at com.carrotsearch.randomizedtesting.RandomizedRunner$8.evaluate(RandomizedRunner.java:938)
	at com.carrotsearch.randomizedtesting.RandomizedRunner$9.evaluate(RandomizedRunner.java:974)
	at com.carrotsearch.randomizedtesting.RandomizedRunner$10.evaluate(RandomizedRunner.java:988)
	at com.carrotsearch.randomizedtesting.rules.SystemPropertiesRestoreRule$1.evaluate(SystemPropertiesRestoreRule.java:57)
	at org.apache.lucene.util.TestRuleSetupTeardownChained$1.evaluate(TestRuleSetupTeardownChained.java:49)
	at org.apache.lucene.util.AbstractBeforeAfterRule$1.evaluate(AbstractBeforeAfterRule.java:45)
	at org.apache.lucene.util.TestRuleThreadAndTestName$1.evaluate(TestRuleThreadAndTestName.java:48)
	at org.apache.lucene.util.TestRuleIgnoreAfterMaxFailures$1.evaluate(TestRuleIgnoreAfterMaxFailures.java:64)
	at org.apache.lucene.util.TestRuleMarkFailure$1.evaluate(TestRuleMarkFailure.java:47)
	at com.carrotsearch.randomizedtesting.rules.StatementAdapter.evaluate(StatementAdapter.java:36)
	at com.carrotsearch.randomizedtesting.ThreadLeakControl$StatementRunner.run(ThreadLeakControl.java:368)
	at com.carrotsearch.randomizedtesting.ThreadLeakControl.forkTimeoutingTask(ThreadLeakControl.java:817)
	at com.carrotsearch.randomizedtesting.ThreadLeakControl$3.evaluate(ThreadLeakControl.java:468)
	at com.carrotsearch.randomizedtesting.RandomizedRunner.runSingleTest(RandomizedRunner.java:947)
	at com.carrotsearch.randomizedtesting.RandomizedRunner$5.evaluate(RandomizedRunner.java:832)
	at com.carrotsearch.randomizedtesting.RandomizedRunner$6.evaluate(RandomizedRunner.java:883)
	at com.carrotsearch.randomizedtesting.RandomizedRunner$7.evaluate(RandomizedRunner.java:894)
	at com.carrotsearch.randomizedtesting.rules.StatementAdapter.evaluate(StatementAdapter.java:36)
	at com.carrotsearch.randomizedtesting.rules.SystemPropertiesRestoreRule$1.evaluate(SystemPropertiesRestoreRule.java:57)
	at org.apache.lucene.util.AbstractBeforeAfterRule$1.evaluate(AbstractBeforeAfterRule.java:45)
	at com.carrotsearch.randomizedtesting.rules.StatementAdapter.evaluate(StatementAdapter.java:36)
	at org.apache.lucene.util.TestRuleStoreClassName$1.evaluate(TestRuleStoreClassName.java:41)
	at com.carrotsearch.randomizedtesting.rules.NoShadowingOrOverridesOnMethodsRule$1.evaluate(NoShadowingOrOverridesOnMethodsRule.java:40)
	at com.carrotsearch.randomizedtesting.rules.NoShadowingOrOverridesOnMethodsRule$1.evaluate(NoShadowingOrOverridesOnMethodsRule.java:40)
	at com.carrotsearch.randomizedtesting.rules.StatementAdapter.evaluate(StatementAdapter.java:36)
	at com.carrotsearch.randomizedtesting.rules.StatementAdapter.evaluate(StatementAdapter.java:36)
	at com.carrotsearch.randomizedtesting.rules.StatementAdapter.evaluate(StatementAdapter.java:36)
	at org.apache.lucene.util.TestRuleAssertionsRequired$1.evaluate(TestRuleAssertionsRequired.java:53)
	at org.apache.lucene.util.TestRuleMarkFailure$1.evaluate(TestRuleMarkFailure.java:47)
	at org.apache.lucene.util.TestRuleIgnoreAfterMaxFailures$1.evaluate(TestRuleIgnoreAfterMaxFailures.java:64)
	at org.apache.lucene.util.TestRuleIgnoreTestSuites$1.evaluate(TestRuleIgnoreTestSuites.java:54)
	at com.carrotsearch.randomizedtesting.rules.StatementAdapter.evaluate(StatementAdapter.java:36)
	at com.carrotsearch.randomizedtesting.ThreadLeakControl$StatementRunner.run(ThreadLeakControl.java:368)
	at java.lang.Thread.run(Thread.java:748)


FAILED:  org.apache.solr.security.BasicAuthIntegrationTest.testBasicAuth

Error Message:
expected:<401> but was:<400>

Stack Trace:
java.lang.AssertionError: expected:<401> but was:<400>
	at __randomizedtesting.SeedInfo.seed([B292FDDCA6F4D6F2:EFC8BCE02A75588]:0)
	at org.junit.Assert.fail(Assert.java:88)
	at org.junit.Assert.failNotEquals(Assert.java:834)
	at org.junit.Assert.assertEquals(Assert.java:645)
	at org.junit.Assert.assertEquals(Assert.java:631)
	at org.apache.solr.security.BasicAuthIntegrationTest.testBasicAuth(BasicAuthIntegrationTest.java:151)
	at sun.reflect.NativeMethodAccessorImpl.invoke0(Native Method)
	at sun.reflect.NativeMethodAccessorImpl.invoke(NativeMethodAccessorImpl.java:62)
	at sun.reflect.DelegatingMethodAccessorImpl.invoke(DelegatingMethodAccessorImpl.java:43)
	at java.lang.reflect.Method.invoke(Method.java:498)
	at com.carrotsearch.randomizedtesting.RandomizedRunner.invoke(RandomizedRunner.java:1750)
	at com.carrotsearch.randomizedtesting.RandomizedRunner$8.evaluate(RandomizedRunner.java:938)
	at com.carrotsearch.randomizedtesting.RandomizedRunner$9.evaluate(RandomizedRunner.java:974)
	at com.carrotsearch.randomizedtesting.RandomizedRunner$10.evaluate(RandomizedRunner.java:988)
	at com.carrotsearch.randomizedtesting.rules.SystemPropertiesRestoreRule$1.evaluate(SystemPropertiesRestoreRule.java:57)
	at org.apache.lucene.util.TestRuleSetupTeardownChained$1.evaluate(TestRuleSetupTeardownChained.java:49)
	at org.apache.lucene.util.AbstractBeforeAfterRule$1.evaluate(AbstractBeforeAfterRule.java:45)
	at org.apache.lucene.util.TestRuleThreadAndTestName$1.evaluate(TestRuleThreadAndTestName.java:48)
	at org.apache.lucene.util.TestRuleIgnoreAfterMaxFailures$1.evaluate(TestRuleIgnoreAfterMaxFailures.java:64)
	at org.apache.lucene.util.TestRuleMarkFailure$1.evaluate(TestRuleMarkFailure.java:47)
	at com.carrotsearch.randomizedtesting.rules.StatementAdapter.evaluate(StatementAdapter.java:36)
	at com.carrotsearch.randomizedtesting.ThreadLeakControl$StatementRunner.run(ThreadLeakControl.java:368)
	at com.carrotsearch.randomizedtesting.ThreadLeakControl.forkTimeoutingTask(ThreadLeakControl.java:817)
	at com.carrotsearch.randomizedtesting.ThreadLeakControl$3.evaluate(ThreadLeakControl.java:468)
	at com.carrotsearch.randomizedtesting.RandomizedRunner.runSingleTest(RandomizedRunner.java:947)
	at com.carrotsearch.randomizedtesting.RandomizedRunner$5.evaluate(RandomizedRunner.java:832)
	at com.carrotsearch.randomizedtesting.RandomizedRunner$6.evaluate(RandomizedRunner.java:883)
	at com.carrotsearch.randomizedtesting.RandomizedRunner$7.evaluate(RandomizedRunner.java:894)
	at com.carrotsearch.randomizedtesting.rules.StatementAdapter.evaluate(StatementAdapter.java:36)
	at com.carrotsearch.randomizedtesting.rules.SystemPropertiesRestoreRule$1.evaluate(SystemPropertiesRestoreRule.java:57)
	at org.apache.lucene.util.AbstractBeforeAfterRule$1.evaluate(AbstractBeforeAfterRule.java:45)
	at com.carrotsearch.randomizedtesting.rules.StatementAdapter.evaluate(StatementAdapter.java:36)
	at org.apache.lucene.util.TestRuleStoreClassName$1.evaluate(TestRuleStoreClassName.java:41)
	at com.carrotsearch.randomizedtesting.rules.NoShadowingOrOverridesOnMethodsRule$1.evaluate(NoShadowingOrOverridesOnMethodsRule.java:40)
	at com.carrotsearch.randomizedtesting.rules.NoShadowingOrOverridesOnMethodsRule$1.evaluate(NoShadowingOrOverridesOnMethodsRule.java:40)
	at com.carrotsearch.randomizedtesting.rules.StatementAdapter.evaluate(StatementAdapter.java:36)
	at com.carrotsearch.randomizedtesting.rules.StatementAdapter.evaluate(StatementAdapter.java:36)
	at com.carrotsearch.randomizedtesting.rules.StatementAdapter.evaluate(StatementAdapter.java:36)
	at org.apache.lucene.util.TestRuleAssertionsRequired$1.evaluate(TestRuleAssertionsRequired.java:53)
	at org.apache.lucene.util.TestRuleMarkFailure$1.evaluate(TestRuleMarkFailure.java:47)
	at org.apache.lucene.util.TestRuleIgnoreAfterMaxFailures$1.evaluate(TestRuleIgnoreAfterMaxFailures.java:64)
	at org.apache.lucene.util.TestRuleIgnoreTestSuites$1.evaluate(TestRuleIgnoreTestSuites.java:54)
	at com.carrotsearch.randomizedtesting.rules.StatementAdapter.evaluate(StatementAdapter.java:36)
	at com.carrotsearch.randomizedtesting.ThreadLeakControl$StatementRunner.run(ThreadLeakControl.java:368)
	at java.lang.Thread.run(Thread.java:748)


FAILED:  org.apache.solr.security.BasicAuthIntegrationTest.testBasicAuth

Error Message:
expected:<401> but was:<400>

Stack Trace:
java.lang.AssertionError: expected:<401> but was:<400>
	at __randomizedtesting.SeedInfo.seed([B292FDDCA6F4D6F2:EFC8BCE02A75588]:0)
	at org.junit.Assert.fail(Assert.java:88)
	at org.junit.Assert.failNotEquals(Assert.java:834)
	at org.junit.Assert.assertEquals(Assert.java:645)
	at org.junit.Assert.assertEquals(Assert.java:631)
	at org.apache.solr.security.BasicAuthIntegrationTest.testBasicAuth(BasicAuthIntegrationTest.java:151)
	at sun.reflect.NativeMethodAccessorImpl.invoke0(Native Method)
	at sun.reflect.NativeMethodAccessorImpl.invoke(NativeMethodAccessorImpl.java:62)
	at sun.reflect.DelegatingMethodAccessorImpl.invoke(DelegatingMethodAccessorImpl.java:43)
	at java.lang.reflect.Method.invoke(Method.java:498)
	at com.carrotsearch.randomizedtesting.RandomizedRunner.invoke(RandomizedRunner.java:1750)
	at com.carrotsearch.randomizedtesting.RandomizedRunner$8.evaluate(RandomizedRunner.java:938)
	at com.carrotsearch.randomizedtesting.RandomizedRunner$9.evaluate(RandomizedRunner.java:974)
	at com.carrotsearch.randomizedtesting.RandomizedRunner$10.evaluate(RandomizedRunner.java:988)
	at com.carrotsearch.randomizedtesting.rules.SystemPropertiesRestoreRule$1.evaluate(SystemPropertiesRestoreRule.java:57)
	at org.apache.lucene.util.TestRuleSetupTeardownChained$1.evaluate(TestRuleSetupTeardownChained.java:49)
	at org.apache.lucene.util.AbstractBeforeAfterRule$1.evaluate(AbstractBeforeAfterRule.java:45)
	at org.apache.lucene.util.TestRuleThreadAndTestName$1.evaluate(TestRuleThreadAndTestName.java:48)
	at org.apache.lucene.util.TestRuleIgnoreAfterMaxFailures$1.evaluate(TestRuleIgnoreAfterMaxFailures.java:64)
	at org.apache.lucene.util.TestRuleMarkFailure$1.evaluate(TestRuleMarkFailure.java:47)
	at com.carrotsearch.randomizedtesting.rules.StatementAdapter.evaluate(StatementAdapter.java:36)
	at com.carrotsearch.randomizedtesting.ThreadLeakControl$StatementRunner.run(ThreadLeakControl.java:368)
	at com.carrotsearch.randomizedtesting.ThreadLeakControl.forkTimeoutingTask(ThreadLeakControl.java:817)
	at com.carrotsearch.randomizedtesting.ThreadLeakControl$3.evaluate(ThreadLeakControl.java:468)
	at com.carrotsearch.randomizedtesting.RandomizedRunner.runSingleTest(RandomizedRunner.java:947)
	at com.carrotsearch.randomizedtesting.RandomizedRunner$5.evaluate(RandomizedRunner.java:832)
	at com.carrotsearch.randomizedtesting.RandomizedRunner$6.evaluate(RandomizedRunner.java:883)
	at com.carrotsearch.randomizedtesting.RandomizedRunner$7.evaluate(RandomizedRunner.java:894)
	at com.carrotsearch.randomizedtesting.rules.StatementAdapter.evaluate(StatementAdapter.java:36)
	at com.carrotsearch.randomizedtesting.rules.SystemPropertiesRestoreRule$1.evaluate(SystemPropertiesRestoreRule.java:57)
	at org.apache.lucene.util.AbstractBeforeAfterRule$1.evaluate(AbstractBeforeAfterRule.java:45)
	at com.carrotsearch.randomizedtesting.rules.StatementAdapter.evaluate(StatementAdapter.java:36)
	at org.apache.lucene.util.TestRuleStoreClassName$1.evaluate(TestRuleStoreClassName.java:41)
	at com.carrotsearch.randomizedtesting.rules.NoShadowingOrOverridesOnMethodsRule$1.evaluate(NoShadowingOrOverridesOnMethodsRule.java:40)
	at com.carrotsearch.randomizedtesting.rules.NoShadowingOrOverridesOnMethodsRule$1.evaluate(NoShadowingOrOverridesOnMethodsRule.java:40)
	at com.carrotsearch.randomizedtesting.rules.StatementAdapter.evaluate(StatementAdapter.java:36)
	at com.carrotsearch.randomizedtesting.rules.StatementAdapter.evaluate(StatementAdapter.java:36)
	at com.carrotsearch.randomizedtesting.rules.StatementAdapter.evaluate(StatementAdapter.java:36)
	at org.apache.lucene.util.TestRuleAssertionsRequired$1.evaluate(TestRuleAssertionsRequired.java:53)
	at org.apache.lucene.util.TestRuleMarkFailure$1.evaluate(TestRuleMarkFailure.java:47)
	at org.apache.lucene.util.TestRuleIgnoreAfterMaxFailures$1.evaluate(TestRuleIgnoreAfterMaxFailures.java:64)
	at org.apache.lucene.util.TestRuleIgnoreTestSuites$1.evaluate(TestRuleIgnoreTestSuites.java:54)
	at com.carrotsearch.randomizedtesting.rules.StatementAdapter.evaluate(StatementAdapter.java:36)
	at com.carrotsearch.randomizedtesting.ThreadLeakControl$StatementRunner.run(ThreadLeakControl.java:368)
	at java.lang.Thread.run(Thread.java:748)


FAILED:  org.apache.solr.security.BasicAuthIntegrationTest.testBasicAuth

Error Message:
expected:<401> but was:<400>

Stack Trace:
java.lang.AssertionError: expected:<401> but was:<400>
	at __randomizedtesting.SeedInfo.seed([B292FDDCA6F4D6F2:EFC8BCE02A75588]:0)
	at org.junit.Assert.fail(Assert.java:88)
	at org.junit.Assert.failNotEquals(Assert.java:834)
	at org.junit.Assert.assertEquals(Assert.java:645)
	at org.junit.Assert.assertEquals(Assert.java:631)
	at org.apache.solr.security.BasicAuthIntegrationTest.testBasicAuth(BasicAuthIntegrationTest.java:151)
	at sun.reflect.NativeMethodAccessorImpl.invoke0(Native Method)
	at sun.reflect.NativeMethodAccessorImpl.invoke(NativeMethodAccessorImpl.java:62)
	at sun.reflect.DelegatingMethodAccessorImpl.invoke(DelegatingMethodAccessorImpl.java:43)
	at java.lang.reflect.Method.invoke(Method.java:498)
	at com.carrotsearch.randomizedtesting.RandomizedRunner.invoke(RandomizedRunner.java:1750)
	at com.carrotsearch.randomizedtesting.RandomizedRunner$8.evaluate(RandomizedRunner.java:938)
	at com.carrotsearch.randomizedtesting.RandomizedRunner$9.evaluate(RandomizedRunner.java:974)
	at com.carrotsearch.randomizedtesting.RandomizedRunner$10.evaluate(RandomizedRunner.java:988)
	at com.carrotsearch.randomizedtesting.rules.SystemPropertiesRestoreRule$1.evaluate(SystemPropertiesRestoreRule.java:57)
	at org.apache.lucene.util.TestRuleSetupTeardownChained$1.evaluate(TestRuleSetupTeardownChained.java:49)
	at org.apache.lucene.util.AbstractBeforeAfterRule$1.evaluate(AbstractBeforeAfterRule.java:45)
	at org.apache.lucene.util.TestRuleThreadAndTestName$1.evaluate(TestRuleThreadAndTestName.java:48)
	at org.apache.lucene.util.TestRuleIgnoreAfterMaxFailures$1.evaluate(TestRuleIgnoreAfterMaxFailures.java:64)
	at org.apache.lucene.util.TestRuleMarkFailure$1.evaluate(TestRuleMarkFailure.java:47)
	at com.carrotsearch.randomizedtesting.rules.StatementAdapter.evaluate(StatementAdapter.java:36)
	at com.carrotsearch.randomizedtesting.ThreadLeakControl$StatementRunner.run(ThreadLeakControl.java:368)
	at com.carrotsearch.randomizedtesting.ThreadLeakControl.forkTimeoutingTask(ThreadLeakControl.java:817)
	at com.carrotsearch.randomizedtesting.ThreadLeakControl$3.evaluate(ThreadLeakControl.java:468)
	at com.carrotsearch.randomizedtesting.RandomizedRunner.runSingleTest(RandomizedRunner.java:947)
	at com.carrotsearch.randomizedtesting.RandomizedRunner$5.evaluate(RandomizedRunner.java:832)
	at com.carrotsearch.randomizedtesting.RandomizedRunner$6.evaluate(RandomizedRunner.java:883)
	at com.carrotsearch.randomizedtesting.RandomizedRunner$7.evaluate(RandomizedRunner.java:894)
	at com.carrotsearch.randomizedtesting.rules.StatementAdapter.evaluate(StatementAdapter.java:36)
	at com.carrotsearch.randomizedtesting.rules.SystemPropertiesRestoreRule$1.evaluate(SystemPropertiesRestoreRule.java:57)
	at org.apache.lucene.util.AbstractBeforeAfterRule$1.evaluate(AbstractBeforeAfterRule.java:45)
	at com.carrotsearch.randomizedtesting.rules.StatementAdapter.evaluate(StatementAdapter.java:36)
	at org.apache.lucene.util.TestRuleStoreClassName$1.evaluate(TestRuleStoreClassName.java:41)
	at com.carrotsearch.randomizedtesting.rules.NoShadowingOrOverridesOnMethodsRule$1.evaluate(NoShadowingOrOverridesOnMethodsRule.java:40)
	at com.carrotsearch.randomizedtesting.rules.NoShadowingOrOverridesOnMethodsRule$1.evaluate(NoShadowingOrOverridesOnMethodsRule.java:40)
	at com.carrotsearch.randomizedtesting.rules.StatementAdapter.evaluate(StatementAdapter.java:36)
	at com.carrotsearch.randomizedtesting.rules.StatementAdapter.evaluate(StatementAdapter.java:36)
	at com.carrotsearch.randomizedtesting.rules.StatementAdapter.evaluate(StatementAdapter.java:36)
	at org.apache.lucene.util.TestRuleAssertionsRequired$1.evaluate(TestRuleAssertionsRequired.java:53)
	at org.apache.lucene.util.TestRuleMarkFailure$1.evaluate(TestRuleMarkFailure.java:47)
	at org.apache.lucene.util.TestRuleIgnoreAfterMaxFailures$1.evaluate(TestRuleIgnoreAfterMaxFailures.java:64)
	at org.apache.lucene.util.TestRuleIgnoreTestSuites$1.evaluate(TestRuleIgnoreTestSuites.java:54)
	at com.carrotsearch.randomizedtesting.rules.StatementAdapter.evaluate(StatementAdapter.java:36)
	at com.carrotsearch.randomizedtesting.ThreadLeakControl$StatementRunner.run(ThreadLeakControl.java:368)
	at java.lang.Thread.run(Thread.java:748)


FAILED:  org.apache.solr.security.BasicAuthIntegrationTest.testBasicAuth

Error Message:
expected:<401> but was:<400>

Stack Trace:
java.lang.AssertionError: expected:<401> but was:<400>
	at __randomizedtesting.SeedInfo.seed([B292FDDCA6F4D6F2:EFC8BCE02A75588]:0)
	at org.junit.Assert.fail(Assert.java:88)
	at org.junit.Assert.failNotEquals(Assert.java:834)
	at org.junit.Assert.assertEquals(Assert.java:645)
	at org.junit.Assert.assertEquals(Assert.java:631)
	at org.apache.solr.security.BasicAuthIntegrationTest.testBasicAuth(BasicAuthIntegrationTest.java:151)
	at sun.reflect.NativeMethodAccessorImpl.invoke0(Native Method)
	at sun.reflect.NativeMethodAccessorImpl.invoke(NativeMethodAccessorImpl.java:62)
	at sun.reflect.DelegatingMethodAccessorImpl.invoke(DelegatingMethodAccessorImpl.java:43)
	at java.lang.reflect.Method.invoke(Method.java:498)
	at com.carrotsearch.randomizedtesting.RandomizedRunner.invoke(RandomizedRunner.java:1750)
	at com.carrotsearch.randomizedtesting.RandomizedRunner$8.evaluate(RandomizedRunner.java:938)
	at com.carrotsearch.randomizedtesting.RandomizedRunner$9.evaluate(RandomizedRunner.java:974)
	at com.carrotsearch.randomizedtesting.RandomizedRunner$10.evaluate(RandomizedRunner.java:988)
	at com.carrotsearch.randomizedtesting.rules.SystemPropertiesRestoreRule$1.evaluate(SystemPropertiesRestoreRule.java:57)
	at org.apache.lucene.util.TestRuleSetupTeardownChained$1.evaluate(TestRuleSetupTeardownChained.java:49)
	at org.apache.lucene.util.AbstractBeforeAfterRule$1.evaluate(AbstractBeforeAfterRule.java:45)
	at org.apache.lucene.util.TestRuleThreadAndTestName$1.evaluate(TestRuleThreadAndTestName.java:48)
	at org.apache.lucene.util.TestRuleIgnoreAfterMaxFailures$1.evaluate(TestRuleIgnoreAfterMaxFailures.java:64)
	at org.apache.lucene.util.TestRuleMarkFailure$1.evaluate(TestRuleMarkFailure.java:47)
	at com.carrotsearch.randomizedtesting.rules.StatementAdapter.evaluate(StatementAdapter.java:36)
	at com.carrotsearch.randomizedtesting.ThreadLeakControl$StatementRunner.run(ThreadLeakControl.java:368)
	at com.carrotsearch.randomizedtesting.ThreadLeakControl.forkTimeoutingTask(ThreadLeakControl.java:817)
	at com.carrotsearch.randomizedtesting.ThreadLeakControl$3.evaluate(ThreadLeakControl.java:468)
	at com.carrotsearch.randomizedtesting.RandomizedRunner.runSingleTest(RandomizedRunner.java:947)
	at com.carrotsearch.randomizedtesting.RandomizedRunner$5.evaluate(RandomizedRunner.java:832)
	at com.carrotsearch.randomizedtesting.RandomizedRunner$6.evaluate(RandomizedRunner.java:883)
	at com.carrotsearch.randomizedtesting.RandomizedRunner$7.evaluate(RandomizedRunner.java:894)
	at com.carrotsearch.randomizedtesting.rules.StatementAdapter.evaluate(StatementAdapter.java:36)
	at com.carrotsearch.randomizedtesting.rules.SystemPropertiesRestoreRule$1.evaluate(SystemPropertiesRestoreRule.java:57)
	at org.apache.lucene.util.AbstractBeforeAfterRule$1.evaluate(AbstractBeforeAfterRule.java:45)
	at com.carrotsearch.randomizedtesting.rules.StatementAdapter.evaluate(StatementAdapter.java:36)
	at org.apache.lucene.util.TestRuleStoreClassName$1.evaluate(TestRuleStoreClassName.java:41)
	at com.carrotsearch.randomizedtesting.rules.NoShadowingOrOverridesOnMethodsRule$1.evaluate(NoShadowingOrOverridesOnMethodsRule.java:40)
	at com.carrotsearch.randomizedtesting.rules.NoShadowingOrOverridesOnMethodsRule$1.evaluate(NoShadowingOrOverridesOnMethodsRule.java:40)
	at com.carrotsearch.randomizedtesting.rules.StatementAdapter.evaluate(StatementAdapter.java:36)
	at com.carrotsearch.randomizedtesting.rules.StatementAdapter.evaluate(StatementAdapter.java:36)
	at com.carrotsearch.randomizedtesting.rules.StatementAdapter.evaluate(StatementAdapter.java:36)
	at org.apache.lucene.util.TestRuleAssertionsRequired$1.evaluate(TestRuleAssertionsRequired.java:53)
	at org.apache.lucene.util.TestRuleMarkFailure$1.evaluate(TestRuleMarkFailure.java:47)
	at org.apache.lucene.util.TestRuleIgnoreAfterMaxFailures$1.evaluate(TestRuleIgnoreAfterMaxFailures.java:64)
	at org.apache.lucene.util.TestRuleIgnoreTestSuites$1.evaluate(TestRuleIgnoreTestSuites.java:54)
	at com.carrotsearch.randomizedtesting.rules.StatementAdapter.evaluate(StatementAdapter.java:36)
	at com.carrotsearch.randomizedtesting.ThreadLeakControl$StatementRunner.run(ThreadLeakControl.java:368)
	at java.lang.Thread.run(Thread.java:748)


FAILED:  org.apache.solr.security.BasicAuthIntegrationTest.testBasicAuth

Error Message:
expected:<401> but was:<400>

Stack Trace:
java.lang.AssertionError: expected:<401> but was:<400>
	at __randomizedtesting.SeedInfo.seed([B292FDDCA6F4D6F2:EFC8BCE02A75588]:0)
	at org.junit.Assert.fail(Assert.java:88)
	at org.junit.Assert.failNotEquals(Assert.java:834)
	at org.junit.Assert.assertEquals(Assert.java:645)
	at org.junit.Assert.assertEquals(Assert.java:631)
	at org.apache.solr.security.BasicAuthIntegrationTest.testBasicAuth(BasicAuthIntegrationTest.java:151)
	at sun.reflect.NativeMethodAccessorImpl.invoke0(Native Method)
	at sun.reflect.NativeMethodAccessorImpl.invoke(NativeMethodAccessorImpl.java:62)
	at sun.reflect.DelegatingMethodAccessorImpl.invoke(DelegatingMethodAccessorImpl.java:43)
	at java.lang.reflect.Method.invoke(Method.java:498)
	at com.carrotsearch.randomizedtesting.RandomizedRunner.invoke(RandomizedRunner.java:1750)
	at com.carrotsearch.randomizedtesting.RandomizedRunner$8.evaluate(RandomizedRunner.java:938)
	at com.carrotsearch.randomizedtesting.RandomizedRunner$9.evaluate(RandomizedRunner.java:974)
	at com.carrotsearch.randomizedtesting.RandomizedRunner$10.evaluate(RandomizedRunner.java:988)
	at com.carrotsearch.randomizedtesting.rules.SystemPropertiesRestoreRule$1.evaluate(SystemPropertiesRestoreRule.java:57)
	at org.apache.lucene.util.TestRuleSetupTeardownChained$1.evaluate(TestRuleSetupTeardownChained.java:49)
	at org.apache.lucene.util.AbstractBeforeAfterRule$1.evaluate(AbstractBeforeAfterRule.java:45)
	at org.apache.lucene.util.TestRuleThreadAndTestName$1.evaluate(TestRuleThreadAndTestName.java:48)
	at org.apache.lucene.util.TestRuleIgnoreAfterMaxFailures$1.evaluate(TestRuleIgnoreAfterMaxFailures.java:64)
	at org.apache.lucene.util.TestRuleMarkFailure$1.evaluate(TestRuleMarkFailure.java:47)
	at com.carrotsearch.randomizedtesting.rules.StatementAdapter.evaluate(StatementAdapter.java:36)
	at com.carrotsearch.randomizedtesting.ThreadLeakControl$StatementRunner.run(ThreadLeakControl.java:368)
	at com.carrotsearch.randomizedtesting.ThreadLeakControl.forkTimeoutingTask(ThreadLeakControl.java:817)
	at com.carrotsearch.randomizedtesting.ThreadLeakControl$3.evaluate(ThreadLeakControl.java:468)
	at com.carrotsearch.randomizedtesting.RandomizedRunner.runSingleTest(RandomizedRunner.java:947)
	at com.carrotsearch.randomizedtesting.RandomizedRunner$5.evaluate(RandomizedRunner.java:832)
	at com.carrotsearch.randomizedtesting.RandomizedRunner$6.evaluate(RandomizedRunner.java:883)
	at com.carrotsearch.randomizedtesting.RandomizedRunner$7.evaluate(RandomizedRunner.java:894)
	at com.carrotsearch.randomizedtesting.rules.StatementAdapter.evaluate(StatementAdapter.java:36)
	at com.carrotsearch.randomizedtesting.rules.SystemPropertiesRestoreRule$1.evaluate(SystemPropertiesRestoreRule.java:57)
	at org.apache.lucene.util.AbstractBeforeAfterRule$1.evaluate(AbstractBeforeAfterRule.java:45)
	at com.carrotsearch.randomizedtesting.rules.StatementAdapter.evaluate(StatementAdapter.java:36)
	at org.apache.lucene.util.TestRuleStoreClassName$1.evaluate(TestRuleStoreClassName.java:41)
	at com.carrotsearch.randomizedtesting.rules.NoShadowingOrOverridesOnMethodsRule$1.evaluate(NoShadowingOrOverridesOnMethodsRule.java:40)
	at com.carrotsearch.randomizedtesting.rules.NoShadowingOrOverridesOnMethodsRule$1.evaluate(NoShadowingOrOverridesOnMethodsRule.java:40)
	at com.carrotsearch.randomizedtesting.rules.StatementAdapter.evaluate(StatementAdapter.java:36)
	at com.carrotsearch.randomizedtesting.rules.StatementAdapter.evaluate(StatementAdapter.java:36)
	at com.carrotsearch.randomizedtesting.rules.StatementAdapter.evaluate(StatementAdapter.java:36)
	at org.apache.lucene.util.TestRuleAssertionsRequired$1.evaluate(TestRuleAssertionsRequired.java:53)
	at org.apache.lucene.util.TestRuleMarkFailure$1.evaluate(TestRuleMarkFailure.java:47)
	at org.apache.lucene.util.TestRuleIgnoreAfterMaxFailures$1.evaluate(TestRuleIgnoreAfterMaxFailures.java:64)
	at org.apache.lucene.util.TestRuleIgnoreTestSuites$1.evaluate(TestRuleIgnoreTestSuites.java:54)
	at com.carrotsearch.randomizedtesting.rules.StatementAdapter.evaluate(StatementAdapter.java:36)
	at com.carrotsearch.randomizedtesting.ThreadLeakControl$StatementRunner.run(ThreadLeakControl.java:368)
	at java.lang.Thread.run(Thread.java:748)




Build Log:
[...truncated 14925 lines...]
   [junit4] Suite: org.apache.solr.search.facet.TestCloudJSONFacetJoinDomain
   [junit4]   2> 1564689 INFO  (SUITE-TestCloudJSONFacetJoinDomain-seed#[B292FDDCA6F4D6F2]-worker) [     ] o.a.s.SolrTestCaseJ4 SecureRandom sanity checks: test.solr.allowed.securerandom=null & java.security.egd=file:/dev/./urandom
   [junit4]   2> Creating dataDir: /home/jenkins/workspace/Lucene-Solr-8.x-Linux/solr/build/solr-core/test/J0/temp/solr.search.facet.TestCloudJSONFacetJoinDomain_B292FDDCA6F4D6F2-001/init-core-data-001
   [junit4]   2> 1564689 WARN  (SUITE-TestCloudJSONFacetJoinDomain-seed#[B292FDDCA6F4D6F2]-worker) [     ] o.a.s.SolrTestCaseJ4 startTrackingSearchers: numOpens=32 numCloses=32
   [junit4]   2> 1564689 INFO  (SUITE-TestCloudJSONFacetJoinDomain-seed#[B292FDDCA6F4D6F2]-worker) [     ] o.a.s.SolrTestCaseJ4 Using PointFields (NUMERIC_POINTS_SYSPROP=true) w/NUMERIC_DOCVALUES_SYSPROP=true
   [junit4]   2> 1564690 INFO  (SUITE-TestCloudJSONFacetJoinDomain-seed#[B292FDDCA6F4D6F2]-worker) [     ] o.a.s.SolrTestCaseJ4 Randomized ssl (true) and clientAuth (false) via: @org.apache.solr.util.RandomizeSSL(reason=, ssl=NaN, value=NaN, clientAuth=NaN)
   [junit4]   2> 1564691 INFO  (SUITE-TestCloudJSONFacetJoinDomain-seed#[B292FDDCA6F4D6F2]-worker) [     ] o.a.s.c.MiniSolrCloudCluster Starting cluster of 2 servers in /home/jenkins/workspace/Lucene-Solr-8.x-Linux/solr/build/solr-core/test/J0/temp/solr.search.facet.TestCloudJSONFacetJoinDomain_B292FDDCA6F4D6F2-001/tempDir-001
   [junit4]   2> 1564691 INFO  (SUITE-TestCloudJSONFacetJoinDomain-seed#[B292FDDCA6F4D6F2]-worker) [     ] o.a.s.c.ZkTestServer STARTING ZK TEST SERVER
   [junit4]   2> 1564691 INFO  (ZkTestServer Run Thread) [     ] o.a.s.c.ZkTestServer client port:0.0.0.0/0.0.0.0:0
   [junit4]   2> 1564691 INFO  (ZkTestServer Run Thread) [     ] o.a.s.c.ZkTestServer Starting server
   [junit4]   2> 1564791 INFO  (SUITE-TestCloudJSONFacetJoinDomain-seed#[B292FDDCA6F4D6F2]-worker) [     ] o.a.s.c.ZkTestServer start zk server on port:44939
   [junit4]   2> 1564791 INFO  (SUITE-TestCloudJSONFacetJoinDomain-seed#[B292FDDCA6F4D6F2]-worker) [     ] o.a.s.c.ZkTestServer parse host and port list: 127.0.0.1:44939
   [junit4]   2> 1564791 INFO  (SUITE-TestCloudJSONFacetJoinDomain-seed#[B292FDDCA6F4D6F2]-worker) [     ] o.a.s.c.ZkTestServer connecting to 127.0.0.1 44939
   [junit4]   2> 1564792 INFO  (SUITE-TestCloudJSONFacetJoinDomain-seed#[B292FDDCA6F4D6F2]-worker) [     ] o.a.s.c.c.ConnectionManager Waiting for client to connect to ZooKeeper
   [junit4]   2> 1564794 INFO  (zkConnectionManagerCallback-13096-thread-1) [     ] o.a.s.c.c.ConnectionManager zkClient has connected
   [junit4]   2> 1564794 INFO  (SUITE-TestCloudJSONFacetJoinDomain-seed#[B292FDDCA6F4D6F2]-worker) [     ] o.a.s.c.c.ConnectionManager Client is connected to ZooKeeper
   [junit4]   2> 1564798 INFO  (SUITE-TestCloudJSONFacetJoinDomain-seed#[B292FDDCA6F4D6F2]-worker) [     ] o.a.s.c.c.ConnectionManager Waiting for client to connect to ZooKeeper
   [junit4]   2> 1564799 INFO  (zkConnectionManagerCallback-13098-thread-1) [     ] o.a.s.c.c.ConnectionManager zkClient has connected
   [junit4]   2> 1564799 INFO  (SUITE-TestCloudJSONFacetJoinDomain-seed#[B292FDDCA6F4D6F2]-worker) [     ] o.a.s.c.c.ConnectionManager Client is connected to ZooKeeper
   [junit4]   2> 1564799 INFO  (SUITE-TestCloudJSONFacetJoinDomain-seed#[B292FDDCA6F4D6F2]-worker) [     ] o.a.s.c.c.ConnectionManager Waiting for client to connect to ZooKeeper
   [junit4]   2> 1564800 INFO  (zkConnectionManagerCallback-13100-thread-1) [     ] o.a.s.c.c.ConnectionManager zkClient has connected
   [junit4]   2> 1564800 INFO  (SUITE-TestCloudJSONFacetJoinDomain-seed#[B292FDDCA6F4D6F2]-worker) [     ] o.a.s.c.c.ConnectionManager Client is connected to ZooKeeper
   [junit4]   2> 1564906 WARN  (jetty-launcher-13101-thread-1) [     ] o.e.j.s.AbstractConnector Ignoring deprecated socket close linger time
   [junit4]   2> 1564906 WARN  (jetty-launcher-13101-thread-2) [     ] o.e.j.s.AbstractConnector Ignoring deprecated socket close linger time
   [junit4]   2> 1564906 INFO  (jetty-launcher-13101-thread-1) [     ] o.a.s.c.s.e.JettySolrRunner Start Jetty (original configured port=0)
   [junit4]   2> 1564906 INFO  (jetty-launcher-13101-thread-2) [     ] o.a.s.c.s.e.JettySolrRunner Start Jetty (original configured port=0)
   [junit4]   2> 1564906 INFO  (jetty-launcher-13101-thread-1) [     ] o.a.s.c.s.e.JettySolrRunner Trying to start Jetty on port 0 try number 1 ...
   [junit4]   2> 1564906 INFO  (jetty-launcher-13101-thread-2) [     ] o.a.s.c.s.e.JettySolrRunner Trying to start Jetty on port 0 try number 1 ...
   [junit4]   2> 1564906 INFO  (jetty-launcher-13101-thread-1) [     ] o.e.j.s.Server jetty-9.4.19.v20190610; built: 2019-06-10T16:30:51.723Z; git: afcf563148970e98786327af5e07c261fda175d3; jvm 1.8.0_201-b09
   [junit4]   2> 1564906 INFO  (jetty-launcher-13101-thread-2) [     ] o.e.j.s.Server jetty-9.4.19.v20190610; built: 2019-06-10T16:30:51.723Z; git: afcf563148970e98786327af5e07c261fda175d3; jvm 1.8.0_201-b09
   [junit4]   2> 1564911 INFO  (jetty-launcher-13101-thread-1) [     ] o.e.j.s.session DefaultSessionIdManager workerName=node0
   [junit4]   2> 1564911 INFO  (jetty-launcher-13101-thread-1) [     ] o.e.j.s.session No SessionScavenger set, using defaults
   [junit4]   2> 1564911 INFO  (jetty-launcher-13101-thread-1) [     ] o.e.j.s.session node0 Scavenging every 660000ms
   [junit4]   2> 1564919 INFO  (jetty-launcher-13101-thread-2) [     ] o.e.j.s.session DefaultSessionIdManager workerName=node0
   [junit4]   2> 1564919 INFO  (jetty-launcher-13101-thread-2) [     ] o.e.j.s.session No SessionScavenger set, using defaults
   [junit4]   2> 1564919 INFO  (jetty-launcher-13101-thread-1) [     ] o.e.j.s.h.ContextHandler Started o.e.j.s.ServletContextHandler@4c6956aa{/solr,null,AVAILABLE}
   [junit4]   2> 1564919 INFO  (jetty-launcher-13101-thread-2) [     ] o.e.j.s.session node0 Scavenging every 660000ms
   [junit4]   2> 1564919 INFO  (jetty-launcher-13101-thread-2) [     ] o.e.j.s.h.ContextHandler Started o.e.j.s.ServletContextHandler@1d2a365d{/solr,null,AVAILABLE}
   [junit4]   2> 1564919 INFO  (jetty-launcher-13101-thread-1) [     ] o.e.j.s.AbstractConnector Started ServerConnector@75be6902{SSL,[ssl, http/1.1]}{127.0.0.1:37753}
   [junit4]   2> 1564919 INFO  (jetty-launcher-13101-thread-1) [     ] o.e.j.s.Server Started @1564955ms
   [junit4]   2> 1564919 INFO  (jetty-launcher-13101-thread-1) [     ] o.a.s.c.s.e.JettySolrRunner Jetty properties: {hostContext=/solr, hostPort=37753}
   [junit4]   2> 1564919 INFO  (jetty-launcher-13101-thread-2) [     ] o.e.j.s.AbstractConnector Started ServerConnector@3c4880d3{SSL,[ssl, http/1.1]}{127.0.0.1:35825}
   [junit4]   2> 1564920 INFO  (jetty-launcher-13101-thread-2) [     ] o.e.j.s.Server Started @1564955ms
   [junit4]   2> 1564920 INFO  (jetty-launcher-13101-thread-2) [     ] o.a.s.c.s.e.JettySolrRunner Jetty properties: {hostContext=/solr, hostPort=35825}
   [junit4]   2> 1564920 ERROR (jetty-launcher-13101-thread-1) [     ] o.a.s.u.StartupLoggingUtils Missing Java Option solr.log.dir. Logging may be missing or incomplete.
   [junit4]   2> 1564920 INFO  (jetty-launcher-13101-thread-1) [     ] o.a.s.s.SolrDispatchFilter Using logger factory org.apache.logging.slf4j.Log4jLoggerFactory
   [junit4]   2> 1564920 INFO  (jetty-launcher-13101-thread-1) [     ] o.a.s.s.SolrDispatchFilter  ___      _       Welcome to Apache Solr? version 8.3.0
   [junit4]   2> 1564920 INFO  (jetty-launcher-13101-thread-1) [     ] o.a.s.s.SolrDispatchFilter / __| ___| |_ _   Starting in cloud mode on port null
   [junit4]   2> 1564920 INFO  (jetty-launcher-13101-thread-1) [     ] o.a.s.s.SolrDispatchFilter \__ \/ _ \ | '_|  Install dir: null
   [junit4]   2> 1564920 INFO  (jetty-launcher-13101-thread-1) [     ] o.a.s.s.SolrDispatchFilter |___/\___/_|_|    Start time: 2019-07-23T18:38:11.029Z
   [junit4]   2> 1564920 ERROR (jetty-launcher-13101-thread-2) [     ] o.a.s.u.StartupLoggingUtils Missing Java Option solr.log.dir. Logging may be missing or incomplete.
   [junit4]   2> 1564920 INFO  (jetty-launcher-13101-thread-2) [     ] o.a.s.s.SolrDispatchFilter Using logger factory org.apache.logging.slf4j.Log4jLoggerFactory
   [junit4]   2> 1564920 INFO  (jetty-launcher-13101-thread-2) [     ] o.a.s.s.SolrDispatchFilter  ___      _       Welcome to Apache Solr? version 8.3.0
   [junit4]   2> 1564920 INFO  (jetty-launcher-13101-thread-2) [     ] o.a.s.s.SolrDispatchFilter / __| ___| |_ _   Starting in cloud mode on port null
   [junit4]   2> 1564920 INFO  (jetty-launcher-13101-thread-2) [     ] o.a.s.s.SolrDispatchFilter \__ \/ _ \ | '_|  Install dir: null
   [junit4]   2> 1564920 INFO  (jetty-launcher-13101-thread-2) [     ] o.a.s.s.SolrDispatchFilter |___/\___/_|_|    Start time: 2019-07-23T18:38:11.029Z
   [junit4]   2> 1564920 INFO  (jetty-launcher-13101-thread-2) [     ] o.a.s.c.c.ConnectionManager Waiting for client to connect to ZooKeeper
   [junit4]   2> 1564920 INFO  (jetty-launcher-13101-thread-1) [     ] o.a.s.c.c.ConnectionManager Waiting for client to connect to ZooKeeper
   [junit4]   2> 1564921 INFO  (zkConnectionManagerCallback-13105-thread-1) [     ] o.a.s.c.c.ConnectionManager zkClient has connected
   [junit4]   2> 1564921 INFO  (jetty-launcher-13101-thread-2) [     ] o.a.s.c.c.ConnectionManager Client is connected to ZooKeeper
   [junit4]   2> 1564921 INFO  (zkConnectionManagerCallback-13104-thread-1) [     ] o.a.s.c.c.ConnectionManager zkClient has connected
   [junit4]   2> 1564921 INFO  (jetty-launcher-13101-thread-1) [     ] o.a.s.c.c.ConnectionManager Client is connected to ZooKeeper
   [junit4]   2> 1564921 INFO  (jetty-launcher-13101-thread-2) [     ] o.a.s.s.SolrDispatchFilter solr.xml found in ZooKeeper. Loading...
   [junit4]   2> 1564921 INFO  (jetty-launcher-13101-thread-1) [     ] o.a.s.s.SolrDispatchFilter solr.xml found in ZooKeeper. Loading...
   [junit4]   2> 1565062 INFO  (jetty-launcher-13101-thread-1) [     ] o.a.s.h.c.HttpShardHandlerFactory Host whitelist initialized: WhitelistHostChecker [whitelistHosts=null, whitelistHostCheckingEnabled=true]
   [junit4]   2> 1565062 WARN  (jetty-launcher-13101-thread-1) [     ] o.a.s.c.s.i.Http2SolrClient Create Http2SolrClient with HTTP/1.1 transport since Java 8 or lower versions does not support SSL + HTTP/2
   [junit4]   2> 1565063 WARN  (jetty-launcher-13101-thread-1) [     ] o.e.j.u.s.S.config Trusting all certificates configured for Client@5b60aa78[provider=null,keyStore=null,trustStore=null]
   [junit4]   2> 1565063 WARN  (jetty-launcher-13101-thread-1) [     ] o.e.j.u.s.S.config No Client EndPointIdentificationAlgorithm configured for Client@5b60aa78[provider=null,keyStore=null,trustStore=null]
   [junit4]   2> 1565065 WARN  (jetty-launcher-13101-thread-1) [     ] o.a.s.c.s.i.Http2SolrClient Create Http2SolrClient with HTTP/1.1 transport since Java 8 or lower versions does not support SSL + HTTP/2
   [junit4]   2> 1565065 WARN  (jetty-launcher-13101-thread-1) [     ] o.e.j.u.s.S.config Trusting all certificates configured for Client@389f8492[provider=null,keyStore=null,trustStore=null]
   [junit4]   2> 1565065 WARN  (jetty-launcher-13101-thread-1) [     ] o.e.j.u.s.S.config No Client EndPointIdentificationAlgorithm configured for Client@389f8492[provider=null,keyStore=null,trustStore=null]
   [junit4]   2> 1565066 INFO  (jetty-launcher-13101-thread-1) [     ] o.a.s.c.ZkContainer Zookeeper client=127.0.0.1:44939/solr
   [junit4]   2> 1565067 INFO  (jetty-launcher-13101-thread-1) [     ] o.a.s.c.c.ConnectionManager Waiting for client to connect to ZooKeeper
   [junit4]   2> 1565067 INFO  (zkConnectionManagerCallback-13112-thread-1) [     ] o.a.s.c.c.ConnectionManager zkClient has connected
   [junit4]   2> 1565067 INFO  (jetty-launcher-13101-thread-1) [     ] o.a.s.c.c.ConnectionManager Client is connected to ZooKeeper
   [junit4]   2> 1565171 INFO  (jetty-launcher-13101-thread-2) [     ] o.a.s.h.c.HttpShardHandlerFactory Host whitelist initialized: WhitelistHostChecker [whitelistHosts=null, whitelistHostCheckingEnabled=true]
   [junit4]   2> 1565171 WARN  (jetty-launcher-13101-thread-2) [     ] o.a.s.c.s.i.Http2SolrClient Create Http2SolrClient with HTTP/1.1 transport since Java 8 or lower versions does not support SSL + HTTP/2
   [junit4]   2> 1565172 WARN  (jetty-launcher-13101-thread-2) [     ] o.e.j.u.s.S.config Trusting all certificates configured for Client@31fec6ca[provider=null,keyStore=null,trustStore=null]
   [junit4]   2> 1565172 WARN  (jetty-launcher-13101-thread-2) [     ] o.e.j.u.s.S.config No Client EndPointIdentificationAlgorithm configured for Client@31fec6ca[provider=null,keyStore=null,trustStore=null]
   [junit4]   2> 1565173 WARN  (jetty-launcher-13101-thread-2) [     ] o.a.s.c.s.i.Http2SolrClient Create Http2SolrClient with HTTP/1.1 transport since Java 8 or lower versions does not support SSL + HTTP/2
   [junit4]   2> 1565175 WARN  (jetty-launcher-13101-thread-2) [     ] o.e.j.u.s.S.config Trusting all certificates configured for Client@38547abb[provider=null,keyStore=null,trustStore=null]
   [junit4]   2> 1565175 WARN  (jetty-launcher-13101-thread-2) [     ] o.e.j.u.s.S.config No Client EndPointIdentificationAlgorithm configured for Client@38547abb[provider=null,keyStore=null,trustStore=null]
   [junit4]   2> 1565176 INFO  (jetty-launcher-13101-thread-2) [     ] o.a.s.c.ZkContainer Zookeeper client=127.0.0.1:44939/solr
   [junit4]   2> 1565177 INFO  (jetty-launcher-13101-thread-2) [     ] o.a.s.c.c.ConnectionManager Waiting for client to connect to ZooKeeper
   [junit4]   2> 1565178 INFO  (zkConnectionManagerCallback-13119-thread-1) [     ] o.a.s.c.c.ConnectionManager zkClient has connected
   [junit4]   2> 1565178 INFO  (jetty-launcher-13101-thread-2) [     ] o.a.s.c.c.ConnectionManager Client is connected to ZooKeeper
   [junit4]   2> 1565227 INFO  (jetty-launcher-13101-thread-1) [n:127.0.0.1:37753_solr     ] o.a.s.c.c.ConnectionManager Waiting for client to connect to ZooKeeper
   [junit4]   2> 1565228 INFO  (zkConnectionManagerCallback-13121-thread-1) [     ] o.a.s.c.c.ConnectionManager zkClient has connected
   [junit4]   2> 1565228 INFO  (jetty-launcher-13101-thread-1) [n:127.0.0.1:37753_solr     ] o.a.s.c.c.ConnectionManager Client is connected to ZooKeeper
   [junit4]   2> 1565256 INFO  (jetty-launcher-13101-thread-1) [n:127.0.0.1:37753_solr     ] o.a.s.c.OverseerElectionContext I am going to be the leader 127.0.0.1:37753_solr
   [junit4]   2> 1565256 INFO  (jetty-launcher-13101-thread-1) [n:127.0.0.1:37753_solr     ] o.a.s.c.Overseer Overseer (id=72216247724867591-127.0.0.1:37753_solr-n_0000000000) starting
   [junit4]   2> 1565258 INFO  (jetty-launcher-13101-thread-1) [n:127.0.0.1:37753_solr     ] o.a.s.c.c.ConnectionManager Waiting for client to connect to ZooKeeper
   [junit4]   2> 1565258 INFO  (zkConnectionManagerCallback-13128-thread-1) [     ] o.a.s.c.c.ConnectionManager zkClient has connected
   [junit4]   2> 1565258 INFO  (jetty-launcher-13101-thread-1) [n:127.0.0.1:37753_solr     ] o.a.s.c.c.ConnectionManager Client is connected to ZooKeeper
   [junit4]   2> 1565259 INFO  (jetty-launcher-13101-thread-1) [n:127.0.0.1:37753_solr     ] o.a.s.c.s.i.ZkClientClusterStateProvider Cluster at 127.0.0.1:44939/solr ready
   [junit4]   2> 1565260 INFO  (OverseerStateUpdate-72216247724867591-127.0.0.1:37753_solr-n_0000000000) [n:127.0.0.1:37753_solr     ] o.a.s.c.Overseer Starting to work on the main queue : 127.0.0.1:37753_solr
   [junit4]   2> 1565260 INFO  (jetty-launcher-13101-thread-1) [n:127.0.0.1:37753_solr     ] o.a.s.c.ZkController Register node as live in ZooKeeper:/live_nodes/127.0.0.1:37753_solr
   [junit4]   2> 1565260 INFO  (zkCallback-13127-thread-1) [     ] o.a.s.c.c.ZkStateReader Updated live nodes from ZooKeeper... (0) -> (1)
   [junit4]   2> 1565260 INFO  (zkCallback-13120-thread-1) [     ] o.a.s.c.c.ZkStateReader Updated live nodes from ZooKeeper... (0) -> (1)
   [junit4]   2> 1565261 INFO  (jetty-launcher-13101-thread-1) [n:127.0.0.1:37753_solr     ] o.a.s.c.LibListener clusterprops.json changed , version 0
   [junit4]   2> 1565272 INFO  (jetty-launcher-13101-thread-1) [n:127.0.0.1:37753_solr     ] o.a.s.h.a.MetricsHistoryHandler No .system collection, keeping metrics history in memory.
   [junit4]   2> 1565290 INFO  (jetty-launcher-13101-thread-1) [n:127.0.0.1:37753_solr     ] o.a.s.m.r.SolrJmxReporter JMX monitoring for 'solr_37753.solr.node' (registry 'solr.node') enabled at server: com.sun.jmx.mbeanserver.JmxMBeanServer@396e71a1
   [junit4]   2> 1565294 INFO  (jetty-launcher-13101-thread-1) [n:127.0.0.1:37753_solr     ] o.a.s.m.r.SolrJmxReporter JMX monitoring for 'solr_37753.solr.jvm' (registry 'solr.jvm') enabled at server: com.sun.jmx.mbeanserver.JmxMBeanServer@396e71a1
   [junit4]   2> 1565294 INFO  (jetty-launcher-13101-thread-1) [n:127.0.0.1:37753_solr     ] o.a.s.m.r.SolrJmxReporter JMX monitoring for 'solr_37753.solr.jetty' (registry 'solr.jetty') enabled at server: com.sun.jmx.mbeanserver.JmxMBeanServer@396e71a1
   [junit4]   2> 1565294 INFO  (jetty-launcher-13101-thread-1) [n:127.0.0.1:37753_solr     ] o.a.s.c.CorePropertiesLocator Found 0 core definitions underneath /home/jenkins/workspace/Lucene-Solr-8.x-Linux/solr/build/solr-core/test/J0/temp/solr.search.facet.TestCloudJSONFacetJoinDomain_B292FDDCA6F4D6F2-001/tempDir-001/node1/.
   [junit4]   2> 1565327 INFO  (jetty-launcher-13101-thread-2) [n:127.0.0.1:35825_solr     ] o.a.s.c.c.ConnectionManager Waiting for client to connect to ZooKeeper
   [junit4]   2> 1565328 INFO  (zkConnectionManagerCallback-13131-thread-1) [     ] o.a.s.c.c.ConnectionManager zkClient has connected
   [junit4]   2> 1565328 INFO  (jetty-launcher-13101-thread-2) [n:127.0.0.1:35825_solr     ] o.a.s.c.c.ConnectionManager Client is connected to ZooKeeper
   [junit4]   2> 1565330 INFO  (jetty-launcher-13101-thread-2) [n:127.0.0.1:35825_solr     ] o.a.s.c.c.ZkStateReader Updated live nodes from ZooKeeper... (0) -> (1)
   [junit4]   2> 1565331 INFO  (jetty-launcher-13101-thread-2) [n:127.0.0.1:35825_solr     ] o.a.s.c.ZkController Publish node=127.0.0.1:35825_solr as DOWN
   [junit4]   2> 1565331 INFO  (jetty-launcher-13101-thread-2) [n:127.0.0.1:35825_solr     ] o.a.s.c.TransientSolrCoreCacheDefault Allocating transient cache for 2147483647 transient cores
   [junit4]   2> 1565331 INFO  (jetty-launcher-13101-thread-2) [n:127.0.0.1:35825_solr     ] o.a.s.c.ZkController Register node as live in ZooKeeper:/live_nodes/127.0.0.1:35825_solr
   [junit4]   2> 1565332 INFO  (zkCallback-13120-thread-1) [     ] o.a.s.c.c.ZkStateReader Updated live nodes from ZooKeeper... (1) -> (2)
   [junit4]   2> 1565332 INFO  (zkCallback-13127-thread-1) [     ] o.a.s.c.c.ZkStateReader Updated live nodes from ZooKeeper... (1) -> (2)
   [junit4]   2> 1565332 INFO  (zkCallback-13130-thread-1) [     ] o.a.s.c.c.ZkStateReader Updated live nodes from ZooKeeper... (1) -> (2)
   [junit4]   2> 1565332 INFO  (jetty-launcher-13101-thread-2) [n:127.0.0.1:35825_solr     ] o.a.s.c.c.ConnectionManager Waiting for client to connect to ZooKeeper
   [junit4]   2> 1565333 INFO  (zkConnectionManagerCallback-13138-thread-1) [     ] o.a.s.c.c.ConnectionManager zkClient has connected
   [junit4]   2> 1565333 INFO  (jetty-launcher-13101-thread-2) [n:127.0.0.1:35825_solr     ] o.a.s.c.c.ConnectionManager Client is connected to ZooKeeper
   [junit4]   2> 1565333 INFO  (jetty-launcher-13101-thread-2) [n:127.0.0.1:35825_solr     ] o.a.s.c.c.ZkStateReader Updated live nodes from ZooKeeper... (0) -> (2)
   [junit4]   2> 1565334 INFO  (jetty-launcher-13101-thread-2) [n:127.0.0.1:35825_solr     ] o.a.s.c.s.i.ZkClientClusterStateProvider Cluster at 127.0.0.1:44939/solr ready
   [junit4]   2> 1565334 INFO  (jetty-launcher-13101-thread-2) [n:127.0.0.1:35825_solr     ] o.a.s.c.LibListener clusterprops.json changed , version 0
   [junit4]   2> 1565346 INFO  (jetty-launcher-13101-thread-2) [n:127.0.0.1:35825_solr     ] o.a.s.h.a.MetricsHistoryHandler No .system collection, keeping metrics history in memory.
   [junit4]   2> 1565361 INFO  (jetty-launcher-13101-thread-2) [n:127.0.0.1:35825_solr     ] o.a.s.m.r.SolrJmxReporter JMX monitoring for 'solr_35825.solr.node' (registry 'solr.node') enabled at server: com.sun.jmx.mbeanserver.JmxMBeanServer@396e71a1
   [junit4]   2> 1565366 INFO  (jetty-launcher-13101-thread-2) [n:127.0.0.1:35825_solr     ] o.a.s.m.r.SolrJmxReporter JMX monitoring for 'solr_35825.solr.jvm' (registry 'solr.jvm') enabled at server: com.sun.jmx.mbeanserver.JmxMBeanServer@396e71a1
   [junit4]   2> 1565366 INFO  (jetty-launcher-13101-thread-2) [n:127.0.0.1:35825_solr     ] o.a.s.m.r.SolrJmxReporter JMX monitoring for 'solr_35825.solr.jetty' (registry 'solr.jetty') enabled at server: com.sun.jmx.mbeanserver.JmxMBeanServer@396e71a1
   [junit4]   2> 1565367 INFO  (jetty-launcher-13101-thread-2) [n:127.0.0.1:35825_solr     ] o.a.s.c.CorePropertiesLocator Found 0 core definitions underneath /home/jenkins/workspace/Lucene-Solr-8.x-Linux/solr/build/solr-core/test/J0/temp/solr.search.facet.TestCloudJSONFacetJoinDomain_B292FDDCA6F4D6F2-001/tempDir-001/node2/.
   [junit4]   2> 1565384 INFO  (SUITE-TestCloudJSONFacetJoinDomain-seed#[B292FDDCA6F4D6F2]-worker) [     ] o.a.s.c.c.ConnectionManager Waiting for client to connect to ZooKeeper
   [junit4]   2> 1565385 INFO  (zkConnectionManagerCallback-13144-thread-1) [     ] o.a.s.c.c.ConnectionManager zkClient has connected
   [junit4]   2> 1565385 INFO  (SUITE-TestCloudJSONFacetJoinDomain-seed#[B292FDDCA6F4D6F2]-worker) [     ] o.a.s.c.c.ConnectionManager Client is connected to ZooKeeper
   [junit4]   2> 1565386 INFO  (SUITE-TestCloudJSONFacetJoinDomain-seed#[B292FDDCA6F4D6F2]-worker) [     ] o.a.s.c.c.ZkStateReader Updated live nodes from ZooKeeper... (0) -> (2)
   [junit4]   2> 1565386 INFO  (SUITE-TestCloudJSONFacetJoinDomain-seed#[B292FDDCA6F4D6F2]-worker) [     ] o.a.s.c.s.i.ZkClientClusterStateProvider Cluster at 127.0.0.1:44939/solr ready
   [junit4]   2> 1565526 INFO  (qtp2135294578-34828) [n:127.0.0.1:37753_solr     ] o.a.s.h.a.CollectionsHandler Invoked Collection Action :create with params property.config=solrconfig-tlog.xml&property.schema=schema_latest.xml&collection.configName=org.apache.solr.search.facet.TestCloudJSONFacetJoinDomain_config-set&name=org.apache.solr.search.facet.TestCloudJSONFacetJoinDomain_collection&nrtReplicas=1&action=CREATE&numShards=2&wt=javabin&version=2 and sendToOCPQueue=true
   [junit4]   2> 1565528 INFO  (OverseerThreadFactory-9644-thread-1-processing-n:127.0.0.1:37753_solr) [n:127.0.0.1:37753_solr     ] o.a.s.c.a.c.CreateCollectionCmd Create collection org.apache.solr.search.facet.TestCloudJSONFacetJoinDomain_collection
   [junit4]   2> 1565632 INFO  (OverseerStateUpdate-72216247724867591-127.0.0.1:37753_solr-n_0000000000) [n:127.0.0.1:37753_solr     ] o.a.s.c.o.SliceMutator createReplica() {
   [junit4]   2>   "operation":"ADDREPLICA",
   [junit4]   2>   "collection":"org.apache.solr.search.facet.TestCloudJSONFacetJoinDomain_collection",
   [junit4]   2>   "shard":"shard1",
   [junit4]   2>   "core":"org.apache.solr.search.facet.TestCloudJSONFacetJoinDomain_collection_shard1_replica_n1",
   [junit4]   2>   "state":"down",
   [junit4]   2>   "base_url":"https://127.0.0.1:35825/solr",
   [junit4]   2>   "type":"NRT",
   [junit4]   2>   "waitForFinalState":"false"} 
   [junit4]   2> 1565633 INFO  (OverseerStateUpdate-72216247724867591-127.0.0.1:37753_solr-n_0000000000) [n:127.0.0.1:37753_solr     ] o.a.s.c.o.SliceMutator createReplica() {
   [junit4]   2>   "operation":"ADDREPLICA",
   [junit4]   2>   "collection":"org.apache.solr.search.facet.TestCloudJSONFacetJoinDomain_collection",
   [junit4]   2>   "shard":"shard2",
   [junit4]   2>   "core":"org.apache.solr.search.facet.TestCloudJSONFacetJoinDomain_collection_shard2_replica_n2",
   [junit4]   2>   "state":"down",
   [junit4]   2>   "base_url":"https://127.0.0.1:37753/solr",
   [junit4]   2>   "type":"NRT",
   [junit4]   2>   "waitForFinalState":"false"} 
   [junit4]   2> 1565839 INFO  (qtp2135294578-34824) [n:127.0.0.1:37753_solr    x:org.apache.solr.search.facet.TestCloudJSONFacetJoinDomain_collection_shard2_replica_n2 ] o.a.s.h.a.CoreAdminOperation core create command qt=/admin/cores&collection.configName=org.apache.solr.search.facet.TestCloudJSONFacetJoinDomain_config-set&newCollection=true&collection=org.apache.solr.search.facet.TestCloudJSONFacetJoinDomain_collection&version=2&replicaType=NRT&property.config=solrconfig-tlog.xml&property.schema=schema_latest.xml&coreNodeName=core_node4&name=org.apache.solr.search.facet.TestCloudJSONFacetJoinDomain_collection_shard2_replica_n2&action=CREATE&numShards=2&shard=shard2&wt=javabin
   [junit4]   2> 1565839 INFO  (qtp2135294578-34824) [n:127.0.0.1:37753_solr    x:org.apache.solr.search.facet.TestCloudJSONFacetJoinDomain_collection_shard2_replica_n2 ] o.a.s.c.TransientSolrCoreCacheDefault Allocating transient cache for 2147483647 transient cores
   [junit4]   2> 1565845 INFO  (qtp917564323-34829) [n:127.0.0.1:35825_solr    x:org.apache.solr.search.facet.TestCloudJSONFacetJoinDomain_collection_shard1_replica_n1 ] o.a.s.h.a.CoreAdminOperation core create command qt=/admin/cores&collection.configName=org.apache.solr.search.facet.TestCloudJSONFacetJoinDomain_config-set&newCollection=true&collection=org.apache.solr.search.facet.TestCloudJSONFacetJoinDomain_collection&version=2&replicaType=NRT&property.config=solrconfig-tlog.xml&property.schema=schema_latest.xml&coreNodeName=core_node3&name=org.apache.solr.search.facet.TestCloudJSONFacetJoinDomain_collection_shard1_replica_n1&action=CREATE&numShards=2&shard=shard1&wt=javabin
   [junit4]   2> 1566848 INFO  (qtp2135294578-34824) [n:127.0.0.1:37753_solr c:org.apache.solr.search.facet.TestCloudJSONFacetJoinDomain_collection s:shard2 r:core_node4 x:org.apache.solr.search.facet.TestCloudJSONFacetJoinDomain_collection_shard2_replica_n2 ] o.a.s.c.SolrConfig Using Lucene MatchVersion: 8.3.0
   [junit4]   2> 1566854 INFO  (qtp917564323-34829) [n:127.0.0.1:35825_solr c:org.apache.solr.search.facet.TestCloudJSONFacetJoinDomain_collection s:shard1 r:core_node3 x:org.apache.solr.search.facet.TestCloudJSONFacetJoinDomain_collection_shard1_replica_n1 ] o.a.s.c.SolrConfig Using Lucene MatchVersion: 8.3.0
   [junit4]   2> 1566861 INFO  (qtp2135294578-34824) [n:127.0.0.1:37753_solr c:org.apache.solr.search.facet.TestCloudJSONFacetJoinDomain_collection s:shard2 r:core_node4 x:org.apache.solr.search.facet.TestCloudJSONFacetJoinDomain_collection_shard2_replica_n2 ] o.a.s.s.IndexSchema [org.apache.solr.search.facet.TestCloudJSONFacetJoinDomain_collection_shard2_replica_n2] Schema name=example
   [junit4]   2> 1566863 INFO  (qtp917564323-34829) [n:127.0.0.1:35825_solr c:org.apache.solr.search.facet.TestCloudJSONFacetJoinDomain_collection s:shard1 r:core_node3 x:org.apache.solr.search.facet.TestCloudJSONFacetJoinDomain_collection_shard1_replica_n1 ] o.a.s.s.IndexSchema [org.apache.solr.search.facet.TestCloudJSONFacetJoinDomain_collection_shard1_replica_n1] Schema name=example
   [junit4]   2> 1566924 INFO  (qtp917564323-34829) [n:127.0.0.1:35825_solr c:org.apache.solr.search.facet.TestCloudJSONFacetJoinDomain_collection s:shard1 r:core_node3 x:org.apache.solr.search.facet.TestCloudJSONFacetJoinDomain_collection_shard1_replica_n1 ] o.a.s.s.IndexSchema Loaded schema example/1.6 with uniqueid field id
   [junit4]   2> 1566933 INFO  (qtp917564323-34829) [n:127.0.0.1:35825_solr c:org.apache.solr.search.facet.TestCloudJSONFacetJoinDomain_collection s:shard1 r:core_node3 x:org.apache.solr.search.facet.TestCloudJSONFacetJoinDomain_collection_shard1_replica_n1 ] o.a.s.c.CoreContainer Creating SolrCore 'org.apache.solr.search.facet.TestCloudJSONFacetJoinDomain_collection_shard1_replica_n1' using configuration from collection org.apache.solr.search.facet.TestCloudJSONFacetJoinDomain_collection, trusted=true
   [junit4]   2> 1566934 INFO  (qtp917564323-34829) [n:127.0.0.1:35825_solr c:org.apache.solr.search.facet.TestCloudJSONFacetJoinDomain_collection s:shard1 r:core_node3 x:org.apache.solr.search.facet.TestCloudJSONFacetJoinDomain_collection_shard1_replica_n1 ] o.a.s.m.r.SolrJmxReporter JMX monitoring for 'solr_35825.solr.core.org.apache.solr.search.facet.TestCloudJSONFacetJoinDomain_collection.shard1.replica_n1' (registry 'solr.core.org.apache.solr.search.facet.TestCloudJSONFacetJoinDomain_collection.shard1.replica_n1') enabled at server: com.sun.jmx.mbeanserver.JmxMBeanServer@396e71a1
   [junit4]   2> 1566934 INFO  (qtp917564323-34829) [n:127.0.0.1:35825_solr c:org.apache.solr.search.facet.TestCloudJSONFacetJoinDomain_collection s:shard1 r:core_node3 x:org.apache.solr.search.facet.TestCloudJSONFacetJoinDomain_collection_shard1_replica_n1 ] o.a.s.c.SolrCore [[org.apache.solr.search.facet.TestCloudJSONFacetJoinDomain_collection_shard1_replica_n1] ] Opening new SolrCore at [/home/jenkins/workspace/Lucene-Solr-8.x-Linux/solr/build/solr-core/test/J0/temp/solr.search.facet.TestCloudJSONFacetJoinDomain_B292FDDCA6F4D6F2-001/tempDir-001/node2/org.apache.solr.search.facet.TestCloudJSONFacetJoinDomain_collection_shard1_replica_n1], dataDir=[/home/jenkins/workspace/Lucene-Solr-8.x-Linux/solr/build/solr-core/test/J0/temp/solr.search.facet.TestCloudJSONFacetJoinDomain_B292FDDCA6F4D6F2-001/tempDir-001/node2/./org.apache.solr.search.facet.TestCloudJSONFacetJoinDomain_collection_shard1_replica_n1/data/]
   [junit4]   2> 1566936 INFO  (qtp917564323-34829) [n:127.0.0.1:35825_solr c:org.apache.solr.search.facet.TestCloudJSONFacetJoinDomain_collection s:shard1 r:core_node3 x:org.apache.solr.search.facet.TestCloudJSONFacetJoinDomain_collection_shard1_replica_n1 ] o.a.s.u.RandomMergePolicy RandomMergePolicy wrapping class org.apache.lucene.index.TieredMergePolicy: [TieredMergePolicy: maxMergeAtOnce=30, maxMergeAtOnceExplicit=33, maxMergedSegmentMB=56.431640625, floorSegmentMB=1.1865234375, forceMergeDeletesPctAllowed=22.76907991493933, segmentsPerTier=25.0, maxCFSSegmentSizeMB=8.796093022207999E12, noCFSRatio=0.5069117388398791, deletesPctAllowed=44.04199446170249
   [junit4]   2> 1566936 INFO  (qtp2135294578-34824) [n:127.0.0.1:37753_solr c:org.apache.solr.search.facet.TestCloudJSONFacetJoinDomain_collection s:shard2 r:core_node4 x:org.apache.solr.search.facet.TestCloudJSONFacetJoinDomain_collection_shard2_replica_n2 ] o.a.s.s.IndexSchema Loaded schema example/1.6 with uniqueid field id
   [junit4]   2> 1566937 WARN  (qtp917564323-34829) [n:127.0.0.1:35825_solr c:org.apache.solr.search.facet.TestCloudJSONFacetJoinDomain_collection s:shard1 r:core_node3 x:org.apache.solr.search.facet.TestCloudJSONFacetJoinDomain_collection_shard1_replica_n1 ] o.a.s.c.RequestHandlers INVALID paramSet a in requestHandler {type = requestHandler,name = /dump,class = DumpRequestHandler,attributes = {initParams=a, name=/dump, class=DumpRequestHandler},args = {defaults={a=A,b=B}}}
   [junit4]   2> 1566953 INFO  (qtp2135294578-34824) [n:127.0.0.1:37753_solr c:org.apache.solr.search.facet.TestCloudJSONFacetJoinDomain_collection s:shard2 r:core_node4 x:org.apache.solr.search.facet.TestCloudJSONFacetJoinDomain_collection_shard2_replica_n2 ] o.a.s.c.CoreContainer Creating SolrCore 'org.apache.solr.search.facet.TestCloudJSONFacetJoinDomain_collection_shard2_replica_n2' using configuration from collection org.apache.solr.search.facet.TestCloudJSONFacetJoinDomain_collection, trusted=true
   [junit4]   2> 1566954 INFO  (qtp2135294578-34824) [n:127.0.0.1:37753_solr c:org.apache.solr.search.facet.TestCloudJSONFacetJoinDomain_collection s:shard2 r:core_node4 x:org.apache.solr.search.facet.TestCloudJSONFacetJoinDomain_collection_shard2_replica_n2 ] o.a.s.m.r.SolrJmxReporter JMX monitoring for 'solr_37753.solr.core.org.apache.solr.search.facet.TestCloudJSONFacetJoinDomain_collection.shard2.replica_n2' (registry 'solr.core.org.apache.solr.search.facet.TestCloudJSONFacetJoinDomain_collection.shard2.replica_n2') enabled at server: com.sun.jmx.mbeanserver.JmxMBeanServer@396e71a1
   [junit4]   2> 1566954 INFO  (qtp2135294578-34824) [n:127.0.0.1:37753_solr c:org.apache.solr.search.facet.TestCloudJSONFacetJoinDomain_collection s:shard2 r:core_node4 x:org.apache.solr.search.facet.TestCloudJSONFacetJoinDomain_collection_shard2_replica_n2 ] o.a.s.c.SolrCore [[org.apache.solr.search.facet.TestCloudJSONFacetJoinDomain_collection_shard2_replica_n2] ] Opening new SolrCore at [/home/jenkins/workspace/Lucene-Solr-8.x-Linux/solr/build/solr-core/test/J0/temp/solr.search.facet.TestCloudJSONFacetJoinDomain_B292FDDCA6F4D6F2-001/tempDir-001/node1/org.apache.solr.search.facet.TestCloudJSONFacetJoinDomain_collection_shard2_replica_n2], dataDir=[/home/jenkins/workspace/Lucene-Solr-8.x-Linux/solr/build/solr-core/test/J0/temp/solr.search.facet.TestCloudJSONFacetJoinDomain_B292FDDCA6F4D6F2-001/tempDir-001/node1/./org.apache.solr.search.facet.TestCloudJSONFacetJoinDomain_collection_shard2_replica_n2/data/]
   [junit4]   2> 1566955 INFO  (qtp2135294578-34824) [n:127.0.0.1:37753_solr c:org.apache.solr.search.facet.TestCloudJSONFacetJoinDomain_collection s:shard2 r:core_node4 x:org.apache.solr.search.facet.TestCloudJSONFacetJoinDomain_collection_shard2_replica_n2 ] o.a.s.u.RandomMergePolicy RandomMergePolicy wrapping class org.apache.lucene.index.TieredMergePolicy: [TieredMergePolicy: maxMergeAtOnce=30, maxMergeAtOnceExplicit=33, maxMergedSegmentMB=56.431640625, floorSegmentMB=1.1865234375, forceMergeDeletesPctAllowed=22.76907991493933, segmentsPerTier=25.0, maxCFSSegmentSizeMB=8.796093022207999E12, noCFSRatio=0.5069117388398791, deletesPctAllowed=44.04199446170249
   [junit4]   2> 1566957 WARN  (qtp2135294578-34824) [n:127.0.0.1:37753_solr c:org.apache.solr.search.facet.TestCloudJSONFacetJoinDomain_collection s:shard2 r:core_node4 x:org.apache.solr.search.facet.TestCloudJSONFacetJoinDomain_collection_shard2_replica_n2 ] o.a.s.c.RequestHandlers INVALID paramSet a in requestHandler {type = requestHandler,name = /dump,class = DumpRequestHandler,attributes = {initParams=a, name=/dump, class=DumpRequestHandler},args = {defaults={a=A,b=B}}}
   [junit4]   2> 1566980 INFO  (qtp917564323-34829) [n:127.0.0.1:35825_solr c:org.apache.solr.search.facet.TestCloudJSONFacetJoinDomain_collection s:shard1 r:core_node3 x:org.apache.solr.search.facet.TestCloudJSONFacetJoinDomain_collection_shard1_replica_n1 ] o.a.s.u.UpdateHandler Using UpdateLog implementation: org.apache.solr.update.UpdateLog
   [junit4]   2> 1566980 INFO  (qtp917564323-34829) [n:127.0.0.1:35825_solr c:org.apache.solr.search.facet.TestCloudJSONFacetJoinDomain_collection s:shard1 r:core_node3 x:org.apache.solr.search.facet.TestCloudJSONFacetJoinDomain_collection_shard1_replica_n1 ] o.a.s.u.UpdateLog Initializing UpdateLog: dataDir= defaultSyncLevel=FLUSH numRecordsToKeep=100 maxNumLogsToKeep=10 numVersionBuckets=65536
   [junit4]   2> 1566981 INFO  (qtp917564323-34829) [n:127.0.0.1:35825_solr c:org.apache.solr.search.facet.TestCloudJSONFacetJoinDomain_collection s:shard1 r:core_node3 x:org.apache.solr.search.facet.TestCloudJSONFacetJoinDomain_collection_shard1_replica_n1 ] o.a.s.u.CommitTracker Hard AutoCommit: disabled
   [junit4]   2> 1566981 INFO  (qtp917564323-34829) [n:127.0.0.1:35825_solr c:org.apache.solr.search.facet.TestCloudJSONFacetJoinDomain_collection s:shard1 r:core_node3 x:org.apache.solr.search.facet.TestCloudJSONFacetJoinDomain_collection_shard1_replica_n1 ] o.a.s.u.CommitTracker Soft AutoCommit: disabled
   [junit4]   2> 1566985 INFO  (qtp917564323-34829) [n:127.0.0.1:35825_solr c:org.apache.solr.search.facet.TestCloudJSONFacetJoinDomain_collection s:shard1 r:core_node3 x:org.apache.solr.search.facet.TestCloudJSONFacetJoinDomain_collection_shard1_replica_n1 ] o.a.s.u.RandomMergePolicy RandomMergePolicy wrapping class org.apache.lucene.index.TieredMergePolicy: [TieredMergePolicy: maxMergeAtOnce=12, maxMergeAtOnceExplicit=19, maxMergedSegmentMB=4.2314453125, floorSegmentMB=1.984375, forceMergeDeletesPctAllowed=20.98642643668618, segmentsPerTier=20.0, maxCFSSegmentSizeMB=8.796093022207999E12, noCFSRatio=0.7724661427245462, deletesPctAllowed=36.86803110438468
   [junit4]   2> 1566985 INFO  (qtp917564323-34829) [n:127.0.0.1:35825_solr c:org.apache.solr.search.facet.TestCloudJSONFacetJoinDomain_collection s:shard1 r:core_node3 x:org.apache.solr.search.facet.TestCloudJSONFacetJoinDomain_collection_shard1_replica_n1 ] o.a.s.s.SolrIndexSearcher Opening [Searcher@600a1119[org.apache.solr.search.facet.TestCloudJSONFacetJoinDomain_collection_shard1_replica_n1] main]
   [junit4]   2> 1566986 INFO  (qtp917564323-34829) [n:127.0.0.1:35825_solr c:org.apache.solr.search.facet.TestCloudJSONFacetJoinDomain_collection s:shard1 r:core_node3 x:org.apache.solr.search.facet.TestCloudJSONFacetJoinDomain_collection_shard1_replica_n1 ] o.a.s.r.ManagedResourceStorage Configured ZooKeeperStorageIO with znodeBase: /configs/org.apache.solr.search.facet.TestCloudJSONFacetJoinDomain_config-set
   [junit4]   2> 1566987 INFO  (qtp917564323-34829) [n:127.0.0.1:35825_solr c:org.apache.solr.search.facet.TestCloudJSONFacetJoinDomain_collection s:shard1 r:core_node3 x:org.apache.solr.search.facet.TestCloudJSONFacetJoinDomain_collection_shard1_replica_n1 ] o.a.s.r.ManagedResourceStorage Loaded null at path _rest_managed.json using ZooKeeperStorageIO:path=/configs/org.apache.solr.search.facet.TestCloudJSONFacetJoinDomain_config-set
   [junit4]   2> 1566988 INFO  (qtp917564323-34829) [n:127.0.0.1:35825_solr c:org.apache.solr.search.facet.TestCloudJSONFacetJoinDomain_collection s:shard1 r:core_node3 x:org.apache.solr.search.facet.TestCloudJSONFacetJoinDomain_collection_shard1_replica_n1 ] o.a.s.h.ReplicationHandler Commits will be reserved for 10000ms.
   [junit4]   2> 1566988 INFO  (qtp917564323-34829) [n:127.0.0.1:35825_solr c:org.apache.solr.search.facet.TestCloudJSONFacetJoinDomain_collection s:shard1 r:core_node3 x:org.apache.solr.search.facet.TestCloudJSONFacetJoinDomain_collection_shard1_replica_n1 ] o.a.s.u.UpdateLog Could not find max version in index or recent updates, using new clock 1639875444051279872
   [junit4]   2> 1566991 INFO  (searcherExecutor-9653-thread-1-processing-n:127.0.0.1:35825_solr x:org.apache.solr.search.facet.TestCloudJSONFacetJoinDomain_collection_shard1_replica_n1 c:org.apache.solr.search.facet.TestCloudJSONFacetJoinDomain_collection s:shard1 r:core_node3) [n:127.0.0.1:35825_solr c:org.apache.solr.search.facet.TestCloudJSONFacetJoinDomain_collection s:shard1 r:core_node3 x:org.apache.solr.search.facet.TestCloudJSONFacetJoinDomain_collection_shard1_replica_n1 ] o.a.s.c.SolrCore [org.apache.solr.search.facet.TestCloudJSONFacetJoinDomain_collection_shard1_replica_n1] Registered new searcher Searcher@600a1119[org.apache.solr.search.facet.TestCloudJSONFacetJoinDomain_collection_shard1_replica_n1] main{ExitableDirectoryReader(UninvertingDirectoryReader())}
   [junit4]   2> 1566993 INFO  (qtp2135294578-34824) [n:127.0.0.1:37753_solr c:org.apache.solr.search.facet.TestCloudJSONFacetJoinDomain_collection s:shard2 r:core_node4 x:org.apache.solr.search.facet.TestCloudJSONFacetJoinDomain_collection_shard2_replica_n2 ] o.a.s.u.UpdateHandler Using UpdateLog implementation: org.apache.solr.update.UpdateLog
   [junit4]   2> 1566993 INFO  (qtp2135294578-34824) [n:127.0.0.1:37753_solr c:org.apache.solr.search.facet.TestCloudJSONFacetJoinDomain_collection s:shard2 r:core_node4 x:org.apache.solr.search.facet.TestCloudJSONFacetJoinDomain_collection_shard2_replica_n2 ] o.a.s.u.UpdateLog Initializing UpdateLog: dataDir= defaultSyncLevel=FLUSH numRecordsToKeep=100 maxNumLogsToKeep=10 numVersionBuckets=65536
   [junit4]   2> 1566994 INFO  (qtp2135294578-34824) [n:127.0.0.1:37753_solr c:org.apache.solr.search.facet.TestCloudJSONFacetJoinDomain_collection s:shard2 r:core_node4 x:org.apache.solr.search.facet.TestCloudJSONFacetJoinDomain_collection_shard2_replica_n2 ] o.a.s.u.CommitTracker Hard AutoCommit: disabled
   [junit4]   2> 1567019 INFO  (qtp2135294578-34824) [n:127.0.0.1:37753_solr c:org.apache.solr.search.facet.TestCloudJSONFacetJoinDomain_collection s:shard2 r:core_node4 x:org.apache.solr.search.facet.TestCloudJSONFacetJoinDomain_collection_shard2_replica_n2 ] o.a.s.u.CommitTracker Soft AutoCommit: disabled
   [junit4]   2> 1567020 INFO  (qtp2135294578-34824) [n:127.0.0.1:37753_solr c:org.apache.solr.search.facet.TestCloudJSONFacetJoinDomain_collection s:shard2 r:core_node4 x:org.apache.solr.search.facet.TestCloudJSONFacetJoinDomain_collection_shard2_replica_n2 ] o.a.s.u.RandomMergePolicy RandomMergePolicy wrapping class org.apache.lucene.index.TieredMergePolicy: [TieredMergePolicy: maxMergeAtOnce=12, maxMergeAtOnceExplicit=19, maxMergedSegmentMB=4.2314453125, floorSegmentMB=1.984375, forceMergeDeletesPctAllowed=20.98642643668618, segmentsPerTier=20.0, maxCFSSegmentSizeMB=8.796093022207999E12, noCFSRatio=0.7724661427245462, deletesPctAllowed=36.86803110438468
   [junit4]   2> 1567021 INFO  (qtp2135294578-34824) [n:127.0.0.1:37753_solr c:org.apache.solr.search.facet.TestCloudJSONFacetJoinDomain_collection s:shard2 r:core_node4 x:org.apache.solr.search.facet.TestCloudJSONFacetJoinDomain_collection_shard2_replica_n2 ] o.a.s.s.SolrIndexSearcher Opening [Searcher@5f0295bd[org.apache.solr.search.facet.TestCloudJSONFacetJoinDomain_collection_shard2_replica_n2] main]
   [junit4]   2> 1567022 INFO  (qtp917564323-34829) [n:127.0.0.1:35825_solr c:org.apache.solr.search.facet.TestCloudJSONFacetJoinDomain_collection s:shard1 r:core_node3 x:org.apache.solr.search.facet.TestCloudJSONFacetJoinDomain_collection_shard1_replica_n1 ] o.a.s.c.ZkShardTerms Successful update of terms at /collections/org.apache.solr.search.facet.TestCloudJSONFacetJoinDomain_collection/terms/shard1 to Terms{values={core_node3=0}, version=0}
   [junit4]   2> 1567022 INFO  (qtp917564323-34829) [n:127.0.0.1:35825_solr c:org.apache.solr.search.facet.TestCloudJSONFacetJoinDomain_collection s:shard1 r:core_node3 x:org.apache.solr.search.facet.TestCloudJSONFacetJoinDomain_collection_shard1_replica_n1 ] o.a.s.c.ShardLeaderElectionContextBase make sure parent is created /collections/org.apache.solr.search.facet.TestCloudJSONFacetJoinDomain_collection/leaders/shard1
   [junit4]   2> 1567023 INFO  (qtp2135294578-34824) [n:127.0.0.1:37753_solr c:org.apache.solr.search.facet.TestCloudJSONFacetJoinDomain_collection s:shard2 r:core_node4 x:org.apache.solr.search.facet.TestCloudJSONFacetJoinDomain_collection_shard2_replica_n2 ] o.a.s.r.ManagedResourceStorage Configured ZooKeeperStorageIO with znodeBase: /configs/org.apache.solr.search.facet.TestCloudJSONFacetJoinDomain_config-set
   [junit4]   2> 1567023 INFO  (qtp2135294578-34824) [n:127.0.0.1:37753_solr c:org.apache.solr.search.facet.TestCloudJSONFacetJoinDomain_collection s:shard2 r:core_node4 x:org.apache.solr.search.facet.TestCloudJSONFacetJoinDomain_collection_shard2_replica_n2 ] o.a.s.r.ManagedResourceStorage Loaded null at path _rest_managed.json using ZooKeeperStorageIO:path=/configs/org.apache.solr.search.facet.TestCloudJSONFacetJoinDomain_config-set
   [junit4]   2> 1567023 INFO  (qtp2135294578-34824) [n:127.0.0.1:37753_solr c:org.apache.solr.search.facet.TestCloudJSONFacetJoinDomain_collection s:shard2 r:core_node4 x:org.apache.solr.search.facet.TestCloudJSONFacetJoinDomain_collection_shard2_replica_n2 ] o.a.s.h.ReplicationHandler Commits will be reserved for 10000ms.
   [junit4]   2> 1567023 INFO  (qtp2135294578-34824) [n:127.0.0.1:37753_solr c:org.apache.solr.search.facet.TestCloudJSONFacetJoinDomain_collection s:shard2 r:core_node4 x:org.apache.solr.search.facet.TestCloudJSONFacetJoinDomain_collection_shard2_replica_n2 ] o.a.s.u.UpdateLog Could not find max version in index or recent updates, using new clock 1639875444087980032
   [junit4]   2> 1567025 INFO  (qtp917564323-34829) [n:127.0.0.1:35825_solr c:org.apache.solr.search.facet.TestCloudJSONFacetJoinDomain_collection s:shard1 r:core_node3 x:org.apache.solr.search.facet.TestCloudJSONFacetJoinDomain_collection_shard1_replica_n1 ] o.a.s.c.ShardLeaderElectionContext Enough replicas found to continue.
   [junit4]   2> 1567025 INFO  (qtp917564323-34829) [n:127.0.0.1:35825_solr c:org.apache.solr.search.facet.TestCloudJSONFacetJoinDomain_collection s:shard1 r:core_node3 x:org.apache.solr.search.facet.TestCloudJSONFacetJoinDomain_collection_shard1_replica_n1 ] o.a.s.c.ShardLeaderElectionContext I may be the new leader - try and sync
   [junit4]   2> 1567025 INFO  (qtp917564323-34829) [n:127.0.0.1:35825_solr c:org.apache.solr.search.facet.TestCloudJSONFacetJoinDomain_collection s:shard1 r:core_node3 x:org.apache.solr.search.facet.TestCloudJSONFacetJoinDomain_collection_shard1_replica_n1 ] o.a.s.c.SyncStrategy Sync replicas to https://127.0.0.1:35825/solr/org.apache.solr.search.facet.TestCloudJSONFacetJoinDomain_collection_shard1_replica_n1/
   [junit4]   2> 1567025 INFO  (qtp917564323-34829) [n:127.0.0.1:35825_solr c:org.apache.solr.search.facet.TestCloudJSONFacetJoinDomain_collection s:shard1 r:core_node3 x:org.apache.solr.search.facet.TestCloudJSONFacetJoinDomain_collection_shard1_replica_n1 ] o.a.s.c.SyncStrategy Sync Success - now sync replicas to me
   [junit4]   2> 1567026 INFO  (qtp917564323-34829) [n:127.0.0.1:35825_solr c:org.apache.solr.search.facet.TestCloudJSONFacetJoinDomain_collection s:shard1 r:core_node3 x:org.apache.solr.search.facet.TestCloudJSONFacetJoinDomain_collection_shard1_replica_n1 ] o.a.s.c.SyncStrategy https://127.0.0.1:35825/solr/org.apache.solr.search.facet.TestCloudJSONFacetJoinDomain_collection_shard1_replica_n1/ has no replicas
   [junit4]   2> 1567026 INFO  (qtp917564323-34829) [n:127.0.0.1:35825_solr c:org.apache.solr.search.facet.TestCloudJSONFacetJoinDomain_collection s:shard1 r:core_node3 x:org.apache.solr.search.facet.TestCloudJSONFacetJoinDomain_collection_shard1_replica_n1 ] o.a.s.c.ShardLeaderElectionContextBase Creating leader registration node /collections/org.apache.solr.search.facet.TestCloudJSONFacetJoinDomain_collection/leaders/shard1/leader after winning as /collections/org.apache.solr.search.facet.TestCloudJSONFacetJoinDomain_collection/leader_elect/shard1/election/72216247724867593-core_node3-n_0000000000
   [junit4]   2> 1567027 INFO  (searcherExecutor-9654-thread-1-processing-n:127.0.0.1:37753_solr x:org.apache.solr.search.facet.TestCloudJSONFacetJoinDomain_collection_shard2_replica_n2 c:org.apache.solr.search.facet.TestCloudJSONFacetJoinDomain_collection s:shard2 r:core_node4) [n:127.0.0.1:37753_solr c:org.apache.solr.search.facet.TestCloudJSONFacetJoinDomain_collection s:shard2 r:core_node4 x:org.apache.solr.search.facet.TestCloudJSONFacetJoinDomain_collection_shard2_replica_n2 ] o.a.s.c.SolrCore [org.apache.solr.search.facet.TestCloudJSONFacetJoinDomain_collection_shard2_replica_n2] Registered new searcher Searcher@5f0295bd[org.apache.solr.search.facet.TestCloudJSONFacetJoinDomain_collection_shard2_replica_n2] main{ExitableDirectoryReader(UninvertingDirectoryReader())}
   [junit4]   2> 1567027 INFO  (qtp917564323-34829) [n:127.0.0.1:35825_solr c:org.apache.solr.search.facet.TestCloudJSONFacetJoinDomain_collection s:shard1 r:core_node3 x:org.apache.solr.search.facet.TestCloudJSONFacetJoinDomain_collection_shard1_replica_n1 ] o.a.s.c.ShardLeaderElectionContext I am the new leader: https://127.0.0.1:35825/solr/org.apache.solr.search.facet.TestCloudJSONFacetJoinDomain_collection_shard1_replica_n1/ shard1
   [junit4]   2> 1567028 INFO  (qtp2135294578-34824) [n:127.0.0.1:37753_solr c:org.apache.solr.search.facet.TestCloudJSONFacetJoinDomain_collection s:shard2 r:core_node4 x:org.apache.solr.search.facet.TestCloudJSONFacetJoinDomain_collection_shard2_replica_n2 ] o.a.s.c.ZkShardTerms Successful update of terms at /collections/org.apache.solr.search.facet.TestCloudJSONFacetJoinDomain_collection/terms/shard2 to Terms{values={core_node4=0}, version=0}
   [junit4]   2> 1567028 INFO  (qtp2135294578-34824) [n:127.0.0.1:37753_solr c:org.apache.solr.search.facet.TestCloudJSONFacetJoinDomain_collection s:shard2 r:core_node4 x:org.apache.solr.search.facet.TestCloudJSONFacetJoinDomain_collection_shard2_replica_n2 ] o.a.s.c.ShardLeaderElectionContextBase make sure parent is created /collections/org.apache.solr.search.facet.TestCloudJSONFacetJoinDomain_collection/leaders/shard2
   [junit4]   2> 1567029 INFO  (qtp2135294578-34824) [n:127.0.0.1:37753_solr c:org.apache.solr.search.facet.TestCloudJSONFacetJoinDomain_collection s:shard2 r:core_node4 x:org.apache.solr.search.facet.TestCloudJSONFacetJoinDomain_collection_shard2_replica_n2 ] o.a.s.c.ShardLeaderElectionContext Enough replicas found to continue.
   [junit4]   2> 1567029 INFO  (qtp2135294578-34824) [n:127.0.0.1:37753_solr c:org.apache.solr.search.facet.TestCloudJSONFacetJoinDomain_collection s:shard2 r:core_node4 x:org.apache.solr.search.facet.TestCloudJSONFacetJoinDomain_collection_shard2_replica_n2 ] o.a.s.c.ShardLeaderElectionContext I may be the new leader - try and sync
   [junit4]   2> 1567029 INFO  (qtp2135294578-34824) [n:127.0.0.1:37753_solr c:org.apache.solr.search.facet.TestCloudJSONFacetJoinDomain_collection s:shard2 r:core_node4 x:org.apache.solr.search.facet.TestCloudJSONFacetJoinDomain_collection_shard2_replica_n2 ] o.a.s.c.SyncStrategy Sync replicas to https://127.0.0.1:37753/solr/org.apache.solr.search.facet.TestCloudJSONFacetJoinDomain_collection_shard2_replica_n2/
   [junit4]   2> 1567029 INFO  (qtp2135294578-34824) [n:127.0.0.1:37753_solr c:org.apache.solr.search.facet.TestCloudJSONFacetJoinDomain_collection s:shard2 r:core_node4 x:org.apache.solr.search.facet.TestCloudJSONFacetJoinDomain_collection_shard2_replica_n2 ] o.a.s.c.SyncStrategy Sync Success - now sync replicas to me
   [junit4]   2> 1567029 INFO  (qtp2135294578-34824) [n:127.0.0.1:37753_solr c:org.apache.solr.search.facet.TestCloudJSONFacetJoinDomain_collection s:shard2 r:core_node4 x:org.apache.solr.search.facet.TestCloudJSONFacetJoinDomain_collection_shard2_replica_n2 ] o.a.s.c.SyncStrategy https://127.0.0.1:37753/solr/org.apache.solr.search.facet.TestCloudJSONFacetJoinDomain_collection_shard2_replica_n2/ has no replicas
   [junit4]   2> 1567029 INFO  (qtp2135294578-34824) [n:127.0.0.1:37753_solr c:org.apache.solr.search.facet.TestCloudJSONFacetJoinDomain_collection s:shard2 r:core_node4 x:org.apache.solr.search.facet.TestCloudJSONFacetJoinDomain_collection_shard2_replica_n2 ] o.a.s.c.ShardLeaderElectionContextBase Creating leader registration node /collections/org.apache.solr.search.facet.TestCloudJSONFacetJoinDomain_collection/leaders/shard2/leader after winning as /collections/org.apache.solr.search.facet.TestCloudJSONFacetJoinDomain_collection/leader_elect/shard2/election/72216247724867591-core_node4-n_0000000000
   [junit4]   2> 1567030 INFO  (qtp2135294578-34824) [n:127.0.0.1:37753_solr c:org.apache.solr.search.facet.TestCloudJSONFacetJoinDomain_collection s:shard2 r:core_node4 x:org.apache.solr.search.facet.TestCloudJSONFacetJoinDomain_collection_shard2_replica_n2 ] o.a.s.c.ShardLeaderElectionContext I am the new leader: https://127.0.0.1:37753/solr/org.apache.solr.search.facet.TestCloudJSONFacetJoinDomain_collection_shard2_replica_n2/ shard2
   [junit4]   2> 1567131 INFO  (zkCallback-13120-thread-1) [     ] o.a.s.c.c.ZkStateReader A cluster state change: [WatchedEvent state:SyncConnected type:NodeDataChanged path:/collections/org.apache.solr.search.facet.TestCloudJSONFacetJoinDomain_collection/state.json] for collection [org.apache.solr.search.facet.TestCloudJSONFacetJoinDomain_collection] has occurred - updating... (live nodes size: [2])
   [junit4]   2> 1567131 INFO  (zkCallback-13130-thread-1) [     ] o.a.s.c.c.ZkStateReader A cluster state change: [WatchedEvent state:SyncConnected type:NodeDataChanged path:/collections/org.apache.solr.search.facet.TestCloudJSONFacetJoinDomain_collection/state.json] for collection [org.apache.solr.search.facet.TestCloudJSONFacetJoinDomain_collection] has occurred - updating... (live nodes size: [2])
   [junit4]   2> 1567131 INFO  (zkCallback-13120-thread-2) [     ] o.a.s.c.c.ZkStateReader A cluster state change: [WatchedEvent state:SyncConnected type:NodeDataChanged path:/collections/org.apache.solr.search.facet.TestCloudJSONFacetJoinDomain_collection/state.json] for collection [org.apache.solr.search.facet.TestCloudJSONFacetJoinDomain_collection] has occurred - updating... (live nodes size: [2])
   [junit4]   2> 1567131 INFO  (zkCallback-13130-thread-2) [     ] o.a.s.c.c.ZkStateReader A cluster state change: [WatchedEvent state:SyncConnected type:NodeDataChanged path:/collections/org.apache.solr.search.facet.TestCloudJSONFacetJoinDomain_collection/state.json] for collection [org.apache.solr.search.facet.TestCloudJSONFacetJoinDomain_collection] has occurred - updating... (live nodes size: [2])
   [junit4]   2> 1567131 INFO  (qtp917564323-34829) [n:127.0.0.1:35825_solr c:org.apache.solr.search.facet.TestCloudJSONFacetJoinDomain_collection s:shard1 r:core_node3 x:org.apache.solr.search.facet.TestCloudJSONFacetJoinDomain_collection_shard1_replica_n1 ] o.a.s.c.ZkController I am the leader, no recovery necessary
   [junit4]   2> 1567131 INFO  (qtp2135294578-34824) [n:127.0.0.1:37753_solr c:org.apache.solr.search.facet.TestCloudJSONFacetJoinDomain_collection s:shard2 r:core_node4 x:org.apache.solr.search.facet.TestCloudJSONFacetJoinDomain_collection_shard2_replica_n2 ] o.a.s.c.ZkController I am the leader, no recovery necessary
   [junit4]   2> 1567132 INFO  (qtp917564323-34829) [n:127.0.0.1:35825_solr c:org.apache.solr.search.facet.TestCloudJSONFacetJoinDomain_collection s:shard1 r:core_node3 x:org.apache.solr.search.facet.TestCloudJSONFacetJoinDomain_collection_shard1_replica_n1 ] o.a.s.s.HttpSolrCall [admin] webapp=null path=/admin/cores params={qt=/admin/cores&collection.configName=org.apache.solr.search.facet.TestCloudJSONFacetJoinDomain_config-set&newCollection=true&collection=org.apache.solr.search.facet.TestCloudJSONFacetJoinDomain_collection&version=2&replicaType=NRT&property.config=solrconfig-tlog.xml&property.schema=schema_latest.xml&coreNodeName=core_node3&name=org.apache.solr.search.facet.TestCloudJSONFacetJoinDomain_collection_shard1_replica_n1&action=CREATE&numShards=2&shard=shard1&wt=javabin} status=0 QTime=1287
   [junit4]   2> 1567132 INFO  (qtp2135294578-34824) [n:127.0.0.1:37753_solr c:org.apache.solr.search.facet.TestCloudJSONFacetJoinDomain_collection s:shard2 r:core_node4 x:org.apache.solr.search.facet.TestCloudJSONFacetJoinDomain_collection_shard2_replica_n2 ] o.a.s.s.HttpSolrCall [admin] webapp=null path=/admin/cores params={qt=/admin/cores&collection.configName=org.apache.solr.search.facet.TestCloudJSONFacetJoinDomain_config-set&newCollection=true&collection=org.apache.solr.search.facet.TestCloudJSONFacetJoinDomain_collection&version=2&replicaType=NRT&property.config=solrconfig-tlog.xml&pro

[...truncated too long message...]

ry@f5244e9
   [junit4]   2> 78686 INFO  (jetty-closer-490-thread-3) [     ] o.a.s.m.SolrMetricManager Closing metric reporters for registry=solr.cluster, tag=null
   [junit4]   2> 78771 INFO  (jetty-closer-490-thread-2) [     ] o.a.s.c.Overseer Overseer (id=72216370525437962-127.0.0.1:38577_solr-n_0000000000) closing
   [junit4]   2> 78775 INFO  (zkCallback-479-thread-3) [     ] o.a.s.c.c.ZkStateReader Updated live nodes from ZooKeeper... (3) -> (1)
   [junit4]   2> 78775 INFO  (zkCallback-486-thread-1) [     ] o.a.s.c.c.ZkStateReader Updated live nodes from ZooKeeper... (3) -> (2)
   [junit4]   2> 78775 INFO  (jetty-closer-490-thread-2) [     ] o.e.j.s.AbstractConnector Stopped ServerConnector@15f49aae{SSL,[ssl, http/1.1]}{127.0.0.1:0}
   [junit4]   2> 78775 INFO  (jetty-closer-490-thread-2) [     ] o.e.j.s.h.ContextHandler Stopped o.e.j.s.ServletContextHandler@1c3c1eeb{/solr,null,UNAVAILABLE}
   [junit4]   2> 78776 INFO  (jetty-closer-490-thread-2) [     ] o.e.j.s.session node0 Stopped scavenging
   [junit4]   2> 79073 INFO  (jetty-closer-490-thread-1) [     ] o.e.j.s.AbstractConnector Stopped ServerConnector@349e3f7d{SSL,[ssl, http/1.1]}{127.0.0.1:33307}
   [junit4]   2> 79073 INFO  (jetty-closer-490-thread-1) [     ] o.e.j.s.h.ContextHandler Stopped o.e.j.s.ServletContextHandler@756229a8{/solr,null,UNAVAILABLE}
   [junit4]   2> 79073 INFO  (jetty-closer-490-thread-1) [     ] o.e.j.s.session node0 Stopped scavenging
   [junit4]   2> 79173 INFO  (jetty-closer-490-thread-3) [     ] o.e.j.s.AbstractConnector Stopped ServerConnector@53183ba1{SSL,[ssl, http/1.1]}{127.0.0.1:0}
   [junit4]   2> 79173 INFO  (jetty-closer-490-thread-3) [     ] o.e.j.s.h.ContextHandler Stopped o.e.j.s.ServletContextHandler@29c70f62{/solr,null,UNAVAILABLE}
   [junit4]   2> 79174 INFO  (jetty-closer-490-thread-3) [     ] o.e.j.s.session node0 Stopped scavenging
   [junit4]   2> 79175 INFO  (TEST-BasicAuthIntegrationTest.testBasicAuth-seed#[B292FDDCA6F4D6F2]) [     ] o.a.s.c.ZkTestServer Shutting down ZkTestServer.
   [junit4]   2> 79379 WARN  (ZkTestServer Run Thread) [     ] o.a.s.c.ZkTestServer Watch limit violations: 
   [junit4]   2> Maximum concurrent create/delete watches above limit:
   [junit4]   2> 
   [junit4]   2> 	9	/solr/aliases.json
   [junit4]   2> 	4	/solr/security.json
   [junit4]   2> 	4	/solr/configs/conf
   [junit4]   2> 	3	/solr/collections/authCollection/terms/shard2
   [junit4]   2> 	2	/solr/collections/authCollection/terms/shard1
   [junit4]   2> 	2	/solr/collections/authCollection/terms/shard3
   [junit4]   2> 
   [junit4]   2> Maximum concurrent data watches above limit:
   [junit4]   2> 
   [junit4]   2> 	56	/solr/collections/authCollection/state.json
   [junit4]   2> 	9	/solr/clusterstate.json
   [junit4]   2> 	9	/solr/clusterprops.json
   [junit4]   2> 	3	/solr/security.json
   [junit4]   2> 	2	/solr/overseer_elect/election/72216370525437962-127.0.0.1:38577_solr-n_0000000000
   [junit4]   2> 
   [junit4]   2> Maximum concurrent children watches above limit:
   [junit4]   2> 
   [junit4]   2> 	35	/solr/live_nodes
   [junit4]   2> 	27	/solr/overseer/queue
   [junit4]   2> 	16	/solr/collections
   [junit4]   2> 	4	/solr/overseer/collection-queue-work
   [junit4]   2> 
   [junit4]   2> 79381 INFO  (TEST-BasicAuthIntegrationTest.testBasicAuth-seed#[B292FDDCA6F4D6F2]) [     ] o.a.s.c.ZkTestServer parse host and port list: 127.0.0.1:41693
   [junit4]   2> 79381 INFO  (TEST-BasicAuthIntegrationTest.testBasicAuth-seed#[B292FDDCA6F4D6F2]) [     ] o.a.s.c.ZkTestServer connecting to 127.0.0.1 41693
   [junit4]   2> 79382 INFO  (TEST-BasicAuthIntegrationTest.testBasicAuth-seed#[B292FDDCA6F4D6F2]) [     ] o.a.s.SolrTestCaseJ4 ###Ending testBasicAuth
   [junit4]   2> NOTE: reproduce with: ant test  -Dtestcase=BasicAuthIntegrationTest -Dtests.method=testBasicAuth -Dtests.seed=B292FDDCA6F4D6F2 -Dtests.multiplier=3 -Dtests.slow=true -Dtests.badapples=true -Dtests.locale=et-EE -Dtests.timezone=Pacific/Easter -Dtests.asserts=true -Dtests.file.encoding=US-ASCII
   [junit4] FAILURE 6.23s J2 | BasicAuthIntegrationTest.testBasicAuth <<<
   [junit4]    > Throwable #1: java.lang.AssertionError: expected:<401> but was:<400>
   [junit4]    > 	at __randomizedtesting.SeedInfo.seed([B292FDDCA6F4D6F2:EFC8BCE02A75588]:0)
   [junit4]    > 	at org.apache.solr.security.BasicAuthIntegrationTest.testBasicAuth(BasicAuthIntegrationTest.java:151)
   [junit4]    > 	at java.lang.Thread.run(Thread.java:748)
   [junit4]   2> NOTE: leaving temporary files on disk at: /home/jenkins/workspace/Lucene-Solr-8.x-Linux/solr/build/solr-core/test/J2/temp/solr.security.BasicAuthIntegrationTest_B292FDDCA6F4D6F2-004
   [junit4]   2> Jul 23, 2019 7:09:30 PM com.carrotsearch.randomizedtesting.ThreadLeakControl checkThreadLeaks
   [junit4]   2> WARNING: Will linger awaiting termination of 1 leaked thread(s).
   [junit4]   2> NOTE: test params are: codec=FastDecompressionCompressingStoredFields(storedFieldsFormat=CompressingStoredFieldsFormat(compressionMode=FAST_DECOMPRESSION, chunkSize=8, maxDocsPerChunk=3, blockSize=1020), termVectorsFormat=CompressingTermVectorsFormat(compressionMode=FAST_DECOMPRESSION, chunkSize=8, blockSize=1020)), sim=Asserting(org.apache.lucene.search.similarities.AssertingSimilarity@48385094), locale=et-EE, timezone=Pacific/Easter
   [junit4]   2> NOTE: Linux 4.18.0-24-generic amd64/Oracle Corporation 1.8.0_201 (64-bit)/cpus=8,threads=1,free=232799112,total=518979584
   [junit4]   2> NOTE: All tests run in this JVM: [BasicAuthIntegrationTest, BasicAuthIntegrationTest, BasicAuthIntegrationTest, TestCloudJSONFacetJoinDomain, BasicAuthIntegrationTest]
   [junit4] Completed [8/10 (5!)] on J2 in 6.51s, 1 test, 1 failure <<< FAILURES!
   [junit4] 
   [junit4] Suite: org.apache.solr.search.facet.TestCloudJSONFacetJoinDomain
   [junit4] OK      0.05s J1 | TestCloudJSONFacetJoinDomain.testTheTestRandomRefineParam
   [junit4] OK      20.4s J1 | TestCloudJSONFacetJoinDomain.testRandom
   [junit4] OK      0.09s J1 | TestCloudJSONFacetJoinDomain.testMalformedGivesError
   [junit4] OK      1.35s J1 | TestCloudJSONFacetJoinDomain.testBespoke
   [junit4] OK      0.05s J1 | TestCloudJSONFacetJoinDomain.testTheTestTermFacetShouldFreakOutOnBadRefineOptions
   [junit4] OK      0.05s J1 | TestCloudJSONFacetJoinDomain.testSanityCheckDomainMethods
   [junit4] Completed [9/10 (5!)] on J1 in 28.28s, 6 tests
   [junit4] 
   [junit4] Suite: org.apache.solr.search.facet.TestCloudJSONFacetJoinDomain
   [junit4] OK      0.07s J0 | TestCloudJSONFacetJoinDomain.testTheTestRandomRefineParam
   [junit4] OK      17.6s J0 | TestCloudJSONFacetJoinDomain.testRandom
   [junit4] OK      0.04s J0 | TestCloudJSONFacetJoinDomain.testMalformedGivesError
   [junit4] OK      0.96s J0 | TestCloudJSONFacetJoinDomain.testBespoke
   [junit4] OK      0.03s J0 | TestCloudJSONFacetJoinDomain.testTheTestTermFacetShouldFreakOutOnBadRefineOptions
   [junit4] OK      0.03s J0 | TestCloudJSONFacetJoinDomain.testSanityCheckDomainMethods
   [junit4] Completed [10/10 (5!)] on J0 in 24.53s, 6 tests
   [junit4] 
   [junit4] 
   [junit4] Tests with failures [seed: B292FDDCA6F4D6F2]:
   [junit4]   - org.apache.solr.security.BasicAuthIntegrationTest.testBasicAuth
   [junit4]   - org.apache.solr.security.BasicAuthIntegrationTest.testBasicAuth
   [junit4]   - org.apache.solr.security.BasicAuthIntegrationTest.testBasicAuth
   [junit4]   - org.apache.solr.security.BasicAuthIntegrationTest.testBasicAuth
   [junit4]   - org.apache.solr.security.BasicAuthIntegrationTest.testBasicAuth
   [junit4] 
   [junit4] 
   [junit4] JVM J0:     0.40 ..    84.38 =    83.98s
   [junit4] JVM J1:     0.40 ..    81.46 =    81.07s
   [junit4] JVM J2:     0.42 ..    79.85 =    79.44s
   [junit4] Execution time total: 1 minute 24 seconds
   [junit4] Tests summary: 10 suites, 35 tests, 5 failures

BUILD FAILED
/home/jenkins/workspace/Lucene-Solr-8.x-Linux/lucene/common-build.xml:1572: The following error occurred while executing this line:
/home/jenkins/workspace/Lucene-Solr-8.x-Linux/lucene/common-build.xml:1099: There were test failures: 10 suites, 35 tests, 5 failures [seed: B292FDDCA6F4D6F2]

Total time: 1 minute 25 seconds

[repro] Setting last failure code to 256

[repro] Failures:
[repro]   0/5 failed: org.apache.solr.search.facet.TestCloudJSONFacetJoinDomain
[repro]   5/5 failed: org.apache.solr.security.BasicAuthIntegrationTest
[repro] Exiting with code 256
+ mv lucene/build lucene/build.repro
+ mv solr/build solr/build.repro
+ mv lucene/build.orig lucene/build
+ mv solr/build.orig solr/build
Archiving artifacts
Setting ANT_1_8_2_HOME=/home/jenkins/tools/hudson.tasks.Ant_AntInstallation/ANT_1.8.2
[WARNINGS] Parsing warnings in console log with parser Java Compiler (javac)
Setting ANT_1_8_2_HOME=/home/jenkins/tools/hudson.tasks.Ant_AntInstallation/ANT_1.8.2
No credentials specified
Setting ANT_1_8_2_HOME=/home/jenkins/tools/hudson.tasks.Ant_AntInstallation/ANT_1.8.2
<Git Blamer> Using GitBlamer to create author and commit information for all warnings.
<Git Blamer> GIT_COMMIT=7664c6c1f7d35bb98920a592831bbc6f11a8cfe0, workspace=/home/jenkins/workspace/Lucene-Solr-8.x-Linux
[WARNINGS] Computing warning deltas based on reference build #910
Recording test results
Setting ANT_1_8_2_HOME=/home/jenkins/tools/hudson.tasks.Ant_AntInstallation/ANT_1.8.2
Build step 'Publish JUnit test result report' changed build result to UNSTABLE
Email was triggered for: Unstable (Test Failures)
Sending email for trigger: Unstable (Test Failures)
Setting ANT_1_8_2_HOME=/home/jenkins/tools/hudson.tasks.Ant_AntInstallation/ANT_1.8.2
Setting ANT_1_8_2_HOME=/home/jenkins/tools/hudson.tasks.Ant_AntInstallation/ANT_1.8.2
Setting ANT_1_8_2_HOME=/home/jenkins/tools/hudson.tasks.Ant_AntInstallation/ANT_1.8.2
Setting ANT_1_8_2_HOME=/home/jenkins/tools/hudson.tasks.Ant_AntInstallation/ANT_1.8.2
Setting ANT_1_8_2_HOME=/home/jenkins/tools/hudson.tasks.Ant_AntInstallation/ANT_1.8.2
Setting ANT_1_8_2_HOME=/home/jenkins/tools/hudson.tasks.Ant_AntInstallation/ANT_1.8.2

Mime
View raw message