lucene-dev mailing list archives

Site index · List index
Message view « Date » · « Thread »
Top « Date » · « Thread »
From Policeman Jenkins Server <jenk...@thetaphi.de>
Subject [JENKINS] Lucene-Solr-8.x-Windows (64bit/jdk1.8.0_201) - Build # 380 - Still Unstable!
Date Thu, 25 Jul 2019 08:08:25 GMT
Build: https://jenkins.thetaphi.de/job/Lucene-Solr-8.x-Windows/380/
Java: 64bit/jdk1.8.0_201 -XX:-UseCompressedOops -XX:+UseSerialGC

7 tests failed.
FAILED:  org.apache.solr.security.BasicAuthIntegrationTest.testBasicAuth

Error Message:
expected:<401> but was:<400>

Stack Trace:
java.lang.AssertionError: expected:<401> but was:<400>
	at __randomizedtesting.SeedInfo.seed([918E42EC0808B6BE:2DE034FEAC5B35C4]:0)
	at org.junit.Assert.fail(Assert.java:88)
	at org.junit.Assert.failNotEquals(Assert.java:834)
	at org.junit.Assert.assertEquals(Assert.java:645)
	at org.junit.Assert.assertEquals(Assert.java:631)
	at org.apache.solr.security.BasicAuthIntegrationTest.testBasicAuth(BasicAuthIntegrationTest.java:151)
	at sun.reflect.NativeMethodAccessorImpl.invoke0(Native Method)
	at sun.reflect.NativeMethodAccessorImpl.invoke(NativeMethodAccessorImpl.java:62)
	at sun.reflect.DelegatingMethodAccessorImpl.invoke(DelegatingMethodAccessorImpl.java:43)
	at java.lang.reflect.Method.invoke(Method.java:498)
	at com.carrotsearch.randomizedtesting.RandomizedRunner.invoke(RandomizedRunner.java:1750)
	at com.carrotsearch.randomizedtesting.RandomizedRunner$8.evaluate(RandomizedRunner.java:938)
	at com.carrotsearch.randomizedtesting.RandomizedRunner$9.evaluate(RandomizedRunner.java:974)
	at com.carrotsearch.randomizedtesting.RandomizedRunner$10.evaluate(RandomizedRunner.java:988)
	at com.carrotsearch.randomizedtesting.rules.SystemPropertiesRestoreRule$1.evaluate(SystemPropertiesRestoreRule.java:57)
	at org.apache.lucene.util.TestRuleSetupTeardownChained$1.evaluate(TestRuleSetupTeardownChained.java:49)
	at org.apache.lucene.util.AbstractBeforeAfterRule$1.evaluate(AbstractBeforeAfterRule.java:45)
	at org.apache.lucene.util.TestRuleThreadAndTestName$1.evaluate(TestRuleThreadAndTestName.java:48)
	at org.apache.lucene.util.TestRuleIgnoreAfterMaxFailures$1.evaluate(TestRuleIgnoreAfterMaxFailures.java:64)
	at org.apache.lucene.util.TestRuleMarkFailure$1.evaluate(TestRuleMarkFailure.java:47)
	at com.carrotsearch.randomizedtesting.rules.StatementAdapter.evaluate(StatementAdapter.java:36)
	at com.carrotsearch.randomizedtesting.ThreadLeakControl$StatementRunner.run(ThreadLeakControl.java:368)
	at com.carrotsearch.randomizedtesting.ThreadLeakControl.forkTimeoutingTask(ThreadLeakControl.java:817)
	at com.carrotsearch.randomizedtesting.ThreadLeakControl$3.evaluate(ThreadLeakControl.java:468)
	at com.carrotsearch.randomizedtesting.RandomizedRunner.runSingleTest(RandomizedRunner.java:947)
	at com.carrotsearch.randomizedtesting.RandomizedRunner$5.evaluate(RandomizedRunner.java:832)
	at com.carrotsearch.randomizedtesting.RandomizedRunner$6.evaluate(RandomizedRunner.java:883)
	at com.carrotsearch.randomizedtesting.RandomizedRunner$7.evaluate(RandomizedRunner.java:894)
	at com.carrotsearch.randomizedtesting.rules.StatementAdapter.evaluate(StatementAdapter.java:36)
	at com.carrotsearch.randomizedtesting.rules.SystemPropertiesRestoreRule$1.evaluate(SystemPropertiesRestoreRule.java:57)
	at org.apache.lucene.util.AbstractBeforeAfterRule$1.evaluate(AbstractBeforeAfterRule.java:45)
	at com.carrotsearch.randomizedtesting.rules.StatementAdapter.evaluate(StatementAdapter.java:36)
	at org.apache.lucene.util.TestRuleStoreClassName$1.evaluate(TestRuleStoreClassName.java:41)
	at com.carrotsearch.randomizedtesting.rules.NoShadowingOrOverridesOnMethodsRule$1.evaluate(NoShadowingOrOverridesOnMethodsRule.java:40)
	at com.carrotsearch.randomizedtesting.rules.NoShadowingOrOverridesOnMethodsRule$1.evaluate(NoShadowingOrOverridesOnMethodsRule.java:40)
	at com.carrotsearch.randomizedtesting.rules.StatementAdapter.evaluate(StatementAdapter.java:36)
	at com.carrotsearch.randomizedtesting.rules.StatementAdapter.evaluate(StatementAdapter.java:36)
	at com.carrotsearch.randomizedtesting.rules.StatementAdapter.evaluate(StatementAdapter.java:36)
	at org.apache.lucene.util.TestRuleAssertionsRequired$1.evaluate(TestRuleAssertionsRequired.java:53)
	at org.apache.lucene.util.TestRuleMarkFailure$1.evaluate(TestRuleMarkFailure.java:47)
	at org.apache.lucene.util.TestRuleIgnoreAfterMaxFailures$1.evaluate(TestRuleIgnoreAfterMaxFailures.java:64)
	at org.apache.lucene.util.TestRuleIgnoreTestSuites$1.evaluate(TestRuleIgnoreTestSuites.java:54)
	at com.carrotsearch.randomizedtesting.rules.StatementAdapter.evaluate(StatementAdapter.java:36)
	at com.carrotsearch.randomizedtesting.ThreadLeakControl$StatementRunner.run(ThreadLeakControl.java:368)
	at java.lang.Thread.run(Thread.java:748)


FAILED:  org.apache.solr.security.BasicAuthIntegrationTest.testBasicAuth

Error Message:
expected:<401> but was:<400>

Stack Trace:
java.lang.AssertionError: expected:<401> but was:<400>
	at __randomizedtesting.SeedInfo.seed([918E42EC0808B6BE:2DE034FEAC5B35C4]:0)
	at org.junit.Assert.fail(Assert.java:88)
	at org.junit.Assert.failNotEquals(Assert.java:834)
	at org.junit.Assert.assertEquals(Assert.java:645)
	at org.junit.Assert.assertEquals(Assert.java:631)
	at org.apache.solr.security.BasicAuthIntegrationTest.testBasicAuth(BasicAuthIntegrationTest.java:151)
	at sun.reflect.NativeMethodAccessorImpl.invoke0(Native Method)
	at sun.reflect.NativeMethodAccessorImpl.invoke(NativeMethodAccessorImpl.java:62)
	at sun.reflect.DelegatingMethodAccessorImpl.invoke(DelegatingMethodAccessorImpl.java:43)
	at java.lang.reflect.Method.invoke(Method.java:498)
	at com.carrotsearch.randomizedtesting.RandomizedRunner.invoke(RandomizedRunner.java:1750)
	at com.carrotsearch.randomizedtesting.RandomizedRunner$8.evaluate(RandomizedRunner.java:938)
	at com.carrotsearch.randomizedtesting.RandomizedRunner$9.evaluate(RandomizedRunner.java:974)
	at com.carrotsearch.randomizedtesting.RandomizedRunner$10.evaluate(RandomizedRunner.java:988)
	at com.carrotsearch.randomizedtesting.rules.SystemPropertiesRestoreRule$1.evaluate(SystemPropertiesRestoreRule.java:57)
	at org.apache.lucene.util.TestRuleSetupTeardownChained$1.evaluate(TestRuleSetupTeardownChained.java:49)
	at org.apache.lucene.util.AbstractBeforeAfterRule$1.evaluate(AbstractBeforeAfterRule.java:45)
	at org.apache.lucene.util.TestRuleThreadAndTestName$1.evaluate(TestRuleThreadAndTestName.java:48)
	at org.apache.lucene.util.TestRuleIgnoreAfterMaxFailures$1.evaluate(TestRuleIgnoreAfterMaxFailures.java:64)
	at org.apache.lucene.util.TestRuleMarkFailure$1.evaluate(TestRuleMarkFailure.java:47)
	at com.carrotsearch.randomizedtesting.rules.StatementAdapter.evaluate(StatementAdapter.java:36)
	at com.carrotsearch.randomizedtesting.ThreadLeakControl$StatementRunner.run(ThreadLeakControl.java:368)
	at com.carrotsearch.randomizedtesting.ThreadLeakControl.forkTimeoutingTask(ThreadLeakControl.java:817)
	at com.carrotsearch.randomizedtesting.ThreadLeakControl$3.evaluate(ThreadLeakControl.java:468)
	at com.carrotsearch.randomizedtesting.RandomizedRunner.runSingleTest(RandomizedRunner.java:947)
	at com.carrotsearch.randomizedtesting.RandomizedRunner$5.evaluate(RandomizedRunner.java:832)
	at com.carrotsearch.randomizedtesting.RandomizedRunner$6.evaluate(RandomizedRunner.java:883)
	at com.carrotsearch.randomizedtesting.RandomizedRunner$7.evaluate(RandomizedRunner.java:894)
	at com.carrotsearch.randomizedtesting.rules.StatementAdapter.evaluate(StatementAdapter.java:36)
	at com.carrotsearch.randomizedtesting.rules.SystemPropertiesRestoreRule$1.evaluate(SystemPropertiesRestoreRule.java:57)
	at org.apache.lucene.util.AbstractBeforeAfterRule$1.evaluate(AbstractBeforeAfterRule.java:45)
	at com.carrotsearch.randomizedtesting.rules.StatementAdapter.evaluate(StatementAdapter.java:36)
	at org.apache.lucene.util.TestRuleStoreClassName$1.evaluate(TestRuleStoreClassName.java:41)
	at com.carrotsearch.randomizedtesting.rules.NoShadowingOrOverridesOnMethodsRule$1.evaluate(NoShadowingOrOverridesOnMethodsRule.java:40)
	at com.carrotsearch.randomizedtesting.rules.NoShadowingOrOverridesOnMethodsRule$1.evaluate(NoShadowingOrOverridesOnMethodsRule.java:40)
	at com.carrotsearch.randomizedtesting.rules.StatementAdapter.evaluate(StatementAdapter.java:36)
	at com.carrotsearch.randomizedtesting.rules.StatementAdapter.evaluate(StatementAdapter.java:36)
	at com.carrotsearch.randomizedtesting.rules.StatementAdapter.evaluate(StatementAdapter.java:36)
	at org.apache.lucene.util.TestRuleAssertionsRequired$1.evaluate(TestRuleAssertionsRequired.java:53)
	at org.apache.lucene.util.TestRuleMarkFailure$1.evaluate(TestRuleMarkFailure.java:47)
	at org.apache.lucene.util.TestRuleIgnoreAfterMaxFailures$1.evaluate(TestRuleIgnoreAfterMaxFailures.java:64)
	at org.apache.lucene.util.TestRuleIgnoreTestSuites$1.evaluate(TestRuleIgnoreTestSuites.java:54)
	at com.carrotsearch.randomizedtesting.rules.StatementAdapter.evaluate(StatementAdapter.java:36)
	at com.carrotsearch.randomizedtesting.ThreadLeakControl$StatementRunner.run(ThreadLeakControl.java:368)
	at java.lang.Thread.run(Thread.java:748)


FAILED:  org.apache.solr.security.BasicAuthIntegrationTest.testBasicAuth

Error Message:
expected:<401> but was:<400>

Stack Trace:
java.lang.AssertionError: expected:<401> but was:<400>
	at __randomizedtesting.SeedInfo.seed([918E42EC0808B6BE:2DE034FEAC5B35C4]:0)
	at org.junit.Assert.fail(Assert.java:88)
	at org.junit.Assert.failNotEquals(Assert.java:834)
	at org.junit.Assert.assertEquals(Assert.java:645)
	at org.junit.Assert.assertEquals(Assert.java:631)
	at org.apache.solr.security.BasicAuthIntegrationTest.testBasicAuth(BasicAuthIntegrationTest.java:151)
	at sun.reflect.NativeMethodAccessorImpl.invoke0(Native Method)
	at sun.reflect.NativeMethodAccessorImpl.invoke(NativeMethodAccessorImpl.java:62)
	at sun.reflect.DelegatingMethodAccessorImpl.invoke(DelegatingMethodAccessorImpl.java:43)
	at java.lang.reflect.Method.invoke(Method.java:498)
	at com.carrotsearch.randomizedtesting.RandomizedRunner.invoke(RandomizedRunner.java:1750)
	at com.carrotsearch.randomizedtesting.RandomizedRunner$8.evaluate(RandomizedRunner.java:938)
	at com.carrotsearch.randomizedtesting.RandomizedRunner$9.evaluate(RandomizedRunner.java:974)
	at com.carrotsearch.randomizedtesting.RandomizedRunner$10.evaluate(RandomizedRunner.java:988)
	at com.carrotsearch.randomizedtesting.rules.SystemPropertiesRestoreRule$1.evaluate(SystemPropertiesRestoreRule.java:57)
	at org.apache.lucene.util.TestRuleSetupTeardownChained$1.evaluate(TestRuleSetupTeardownChained.java:49)
	at org.apache.lucene.util.AbstractBeforeAfterRule$1.evaluate(AbstractBeforeAfterRule.java:45)
	at org.apache.lucene.util.TestRuleThreadAndTestName$1.evaluate(TestRuleThreadAndTestName.java:48)
	at org.apache.lucene.util.TestRuleIgnoreAfterMaxFailures$1.evaluate(TestRuleIgnoreAfterMaxFailures.java:64)
	at org.apache.lucene.util.TestRuleMarkFailure$1.evaluate(TestRuleMarkFailure.java:47)
	at com.carrotsearch.randomizedtesting.rules.StatementAdapter.evaluate(StatementAdapter.java:36)
	at com.carrotsearch.randomizedtesting.ThreadLeakControl$StatementRunner.run(ThreadLeakControl.java:368)
	at com.carrotsearch.randomizedtesting.ThreadLeakControl.forkTimeoutingTask(ThreadLeakControl.java:817)
	at com.carrotsearch.randomizedtesting.ThreadLeakControl$3.evaluate(ThreadLeakControl.java:468)
	at com.carrotsearch.randomizedtesting.RandomizedRunner.runSingleTest(RandomizedRunner.java:947)
	at com.carrotsearch.randomizedtesting.RandomizedRunner$5.evaluate(RandomizedRunner.java:832)
	at com.carrotsearch.randomizedtesting.RandomizedRunner$6.evaluate(RandomizedRunner.java:883)
	at com.carrotsearch.randomizedtesting.RandomizedRunner$7.evaluate(RandomizedRunner.java:894)
	at com.carrotsearch.randomizedtesting.rules.StatementAdapter.evaluate(StatementAdapter.java:36)
	at com.carrotsearch.randomizedtesting.rules.SystemPropertiesRestoreRule$1.evaluate(SystemPropertiesRestoreRule.java:57)
	at org.apache.lucene.util.AbstractBeforeAfterRule$1.evaluate(AbstractBeforeAfterRule.java:45)
	at com.carrotsearch.randomizedtesting.rules.StatementAdapter.evaluate(StatementAdapter.java:36)
	at org.apache.lucene.util.TestRuleStoreClassName$1.evaluate(TestRuleStoreClassName.java:41)
	at com.carrotsearch.randomizedtesting.rules.NoShadowingOrOverridesOnMethodsRule$1.evaluate(NoShadowingOrOverridesOnMethodsRule.java:40)
	at com.carrotsearch.randomizedtesting.rules.NoShadowingOrOverridesOnMethodsRule$1.evaluate(NoShadowingOrOverridesOnMethodsRule.java:40)
	at com.carrotsearch.randomizedtesting.rules.StatementAdapter.evaluate(StatementAdapter.java:36)
	at com.carrotsearch.randomizedtesting.rules.StatementAdapter.evaluate(StatementAdapter.java:36)
	at com.carrotsearch.randomizedtesting.rules.StatementAdapter.evaluate(StatementAdapter.java:36)
	at org.apache.lucene.util.TestRuleAssertionsRequired$1.evaluate(TestRuleAssertionsRequired.java:53)
	at org.apache.lucene.util.TestRuleMarkFailure$1.evaluate(TestRuleMarkFailure.java:47)
	at org.apache.lucene.util.TestRuleIgnoreAfterMaxFailures$1.evaluate(TestRuleIgnoreAfterMaxFailures.java:64)
	at org.apache.lucene.util.TestRuleIgnoreTestSuites$1.evaluate(TestRuleIgnoreTestSuites.java:54)
	at com.carrotsearch.randomizedtesting.rules.StatementAdapter.evaluate(StatementAdapter.java:36)
	at com.carrotsearch.randomizedtesting.ThreadLeakControl$StatementRunner.run(ThreadLeakControl.java:368)
	at java.lang.Thread.run(Thread.java:748)


FAILED:  org.apache.solr.security.BasicAuthIntegrationTest.testBasicAuth

Error Message:
expected:<401> but was:<400>

Stack Trace:
java.lang.AssertionError: expected:<401> but was:<400>
	at __randomizedtesting.SeedInfo.seed([918E42EC0808B6BE:2DE034FEAC5B35C4]:0)
	at org.junit.Assert.fail(Assert.java:88)
	at org.junit.Assert.failNotEquals(Assert.java:834)
	at org.junit.Assert.assertEquals(Assert.java:645)
	at org.junit.Assert.assertEquals(Assert.java:631)
	at org.apache.solr.security.BasicAuthIntegrationTest.testBasicAuth(BasicAuthIntegrationTest.java:151)
	at sun.reflect.NativeMethodAccessorImpl.invoke0(Native Method)
	at sun.reflect.NativeMethodAccessorImpl.invoke(NativeMethodAccessorImpl.java:62)
	at sun.reflect.DelegatingMethodAccessorImpl.invoke(DelegatingMethodAccessorImpl.java:43)
	at java.lang.reflect.Method.invoke(Method.java:498)
	at com.carrotsearch.randomizedtesting.RandomizedRunner.invoke(RandomizedRunner.java:1750)
	at com.carrotsearch.randomizedtesting.RandomizedRunner$8.evaluate(RandomizedRunner.java:938)
	at com.carrotsearch.randomizedtesting.RandomizedRunner$9.evaluate(RandomizedRunner.java:974)
	at com.carrotsearch.randomizedtesting.RandomizedRunner$10.evaluate(RandomizedRunner.java:988)
	at com.carrotsearch.randomizedtesting.rules.SystemPropertiesRestoreRule$1.evaluate(SystemPropertiesRestoreRule.java:57)
	at org.apache.lucene.util.TestRuleSetupTeardownChained$1.evaluate(TestRuleSetupTeardownChained.java:49)
	at org.apache.lucene.util.AbstractBeforeAfterRule$1.evaluate(AbstractBeforeAfterRule.java:45)
	at org.apache.lucene.util.TestRuleThreadAndTestName$1.evaluate(TestRuleThreadAndTestName.java:48)
	at org.apache.lucene.util.TestRuleIgnoreAfterMaxFailures$1.evaluate(TestRuleIgnoreAfterMaxFailures.java:64)
	at org.apache.lucene.util.TestRuleMarkFailure$1.evaluate(TestRuleMarkFailure.java:47)
	at com.carrotsearch.randomizedtesting.rules.StatementAdapter.evaluate(StatementAdapter.java:36)
	at com.carrotsearch.randomizedtesting.ThreadLeakControl$StatementRunner.run(ThreadLeakControl.java:368)
	at com.carrotsearch.randomizedtesting.ThreadLeakControl.forkTimeoutingTask(ThreadLeakControl.java:817)
	at com.carrotsearch.randomizedtesting.ThreadLeakControl$3.evaluate(ThreadLeakControl.java:468)
	at com.carrotsearch.randomizedtesting.RandomizedRunner.runSingleTest(RandomizedRunner.java:947)
	at com.carrotsearch.randomizedtesting.RandomizedRunner$5.evaluate(RandomizedRunner.java:832)
	at com.carrotsearch.randomizedtesting.RandomizedRunner$6.evaluate(RandomizedRunner.java:883)
	at com.carrotsearch.randomizedtesting.RandomizedRunner$7.evaluate(RandomizedRunner.java:894)
	at com.carrotsearch.randomizedtesting.rules.StatementAdapter.evaluate(StatementAdapter.java:36)
	at com.carrotsearch.randomizedtesting.rules.SystemPropertiesRestoreRule$1.evaluate(SystemPropertiesRestoreRule.java:57)
	at org.apache.lucene.util.AbstractBeforeAfterRule$1.evaluate(AbstractBeforeAfterRule.java:45)
	at com.carrotsearch.randomizedtesting.rules.StatementAdapter.evaluate(StatementAdapter.java:36)
	at org.apache.lucene.util.TestRuleStoreClassName$1.evaluate(TestRuleStoreClassName.java:41)
	at com.carrotsearch.randomizedtesting.rules.NoShadowingOrOverridesOnMethodsRule$1.evaluate(NoShadowingOrOverridesOnMethodsRule.java:40)
	at com.carrotsearch.randomizedtesting.rules.NoShadowingOrOverridesOnMethodsRule$1.evaluate(NoShadowingOrOverridesOnMethodsRule.java:40)
	at com.carrotsearch.randomizedtesting.rules.StatementAdapter.evaluate(StatementAdapter.java:36)
	at com.carrotsearch.randomizedtesting.rules.StatementAdapter.evaluate(StatementAdapter.java:36)
	at com.carrotsearch.randomizedtesting.rules.StatementAdapter.evaluate(StatementAdapter.java:36)
	at org.apache.lucene.util.TestRuleAssertionsRequired$1.evaluate(TestRuleAssertionsRequired.java:53)
	at org.apache.lucene.util.TestRuleMarkFailure$1.evaluate(TestRuleMarkFailure.java:47)
	at org.apache.lucene.util.TestRuleIgnoreAfterMaxFailures$1.evaluate(TestRuleIgnoreAfterMaxFailures.java:64)
	at org.apache.lucene.util.TestRuleIgnoreTestSuites$1.evaluate(TestRuleIgnoreTestSuites.java:54)
	at com.carrotsearch.randomizedtesting.rules.StatementAdapter.evaluate(StatementAdapter.java:36)
	at com.carrotsearch.randomizedtesting.ThreadLeakControl$StatementRunner.run(ThreadLeakControl.java:368)
	at java.lang.Thread.run(Thread.java:748)


FAILED:  org.apache.solr.security.BasicAuthIntegrationTest.testBasicAuth

Error Message:
expected:<401> but was:<400>

Stack Trace:
java.lang.AssertionError: expected:<401> but was:<400>
	at __randomizedtesting.SeedInfo.seed([918E42EC0808B6BE:2DE034FEAC5B35C4]:0)
	at org.junit.Assert.fail(Assert.java:88)
	at org.junit.Assert.failNotEquals(Assert.java:834)
	at org.junit.Assert.assertEquals(Assert.java:645)
	at org.junit.Assert.assertEquals(Assert.java:631)
	at org.apache.solr.security.BasicAuthIntegrationTest.testBasicAuth(BasicAuthIntegrationTest.java:151)
	at sun.reflect.NativeMethodAccessorImpl.invoke0(Native Method)
	at sun.reflect.NativeMethodAccessorImpl.invoke(NativeMethodAccessorImpl.java:62)
	at sun.reflect.DelegatingMethodAccessorImpl.invoke(DelegatingMethodAccessorImpl.java:43)
	at java.lang.reflect.Method.invoke(Method.java:498)
	at com.carrotsearch.randomizedtesting.RandomizedRunner.invoke(RandomizedRunner.java:1750)
	at com.carrotsearch.randomizedtesting.RandomizedRunner$8.evaluate(RandomizedRunner.java:938)
	at com.carrotsearch.randomizedtesting.RandomizedRunner$9.evaluate(RandomizedRunner.java:974)
	at com.carrotsearch.randomizedtesting.RandomizedRunner$10.evaluate(RandomizedRunner.java:988)
	at com.carrotsearch.randomizedtesting.rules.SystemPropertiesRestoreRule$1.evaluate(SystemPropertiesRestoreRule.java:57)
	at org.apache.lucene.util.TestRuleSetupTeardownChained$1.evaluate(TestRuleSetupTeardownChained.java:49)
	at org.apache.lucene.util.AbstractBeforeAfterRule$1.evaluate(AbstractBeforeAfterRule.java:45)
	at org.apache.lucene.util.TestRuleThreadAndTestName$1.evaluate(TestRuleThreadAndTestName.java:48)
	at org.apache.lucene.util.TestRuleIgnoreAfterMaxFailures$1.evaluate(TestRuleIgnoreAfterMaxFailures.java:64)
	at org.apache.lucene.util.TestRuleMarkFailure$1.evaluate(TestRuleMarkFailure.java:47)
	at com.carrotsearch.randomizedtesting.rules.StatementAdapter.evaluate(StatementAdapter.java:36)
	at com.carrotsearch.randomizedtesting.ThreadLeakControl$StatementRunner.run(ThreadLeakControl.java:368)
	at com.carrotsearch.randomizedtesting.ThreadLeakControl.forkTimeoutingTask(ThreadLeakControl.java:817)
	at com.carrotsearch.randomizedtesting.ThreadLeakControl$3.evaluate(ThreadLeakControl.java:468)
	at com.carrotsearch.randomizedtesting.RandomizedRunner.runSingleTest(RandomizedRunner.java:947)
	at com.carrotsearch.randomizedtesting.RandomizedRunner$5.evaluate(RandomizedRunner.java:832)
	at com.carrotsearch.randomizedtesting.RandomizedRunner$6.evaluate(RandomizedRunner.java:883)
	at com.carrotsearch.randomizedtesting.RandomizedRunner$7.evaluate(RandomizedRunner.java:894)
	at com.carrotsearch.randomizedtesting.rules.StatementAdapter.evaluate(StatementAdapter.java:36)
	at com.carrotsearch.randomizedtesting.rules.SystemPropertiesRestoreRule$1.evaluate(SystemPropertiesRestoreRule.java:57)
	at org.apache.lucene.util.AbstractBeforeAfterRule$1.evaluate(AbstractBeforeAfterRule.java:45)
	at com.carrotsearch.randomizedtesting.rules.StatementAdapter.evaluate(StatementAdapter.java:36)
	at org.apache.lucene.util.TestRuleStoreClassName$1.evaluate(TestRuleStoreClassName.java:41)
	at com.carrotsearch.randomizedtesting.rules.NoShadowingOrOverridesOnMethodsRule$1.evaluate(NoShadowingOrOverridesOnMethodsRule.java:40)
	at com.carrotsearch.randomizedtesting.rules.NoShadowingOrOverridesOnMethodsRule$1.evaluate(NoShadowingOrOverridesOnMethodsRule.java:40)
	at com.carrotsearch.randomizedtesting.rules.StatementAdapter.evaluate(StatementAdapter.java:36)
	at com.carrotsearch.randomizedtesting.rules.StatementAdapter.evaluate(StatementAdapter.java:36)
	at com.carrotsearch.randomizedtesting.rules.StatementAdapter.evaluate(StatementAdapter.java:36)
	at org.apache.lucene.util.TestRuleAssertionsRequired$1.evaluate(TestRuleAssertionsRequired.java:53)
	at org.apache.lucene.util.TestRuleMarkFailure$1.evaluate(TestRuleMarkFailure.java:47)
	at org.apache.lucene.util.TestRuleIgnoreAfterMaxFailures$1.evaluate(TestRuleIgnoreAfterMaxFailures.java:64)
	at org.apache.lucene.util.TestRuleIgnoreTestSuites$1.evaluate(TestRuleIgnoreTestSuites.java:54)
	at com.carrotsearch.randomizedtesting.rules.StatementAdapter.evaluate(StatementAdapter.java:36)
	at com.carrotsearch.randomizedtesting.ThreadLeakControl$StatementRunner.run(ThreadLeakControl.java:368)
	at java.lang.Thread.run(Thread.java:748)


FAILED:  org.apache.solr.security.BasicAuthIntegrationTest.testBasicAuth

Error Message:
expected:<401> but was:<400>

Stack Trace:
java.lang.AssertionError: expected:<401> but was:<400>
	at __randomizedtesting.SeedInfo.seed([918E42EC0808B6BE:2DE034FEAC5B35C4]:0)
	at org.junit.Assert.fail(Assert.java:88)
	at org.junit.Assert.failNotEquals(Assert.java:834)
	at org.junit.Assert.assertEquals(Assert.java:645)
	at org.junit.Assert.assertEquals(Assert.java:631)
	at org.apache.solr.security.BasicAuthIntegrationTest.testBasicAuth(BasicAuthIntegrationTest.java:151)
	at sun.reflect.NativeMethodAccessorImpl.invoke0(Native Method)
	at sun.reflect.NativeMethodAccessorImpl.invoke(NativeMethodAccessorImpl.java:62)
	at sun.reflect.DelegatingMethodAccessorImpl.invoke(DelegatingMethodAccessorImpl.java:43)
	at java.lang.reflect.Method.invoke(Method.java:498)
	at com.carrotsearch.randomizedtesting.RandomizedRunner.invoke(RandomizedRunner.java:1750)
	at com.carrotsearch.randomizedtesting.RandomizedRunner$8.evaluate(RandomizedRunner.java:938)
	at com.carrotsearch.randomizedtesting.RandomizedRunner$9.evaluate(RandomizedRunner.java:974)
	at com.carrotsearch.randomizedtesting.RandomizedRunner$10.evaluate(RandomizedRunner.java:988)
	at com.carrotsearch.randomizedtesting.rules.SystemPropertiesRestoreRule$1.evaluate(SystemPropertiesRestoreRule.java:57)
	at org.apache.lucene.util.TestRuleSetupTeardownChained$1.evaluate(TestRuleSetupTeardownChained.java:49)
	at org.apache.lucene.util.AbstractBeforeAfterRule$1.evaluate(AbstractBeforeAfterRule.java:45)
	at org.apache.lucene.util.TestRuleThreadAndTestName$1.evaluate(TestRuleThreadAndTestName.java:48)
	at org.apache.lucene.util.TestRuleIgnoreAfterMaxFailures$1.evaluate(TestRuleIgnoreAfterMaxFailures.java:64)
	at org.apache.lucene.util.TestRuleMarkFailure$1.evaluate(TestRuleMarkFailure.java:47)
	at com.carrotsearch.randomizedtesting.rules.StatementAdapter.evaluate(StatementAdapter.java:36)
	at com.carrotsearch.randomizedtesting.ThreadLeakControl$StatementRunner.run(ThreadLeakControl.java:368)
	at com.carrotsearch.randomizedtesting.ThreadLeakControl.forkTimeoutingTask(ThreadLeakControl.java:817)
	at com.carrotsearch.randomizedtesting.ThreadLeakControl$3.evaluate(ThreadLeakControl.java:468)
	at com.carrotsearch.randomizedtesting.RandomizedRunner.runSingleTest(RandomizedRunner.java:947)
	at com.carrotsearch.randomizedtesting.RandomizedRunner$5.evaluate(RandomizedRunner.java:832)
	at com.carrotsearch.randomizedtesting.RandomizedRunner$6.evaluate(RandomizedRunner.java:883)
	at com.carrotsearch.randomizedtesting.RandomizedRunner$7.evaluate(RandomizedRunner.java:894)
	at com.carrotsearch.randomizedtesting.rules.StatementAdapter.evaluate(StatementAdapter.java:36)
	at com.carrotsearch.randomizedtesting.rules.SystemPropertiesRestoreRule$1.evaluate(SystemPropertiesRestoreRule.java:57)
	at org.apache.lucene.util.AbstractBeforeAfterRule$1.evaluate(AbstractBeforeAfterRule.java:45)
	at com.carrotsearch.randomizedtesting.rules.StatementAdapter.evaluate(StatementAdapter.java:36)
	at org.apache.lucene.util.TestRuleStoreClassName$1.evaluate(TestRuleStoreClassName.java:41)
	at com.carrotsearch.randomizedtesting.rules.NoShadowingOrOverridesOnMethodsRule$1.evaluate(NoShadowingOrOverridesOnMethodsRule.java:40)
	at com.carrotsearch.randomizedtesting.rules.NoShadowingOrOverridesOnMethodsRule$1.evaluate(NoShadowingOrOverridesOnMethodsRule.java:40)
	at com.carrotsearch.randomizedtesting.rules.StatementAdapter.evaluate(StatementAdapter.java:36)
	at com.carrotsearch.randomizedtesting.rules.StatementAdapter.evaluate(StatementAdapter.java:36)
	at com.carrotsearch.randomizedtesting.rules.StatementAdapter.evaluate(StatementAdapter.java:36)
	at org.apache.lucene.util.TestRuleAssertionsRequired$1.evaluate(TestRuleAssertionsRequired.java:53)
	at org.apache.lucene.util.TestRuleMarkFailure$1.evaluate(TestRuleMarkFailure.java:47)
	at org.apache.lucene.util.TestRuleIgnoreAfterMaxFailures$1.evaluate(TestRuleIgnoreAfterMaxFailures.java:64)
	at org.apache.lucene.util.TestRuleIgnoreTestSuites$1.evaluate(TestRuleIgnoreTestSuites.java:54)
	at com.carrotsearch.randomizedtesting.rules.StatementAdapter.evaluate(StatementAdapter.java:36)
	at com.carrotsearch.randomizedtesting.ThreadLeakControl$StatementRunner.run(ThreadLeakControl.java:368)
	at java.lang.Thread.run(Thread.java:748)


FAILED:  org.apache.solr.update.processor.DimensionalRoutedAliasUpdateProcessorTest.testCatTime

Error Message:
took over 10 seconds after collection creation to update aliases

Stack Trace:
java.lang.AssertionError: took over 10 seconds after collection creation to update aliases
	at __randomizedtesting.SeedInfo.seed([918E42EC0808B6BE:96850DEF37FBE756]:0)
	at org.junit.Assert.fail(Assert.java:88)
	at org.apache.solr.update.processor.RoutedAliasUpdateProcessorTest.waitColAndAlias(RoutedAliasUpdateProcessorTest.java:77)
	at org.apache.solr.update.processor.DimensionalRoutedAliasUpdateProcessorTest.testCatTime(DimensionalRoutedAliasUpdateProcessorTest.java:480)
	at sun.reflect.NativeMethodAccessorImpl.invoke0(Native Method)
	at sun.reflect.NativeMethodAccessorImpl.invoke(NativeMethodAccessorImpl.java:62)
	at sun.reflect.DelegatingMethodAccessorImpl.invoke(DelegatingMethodAccessorImpl.java:43)
	at java.lang.reflect.Method.invoke(Method.java:498)
	at com.carrotsearch.randomizedtesting.RandomizedRunner.invoke(RandomizedRunner.java:1750)
	at com.carrotsearch.randomizedtesting.RandomizedRunner$8.evaluate(RandomizedRunner.java:938)
	at com.carrotsearch.randomizedtesting.RandomizedRunner$9.evaluate(RandomizedRunner.java:974)
	at com.carrotsearch.randomizedtesting.RandomizedRunner$10.evaluate(RandomizedRunner.java:988)
	at com.carrotsearch.randomizedtesting.rules.SystemPropertiesRestoreRule$1.evaluate(SystemPropertiesRestoreRule.java:57)
	at org.apache.lucene.util.TestRuleSetupTeardownChained$1.evaluate(TestRuleSetupTeardownChained.java:49)
	at org.apache.lucene.util.AbstractBeforeAfterRule$1.evaluate(AbstractBeforeAfterRule.java:45)
	at org.apache.lucene.util.TestRuleThreadAndTestName$1.evaluate(TestRuleThreadAndTestName.java:48)
	at org.apache.lucene.util.TestRuleIgnoreAfterMaxFailures$1.evaluate(TestRuleIgnoreAfterMaxFailures.java:64)
	at org.apache.lucene.util.TestRuleMarkFailure$1.evaluate(TestRuleMarkFailure.java:47)
	at com.carrotsearch.randomizedtesting.rules.StatementAdapter.evaluate(StatementAdapter.java:36)
	at com.carrotsearch.randomizedtesting.ThreadLeakControl$StatementRunner.run(ThreadLeakControl.java:368)
	at com.carrotsearch.randomizedtesting.ThreadLeakControl.forkTimeoutingTask(ThreadLeakControl.java:817)
	at com.carrotsearch.randomizedtesting.ThreadLeakControl$3.evaluate(ThreadLeakControl.java:468)
	at com.carrotsearch.randomizedtesting.RandomizedRunner.runSingleTest(RandomizedRunner.java:947)
	at com.carrotsearch.randomizedtesting.RandomizedRunner$5.evaluate(RandomizedRunner.java:832)
	at com.carrotsearch.randomizedtesting.RandomizedRunner$6.evaluate(RandomizedRunner.java:883)
	at com.carrotsearch.randomizedtesting.RandomizedRunner$7.evaluate(RandomizedRunner.java:894)
	at com.carrotsearch.randomizedtesting.rules.StatementAdapter.evaluate(StatementAdapter.java:36)
	at com.carrotsearch.randomizedtesting.rules.SystemPropertiesRestoreRule$1.evaluate(SystemPropertiesRestoreRule.java:57)
	at org.apache.lucene.util.AbstractBeforeAfterRule$1.evaluate(AbstractBeforeAfterRule.java:45)
	at com.carrotsearch.randomizedtesting.rules.StatementAdapter.evaluate(StatementAdapter.java:36)
	at org.apache.lucene.util.TestRuleStoreClassName$1.evaluate(TestRuleStoreClassName.java:41)
	at com.carrotsearch.randomizedtesting.rules.NoShadowingOrOverridesOnMethodsRule$1.evaluate(NoShadowingOrOverridesOnMethodsRule.java:40)
	at com.carrotsearch.randomizedtesting.rules.NoShadowingOrOverridesOnMethodsRule$1.evaluate(NoShadowingOrOverridesOnMethodsRule.java:40)
	at com.carrotsearch.randomizedtesting.rules.StatementAdapter.evaluate(StatementAdapter.java:36)
	at com.carrotsearch.randomizedtesting.rules.StatementAdapter.evaluate(StatementAdapter.java:36)
	at com.carrotsearch.randomizedtesting.rules.StatementAdapter.evaluate(StatementAdapter.java:36)
	at org.apache.lucene.util.TestRuleAssertionsRequired$1.evaluate(TestRuleAssertionsRequired.java:53)
	at org.apache.lucene.util.TestRuleMarkFailure$1.evaluate(TestRuleMarkFailure.java:47)
	at org.apache.lucene.util.TestRuleIgnoreAfterMaxFailures$1.evaluate(TestRuleIgnoreAfterMaxFailures.java:64)
	at org.apache.lucene.util.TestRuleIgnoreTestSuites$1.evaluate(TestRuleIgnoreTestSuites.java:54)
	at com.carrotsearch.randomizedtesting.rules.StatementAdapter.evaluate(StatementAdapter.java:36)
	at com.carrotsearch.randomizedtesting.ThreadLeakControl$StatementRunner.run(ThreadLeakControl.java:368)
	at java.lang.Thread.run(Thread.java:748)




Build Log:
[...truncated 13548 lines...]
   [junit4] Suite: org.apache.solr.security.BasicAuthIntegrationTest
   [junit4]   2> 460513 INFO  (SUITE-BasicAuthIntegrationTest-seed#[918E42EC0808B6BE]-worker) [     ] o.a.s.SolrTestCaseJ4 SecureRandom sanity checks: test.solr.allowed.securerandom=null & java.security.egd=file:/dev/./urandom
   [junit4]   2> Creating dataDir: C:\Users\jenkins\workspace\Lucene-Solr-8.x-Windows\solr\build\solr-core\test\J0\temp\solr.security.BasicAuthIntegrationTest_918E42EC0808B6BE-001\init-core-data-001
   [junit4]   2> 460517 WARN  (SUITE-BasicAuthIntegrationTest-seed#[918E42EC0808B6BE]-worker) [     ] o.a.s.SolrTestCaseJ4 startTrackingSearchers: numOpens=5 numCloses=5
   [junit4]   2> 460517 INFO  (SUITE-BasicAuthIntegrationTest-seed#[918E42EC0808B6BE]-worker) [     ] o.a.s.SolrTestCaseJ4 Using PointFields (NUMERIC_POINTS_SYSPROP=true) w/NUMERIC_DOCVALUES_SYSPROP=false
   [junit4]   2> 460529 INFO  (SUITE-BasicAuthIntegrationTest-seed#[918E42EC0808B6BE]-worker) [     ] o.a.s.SolrTestCaseJ4 Randomized ssl (false) and clientAuth (false) via: @org.apache.solr.util.RandomizeSSL(reason=, value=NaN, ssl=NaN, clientAuth=NaN)
   [junit4]   2> 460536 INFO  (TEST-BasicAuthIntegrationTest.testBasicAuth-seed#[918E42EC0808B6BE]) [     ] o.a.s.SolrTestCaseJ4 ###Starting testBasicAuth
   [junit4]   2> 460541 INFO  (TEST-BasicAuthIntegrationTest.testBasicAuth-seed#[918E42EC0808B6BE]) [     ] o.a.s.c.MiniSolrCloudCluster Starting cluster of 3 servers in C:\Users\jenkins\workspace\Lucene-Solr-8.x-Windows\solr\build\solr-core\test\J0\temp\solr.security.BasicAuthIntegrationTest_918E42EC0808B6BE-001\tempDir-001
   [junit4]   2> 460542 INFO  (TEST-BasicAuthIntegrationTest.testBasicAuth-seed#[918E42EC0808B6BE]) [     ] o.a.s.c.ZkTestServer STARTING ZK TEST SERVER
   [junit4]   2> 460542 INFO  (ZkTestServer Run Thread) [     ] o.a.s.c.ZkTestServer client port:0.0.0.0/0.0.0.0:0
   [junit4]   2> 460542 INFO  (ZkTestServer Run Thread) [     ] o.a.s.c.ZkTestServer Starting server
   [junit4]   2> 460660 INFO  (TEST-BasicAuthIntegrationTest.testBasicAuth-seed#[918E42EC0808B6BE]) [     ] o.a.s.c.ZkTestServer start zk server on port:55905
   [junit4]   2> 460660 INFO  (TEST-BasicAuthIntegrationTest.testBasicAuth-seed#[918E42EC0808B6BE]) [     ] o.a.s.c.ZkTestServer parse host and port list: 127.0.0.1:55905
   [junit4]   2> 460660 INFO  (TEST-BasicAuthIntegrationTest.testBasicAuth-seed#[918E42EC0808B6BE]) [     ] o.a.s.c.ZkTestServer connecting to 127.0.0.1 55905
   [junit4]   2> 460662 INFO  (TEST-BasicAuthIntegrationTest.testBasicAuth-seed#[918E42EC0808B6BE]) [     ] o.a.s.c.c.ConnectionManager Waiting for client to connect to ZooKeeper
   [junit4]   2> 460670 INFO  (zkConnectionManagerCallback-4064-thread-1) [     ] o.a.s.c.c.ConnectionManager zkClient has connected
   [junit4]   2> 460670 INFO  (TEST-BasicAuthIntegrationTest.testBasicAuth-seed#[918E42EC0808B6BE]) [     ] o.a.s.c.c.ConnectionManager Client is connected to ZooKeeper
   [junit4]   2> 460680 INFO  (TEST-BasicAuthIntegrationTest.testBasicAuth-seed#[918E42EC0808B6BE]) [     ] o.a.s.c.c.ConnectionManager Waiting for client to connect to ZooKeeper
   [junit4]   2> 460685 INFO  (zkConnectionManagerCallback-4066-thread-1) [     ] o.a.s.c.c.ConnectionManager zkClient has connected
   [junit4]   2> 460685 INFO  (TEST-BasicAuthIntegrationTest.testBasicAuth-seed#[918E42EC0808B6BE]) [     ] o.a.s.c.c.ConnectionManager Client is connected to ZooKeeper
   [junit4]   2> 460686 INFO  (TEST-BasicAuthIntegrationTest.testBasicAuth-seed#[918E42EC0808B6BE]) [     ] o.a.s.c.c.ConnectionManager Waiting for client to connect to ZooKeeper
   [junit4]   2> 460690 INFO  (zkConnectionManagerCallback-4068-thread-1) [     ] o.a.s.c.c.ConnectionManager zkClient has connected
   [junit4]   2> 460691 INFO  (TEST-BasicAuthIntegrationTest.testBasicAuth-seed#[918E42EC0808B6BE]) [     ] o.a.s.c.c.ConnectionManager Client is connected to ZooKeeper
   [junit4]   2> 460820 WARN  (jetty-launcher-4069-thread-2) [     ] o.e.j.s.AbstractConnector Ignoring deprecated socket close linger time
   [junit4]   2> 460820 WARN  (jetty-launcher-4069-thread-1) [     ] o.e.j.s.AbstractConnector Ignoring deprecated socket close linger time
   [junit4]   2> 460821 INFO  (jetty-launcher-4069-thread-1) [     ] o.a.s.c.s.e.JettySolrRunner Start Jetty (original configured port=0)
   [junit4]   2> 460821 INFO  (jetty-launcher-4069-thread-1) [     ] o.a.s.c.s.e.JettySolrRunner Trying to start Jetty on port 0 try number 1 ...
   [junit4]   2> 460821 INFO  (jetty-launcher-4069-thread-1) [     ] o.e.j.s.Server jetty-9.4.19.v20190610; built: 2019-06-10T16:30:51.723Z; git: afcf563148970e98786327af5e07c261fda175d3; jvm 1.8.0_201-b09
   [junit4]   2> 460822 INFO  (jetty-launcher-4069-thread-1) [     ] o.e.j.s.session DefaultSessionIdManager workerName=node0
   [junit4]   2> 460822 INFO  (jetty-launcher-4069-thread-1) [     ] o.e.j.s.session No SessionScavenger set, using defaults
   [junit4]   2> 460822 INFO  (jetty-launcher-4069-thread-1) [     ] o.e.j.s.session node0 Scavenging every 600000ms
   [junit4]   2> 460822 WARN  (jetty-launcher-4069-thread-3) [     ] o.e.j.s.AbstractConnector Ignoring deprecated socket close linger time
   [junit4]   2> 460822 INFO  (jetty-launcher-4069-thread-3) [     ] o.a.s.c.s.e.JettySolrRunner Start Jetty (original configured port=0)
   [junit4]   2> 460822 INFO  (jetty-launcher-4069-thread-3) [     ] o.a.s.c.s.e.JettySolrRunner Trying to start Jetty on port 0 try number 1 ...
   [junit4]   2> 460822 INFO  (jetty-launcher-4069-thread-3) [     ] o.e.j.s.Server jetty-9.4.19.v20190610; built: 2019-06-10T16:30:51.723Z; git: afcf563148970e98786327af5e07c261fda175d3; jvm 1.8.0_201-b09
   [junit4]   2> 460822 INFO  (jetty-launcher-4069-thread-3) [     ] o.e.j.s.session DefaultSessionIdManager workerName=node0
   [junit4]   2> 460822 INFO  (jetty-launcher-4069-thread-3) [     ] o.e.j.s.session No SessionScavenger set, using defaults
   [junit4]   2> 460822 INFO  (jetty-launcher-4069-thread-3) [     ] o.e.j.s.session node0 Scavenging every 600000ms
   [junit4]   2> 460824 INFO  (jetty-launcher-4069-thread-3) [     ] o.e.j.s.h.ContextHandler Started o.e.j.s.ServletContextHandler@1cce2afc{/solr,null,AVAILABLE}
   [junit4]   2> 460825 INFO  (jetty-launcher-4069-thread-1) [     ] o.e.j.s.h.ContextHandler Started o.e.j.s.ServletContextHandler@52cf616a{/solr,null,AVAILABLE}
   [junit4]   2> 460826 INFO  (jetty-launcher-4069-thread-2) [     ] o.a.s.c.s.e.JettySolrRunner Start Jetty (original configured port=0)
   [junit4]   2> 460826 INFO  (jetty-launcher-4069-thread-2) [     ] o.a.s.c.s.e.JettySolrRunner Trying to start Jetty on port 0 try number 1 ...
   [junit4]   2> 460828 INFO  (jetty-launcher-4069-thread-2) [     ] o.e.j.s.Server jetty-9.4.19.v20190610; built: 2019-06-10T16:30:51.723Z; git: afcf563148970e98786327af5e07c261fda175d3; jvm 1.8.0_201-b09
   [junit4]   2> 460828 INFO  (jetty-launcher-4069-thread-2) [     ] o.e.j.s.session DefaultSessionIdManager workerName=node0
   [junit4]   2> 460828 INFO  (jetty-launcher-4069-thread-2) [     ] o.e.j.s.session No SessionScavenger set, using defaults
   [junit4]   2> 460828 INFO  (jetty-launcher-4069-thread-2) [     ] o.e.j.s.session node0 Scavenging every 600000ms
   [junit4]   2> 460828 INFO  (jetty-launcher-4069-thread-2) [     ] o.e.j.s.h.ContextHandler Started o.e.j.s.ServletContextHandler@12fad5af{/solr,null,AVAILABLE}
   [junit4]   2> 460828 INFO  (jetty-launcher-4069-thread-1) [     ] o.e.j.s.AbstractConnector Started ServerConnector@2d437c52{HTTP/1.1,[http/1.1, h2c]}{127.0.0.1:55921}
   [junit4]   2> 460828 INFO  (jetty-launcher-4069-thread-1) [     ] o.e.j.s.Server Started @458959ms
   [junit4]   2> 460828 INFO  (jetty-launcher-4069-thread-1) [     ] o.a.s.c.s.e.JettySolrRunner Jetty properties: {hostContext=/solr, hostPort=55921}
   [junit4]   2> 460828 ERROR (jetty-launcher-4069-thread-1) [     ] o.a.s.u.StartupLoggingUtils Missing Java Option solr.log.dir. Logging may be missing or incomplete.
   [junit4]   2> 460828 INFO  (jetty-launcher-4069-thread-1) [     ] o.a.s.s.SolrDispatchFilter Using logger factory org.apache.logging.slf4j.Log4jLoggerFactory
   [junit4]   2> 460828 INFO  (jetty-launcher-4069-thread-1) [     ] o.a.s.s.SolrDispatchFilter  ___      _       Welcome to Apache Solr? version 8.3.0
   [junit4]   2> 460828 INFO  (jetty-launcher-4069-thread-1) [     ] o.a.s.s.SolrDispatchFilter / __| ___| |_ _   Starting in cloud mode on port null
   [junit4]   2> 460828 INFO  (jetty-launcher-4069-thread-1) [     ] o.a.s.s.SolrDispatchFilter \__ \/ _ \ | '_|  Install dir: null
   [junit4]   2> 460831 INFO  (jetty-launcher-4069-thread-1) [     ] o.a.s.s.SolrDispatchFilter |___/\___/_|_|    Start time: 2019-07-25T05:31:29.883Z
   [junit4]   2> 460834 INFO  (jetty-launcher-4069-thread-1) [     ] o.a.s.c.c.ConnectionManager Waiting for client to connect to ZooKeeper
   [junit4]   2> 460837 INFO  (jetty-launcher-4069-thread-3) [     ] o.e.j.s.AbstractConnector Started ServerConnector@745e129b{HTTP/1.1,[http/1.1, h2c]}{127.0.0.1:55918}
   [junit4]   2> 460837 INFO  (jetty-launcher-4069-thread-3) [     ] o.e.j.s.Server Started @458965ms
   [junit4]   2> 460837 INFO  (jetty-launcher-4069-thread-3) [     ] o.a.s.c.s.e.JettySolrRunner Jetty properties: {hostContext=/solr, hostPort=55918}
   [junit4]   2> 460837 ERROR (jetty-launcher-4069-thread-3) [     ] o.a.s.u.StartupLoggingUtils Missing Java Option solr.log.dir. Logging may be missing or incomplete.
   [junit4]   2> 460837 INFO  (jetty-launcher-4069-thread-3) [     ] o.a.s.s.SolrDispatchFilter Using logger factory org.apache.logging.slf4j.Log4jLoggerFactory
   [junit4]   2> 460837 INFO  (jetty-launcher-4069-thread-3) [     ] o.a.s.s.SolrDispatchFilter  ___      _       Welcome to Apache Solr? version 8.3.0
   [junit4]   2> 460837 INFO  (jetty-launcher-4069-thread-3) [     ] o.a.s.s.SolrDispatchFilter / __| ___| |_ _   Starting in cloud mode on port null
   [junit4]   2> 460837 INFO  (jetty-launcher-4069-thread-3) [     ] o.a.s.s.SolrDispatchFilter \__ \/ _ \ | '_|  Install dir: null
   [junit4]   2> 460838 INFO  (jetty-launcher-4069-thread-3) [     ] o.a.s.s.SolrDispatchFilter |___/\___/_|_|    Start time: 2019-07-25T05:31:29.893Z
   [junit4]   2> 460841 INFO  (jetty-launcher-4069-thread-3) [     ] o.a.s.c.c.ConnectionManager Waiting for client to connect to ZooKeeper
   [junit4]   2> 460842 INFO  (jetty-launcher-4069-thread-2) [     ] o.e.j.s.AbstractConnector Started ServerConnector@d8c95{HTTP/1.1,[http/1.1, h2c]}{127.0.0.1:55924}
   [junit4]   2> 460842 INFO  (jetty-launcher-4069-thread-2) [     ] o.e.j.s.Server Started @458968ms
   [junit4]   2> 460842 INFO  (jetty-launcher-4069-thread-2) [     ] o.a.s.c.s.e.JettySolrRunner Jetty properties: {hostContext=/solr, hostPort=55924}
   [junit4]   2> 460842 ERROR (jetty-launcher-4069-thread-2) [     ] o.a.s.u.StartupLoggingUtils Missing Java Option solr.log.dir. Logging may be missing or incomplete.
   [junit4]   2> 460842 INFO  (jetty-launcher-4069-thread-2) [     ] o.a.s.s.SolrDispatchFilter Using logger factory org.apache.logging.slf4j.Log4jLoggerFactory
   [junit4]   2> 460842 INFO  (jetty-launcher-4069-thread-2) [     ] o.a.s.s.SolrDispatchFilter  ___      _       Welcome to Apache Solr? version 8.3.0
   [junit4]   2> 460842 INFO  (jetty-launcher-4069-thread-2) [     ] o.a.s.s.SolrDispatchFilter / __| ___| |_ _   Starting in cloud mode on port null
   [junit4]   2> 460842 INFO  (jetty-launcher-4069-thread-2) [     ] o.a.s.s.SolrDispatchFilter \__ \/ _ \ | '_|  Install dir: null
   [junit4]   2> 460842 INFO  (jetty-launcher-4069-thread-2) [     ] o.a.s.s.SolrDispatchFilter |___/\___/_|_|    Start time: 2019-07-25T05:31:29.897Z
   [junit4]   2> 460846 INFO  (jetty-launcher-4069-thread-2) [     ] o.a.s.c.c.ConnectionManager Waiting for client to connect to ZooKeeper
   [junit4]   2> 460846 INFO  (zkConnectionManagerCallback-4071-thread-1) [     ] o.a.s.c.c.ConnectionManager zkClient has connected
   [junit4]   2> 460846 INFO  (jetty-launcher-4069-thread-1) [     ] o.a.s.c.c.ConnectionManager Client is connected to ZooKeeper
   [junit4]   2> 460849 INFO  (jetty-launcher-4069-thread-1) [     ] o.a.s.s.SolrDispatchFilter solr.xml found in ZooKeeper. Loading...
   [junit4]   2> 460856 INFO  (zkConnectionManagerCallback-4073-thread-1) [     ] o.a.s.c.c.ConnectionManager zkClient has connected
   [junit4]   2> 460856 INFO  (jetty-launcher-4069-thread-3) [     ] o.a.s.c.c.ConnectionManager Client is connected to ZooKeeper
   [junit4]   2> 460857 INFO  (jetty-launcher-4069-thread-3) [     ] o.a.s.s.SolrDispatchFilter solr.xml found in ZooKeeper. Loading...
   [junit4]   2> 460860 INFO  (zkConnectionManagerCallback-4075-thread-1) [     ] o.a.s.c.c.ConnectionManager zkClient has connected
   [junit4]   2> 460861 INFO  (jetty-launcher-4069-thread-2) [     ] o.a.s.c.c.ConnectionManager Client is connected to ZooKeeper
   [junit4]   2> 460861 INFO  (jetty-launcher-4069-thread-2) [     ] o.a.s.s.SolrDispatchFilter solr.xml found in ZooKeeper. Loading...
   [junit4]   2> 461165 INFO  (jetty-launcher-4069-thread-2) [     ] o.a.s.h.c.HttpShardHandlerFactory Host whitelist initialized: WhitelistHostChecker [whitelistHosts=null, whitelistHostCheckingEnabled=true]
   [junit4]   2> 461167 WARN  (jetty-launcher-4069-thread-2) [     ] o.e.j.u.s.S.config Trusting all certificates configured for Client@1ba8be73[provider=null,keyStore=null,trustStore=null]
   [junit4]   2> 461167 WARN  (jetty-launcher-4069-thread-2) [     ] o.e.j.u.s.S.config No Client EndPointIdentificationAlgorithm configured for Client@1ba8be73[provider=null,keyStore=null,trustStore=null]
   [junit4]   2> 461177 WARN  (jetty-launcher-4069-thread-2) [     ] o.e.j.u.s.S.config Trusting all certificates configured for Client@6738fe60[provider=null,keyStore=null,trustStore=null]
   [junit4]   2> 461177 WARN  (jetty-launcher-4069-thread-2) [     ] o.e.j.u.s.S.config No Client EndPointIdentificationAlgorithm configured for Client@6738fe60[provider=null,keyStore=null,trustStore=null]
   [junit4]   2> 461178 INFO  (jetty-launcher-4069-thread-2) [     ] o.a.s.c.ZkContainer Zookeeper client=127.0.0.1:55905/solr
   [junit4]   2> 461180 INFO  (jetty-launcher-4069-thread-2) [     ] o.a.s.c.c.ConnectionManager Waiting for client to connect to ZooKeeper
   [junit4]   2> 461184 INFO  (zkConnectionManagerCallback-4084-thread-1) [     ] o.a.s.c.c.ConnectionManager zkClient has connected
   [junit4]   2> 461184 INFO  (jetty-launcher-4069-thread-2) [     ] o.a.s.c.c.ConnectionManager Client is connected to ZooKeeper
   [junit4]   2> 461287 INFO  (jetty-launcher-4069-thread-3) [     ] o.a.s.h.c.HttpShardHandlerFactory Host whitelist initialized: WhitelistHostChecker [whitelistHosts=null, whitelistHostCheckingEnabled=true]
   [junit4]   2> 461289 WARN  (jetty-launcher-4069-thread-3) [     ] o.e.j.u.s.S.config Trusting all certificates configured for Client@94c577e[provider=null,keyStore=null,trustStore=null]
   [junit4]   2> 461289 WARN  (jetty-launcher-4069-thread-3) [     ] o.e.j.u.s.S.config No Client EndPointIdentificationAlgorithm configured for Client@94c577e[provider=null,keyStore=null,trustStore=null]
   [junit4]   2> 461292 WARN  (jetty-launcher-4069-thread-3) [     ] o.e.j.u.s.S.config Trusting all certificates configured for Client@3c92b79a[provider=null,keyStore=null,trustStore=null]
   [junit4]   2> 461292 WARN  (jetty-launcher-4069-thread-3) [     ] o.e.j.u.s.S.config No Client EndPointIdentificationAlgorithm configured for Client@3c92b79a[provider=null,keyStore=null,trustStore=null]
   [junit4]   2> 461302 INFO  (jetty-launcher-4069-thread-3) [     ] o.a.s.c.ZkContainer Zookeeper client=127.0.0.1:55905/solr
   [junit4]   2> 461303 INFO  (jetty-launcher-4069-thread-3) [     ] o.a.s.c.c.ConnectionManager Waiting for client to connect to ZooKeeper
   [junit4]   2> 461303 INFO  (jetty-launcher-4069-thread-2) [n:127.0.0.1:55924_solr     ] o.a.s.c.c.ConnectionManager Waiting for client to connect to ZooKeeper
   [junit4]   2> 461307 INFO  (zkConnectionManagerCallback-4090-thread-1) [     ] o.a.s.c.c.ConnectionManager zkClient has connected
   [junit4]   2> 461307 INFO  (jetty-launcher-4069-thread-3) [     ] o.a.s.c.c.ConnectionManager Client is connected to ZooKeeper
   [junit4]   2> 461307 INFO  (zkConnectionManagerCallback-4092-thread-1) [     ] o.a.s.c.c.ConnectionManager zkClient has connected
   [junit4]   2> 461307 INFO  (jetty-launcher-4069-thread-2) [n:127.0.0.1:55924_solr     ] o.a.s.c.c.ConnectionManager Client is connected to ZooKeeper
   [junit4]   2> 461390 INFO  (jetty-launcher-4069-thread-1) [     ] o.a.s.h.c.HttpShardHandlerFactory Host whitelist initialized: WhitelistHostChecker [whitelistHosts=null, whitelistHostCheckingEnabled=true]
   [junit4]   2> 461401 WARN  (jetty-launcher-4069-thread-1) [     ] o.e.j.u.s.S.config Trusting all certificates configured for Client@48d9374a[provider=null,keyStore=null,trustStore=null]
   [junit4]   2> 461401 WARN  (jetty-launcher-4069-thread-1) [     ] o.e.j.u.s.S.config No Client EndPointIdentificationAlgorithm configured for Client@48d9374a[provider=null,keyStore=null,trustStore=null]
   [junit4]   2> 461407 WARN  (jetty-launcher-4069-thread-1) [     ] o.e.j.u.s.S.config Trusting all certificates configured for Client@1b0436dc[provider=null,keyStore=null,trustStore=null]
   [junit4]   2> 461407 WARN  (jetty-launcher-4069-thread-1) [     ] o.e.j.u.s.S.config No Client EndPointIdentificationAlgorithm configured for Client@1b0436dc[provider=null,keyStore=null,trustStore=null]
   [junit4]   2> 461407 INFO  (jetty-launcher-4069-thread-1) [     ] o.a.s.c.ZkContainer Zookeeper client=127.0.0.1:55905/solr
   [junit4]   2> 461410 INFO  (jetty-launcher-4069-thread-1) [     ] o.a.s.c.c.ConnectionManager Waiting for client to connect to ZooKeeper
   [junit4]   2> 461419 INFO  (zkConnectionManagerCallback-4100-thread-1) [     ] o.a.s.c.c.ConnectionManager zkClient has connected
   [junit4]   2> 461419 INFO  (jetty-launcher-4069-thread-1) [     ] o.a.s.c.c.ConnectionManager Client is connected to ZooKeeper
   [junit4]   2> 461424 INFO  (jetty-launcher-4069-thread-3) [n:127.0.0.1:55918_solr     ] o.a.s.c.c.ConnectionManager Waiting for client to connect to ZooKeeper
   [junit4]   2> 461431 INFO  (zkConnectionManagerCallback-4102-thread-1) [     ] o.a.s.c.c.ConnectionManager zkClient has connected
   [junit4]   2> 461431 INFO  (jetty-launcher-4069-thread-3) [n:127.0.0.1:55918_solr     ] o.a.s.c.c.ConnectionManager Client is connected to ZooKeeper
   [junit4]   2> 461458 INFO  (jetty-launcher-4069-thread-3) [n:127.0.0.1:55918_solr     ] o.a.s.c.OverseerElectionContext I am going to be the leader 127.0.0.1:55918_solr
   [junit4]   2> 461460 INFO  (jetty-launcher-4069-thread-3) [n:127.0.0.1:55918_solr     ] o.a.s.c.Overseer Overseer (id=72140572216066058-127.0.0.1:55918_solr-n_0000000000) starting
   [junit4]   2> 461475 INFO  (jetty-launcher-4069-thread-3) [n:127.0.0.1:55918_solr     ] o.a.s.c.c.ConnectionManager Waiting for client to connect to ZooKeeper
   [junit4]   2> 461478 INFO  (zkConnectionManagerCallback-4109-thread-1) [     ] o.a.s.c.c.ConnectionManager zkClient has connected
   [junit4]   2> 461478 INFO  (jetty-launcher-4069-thread-3) [n:127.0.0.1:55918_solr     ] o.a.s.c.c.ConnectionManager Client is connected to ZooKeeper
   [junit4]   2> 461483 INFO  (jetty-launcher-4069-thread-3) [n:127.0.0.1:55918_solr     ] o.a.s.c.s.i.ZkClientClusterStateProvider Cluster at 127.0.0.1:55905/solr ready
   [junit4]   2> 461485 INFO  (jetty-launcher-4069-thread-3) [n:127.0.0.1:55918_solr     ] o.a.s.c.ZkController Register node as live in ZooKeeper:/live_nodes/127.0.0.1:55918_solr
   [junit4]   2> 461485 INFO  (OverseerStateUpdate-72140572216066058-127.0.0.1:55918_solr-n_0000000000) [n:127.0.0.1:55918_solr     ] o.a.s.c.Overseer Starting to work on the main queue : 127.0.0.1:55918_solr
   [junit4]   2> 461488 INFO  (OverseerStateUpdate-72140572216066058-127.0.0.1:55918_solr-n_0000000000) [n:127.0.0.1:55918_solr     ] o.a.s.c.c.ZkStateReader Updated live nodes from ZooKeeper... (0) -> (1)
   [junit4]   2> 461489 INFO  (jetty-launcher-4069-thread-3) [n:127.0.0.1:55918_solr     ] o.a.s.c.LibListener clusterprops.json changed , version -1
   [junit4]   2> 461494 INFO  (zkCallback-4108-thread-1) [     ] o.a.s.c.c.ZkStateReader Updated live nodes from ZooKeeper... (0) -> (1)
   [junit4]   2> 461546 INFO  (jetty-launcher-4069-thread-1) [n:127.0.0.1:55921_solr     ] o.a.s.c.c.ConnectionManager Waiting for client to connect to ZooKeeper
   [junit4]   2> 461550 INFO  (zkConnectionManagerCallback-4111-thread-1) [     ] o.a.s.c.c.ConnectionManager zkClient has connected
   [junit4]   2> 461552 INFO  (jetty-launcher-4069-thread-1) [n:127.0.0.1:55921_solr     ] o.a.s.c.c.ConnectionManager Client is connected to ZooKeeper
   [junit4]   2> 461563 INFO  (jetty-launcher-4069-thread-1) [n:127.0.0.1:55921_solr     ] o.a.s.c.c.ZkStateReader Updated live nodes from ZooKeeper... (0) -> (1)
   [junit4]   2> 461571 INFO  (jetty-launcher-4069-thread-1) [n:127.0.0.1:55921_solr     ] o.a.s.c.ZkController Publish node=127.0.0.1:55921_solr as DOWN
   [junit4]   2> 461573 INFO  (jetty-launcher-4069-thread-1) [n:127.0.0.1:55921_solr     ] o.a.s.c.TransientSolrCoreCacheDefault Allocating transient cache for 2147483647 transient cores
   [junit4]   2> 461573 INFO  (jetty-launcher-4069-thread-1) [n:127.0.0.1:55921_solr     ] o.a.s.c.ZkController Register node as live in ZooKeeper:/live_nodes/127.0.0.1:55921_solr
   [junit4]   2> 461576 INFO  (zkCallback-4101-thread-1) [     ] o.a.s.c.c.ZkStateReader Updated live nodes from ZooKeeper... (1) -> (2)
   [junit4]   2> 461576 INFO  (zkCallback-4108-thread-1) [     ] o.a.s.c.c.ZkStateReader Updated live nodes from ZooKeeper... (1) -> (2)
   [junit4]   2> 461580 INFO  (jetty-launcher-4069-thread-1) [n:127.0.0.1:55921_solr     ] o.a.s.c.c.ConnectionManager Waiting for client to connect to ZooKeeper
   [junit4]   2> 461580 INFO  (jetty-launcher-4069-thread-2) [n:127.0.0.1:55924_solr     ] o.a.s.c.c.ZkStateReader Updated live nodes from ZooKeeper... (0) -> (2)
   [junit4]   2> 461581 INFO  (zkCallback-4110-thread-1) [     ] o.a.s.c.c.ZkStateReader Updated live nodes from ZooKeeper... (1) -> (2)
   [junit4]   2> 461586 INFO  (zkConnectionManagerCallback-4118-thread-1) [     ] o.a.s.c.c.ConnectionManager zkClient has connected
   [junit4]   2> 461586 INFO  (jetty-launcher-4069-thread-1) [n:127.0.0.1:55921_solr     ] o.a.s.c.c.ConnectionManager Client is connected to ZooKeeper
   [junit4]   2> 461588 INFO  (jetty-launcher-4069-thread-1) [n:127.0.0.1:55921_solr     ] o.a.s.c.c.ZkStateReader Updated live nodes from ZooKeeper... (0) -> (2)
   [junit4]   2> 461588 INFO  (jetty-launcher-4069-thread-2) [n:127.0.0.1:55924_solr     ] o.a.s.c.ZkController Publish node=127.0.0.1:55924_solr as DOWN
   [junit4]   2> 461590 INFO  (jetty-launcher-4069-thread-1) [n:127.0.0.1:55921_solr     ] o.a.s.c.s.i.ZkClientClusterStateProvider Cluster at 127.0.0.1:55905/solr ready
   [junit4]   2> 461590 INFO  (jetty-launcher-4069-thread-2) [n:127.0.0.1:55924_solr     ] o.a.s.c.TransientSolrCoreCacheDefault Allocating transient cache for 2147483647 transient cores
   [junit4]   2> 461590 INFO  (jetty-launcher-4069-thread-2) [n:127.0.0.1:55924_solr     ] o.a.s.c.ZkController Register node as live in ZooKeeper:/live_nodes/127.0.0.1:55924_solr
   [junit4]   2> 461590 INFO  (jetty-launcher-4069-thread-1) [n:127.0.0.1:55921_solr     ] o.a.s.c.LibListener clusterprops.json changed , version -1
   [junit4]   2> 461595 INFO  (zkCallback-4110-thread-1) [     ] o.a.s.c.c.ZkStateReader Updated live nodes from ZooKeeper... (2) -> (3)
   [junit4]   2> 461595 INFO  (zkCallback-4101-thread-1) [     ] o.a.s.c.c.ZkStateReader Updated live nodes from ZooKeeper... (2) -> (3)
   [junit4]   2> 461595 INFO  (zkCallback-4108-thread-1) [     ] o.a.s.c.c.ZkStateReader Updated live nodes from ZooKeeper... (2) -> (3)
   [junit4]   2> 461598 INFO  (jetty-launcher-4069-thread-2) [n:127.0.0.1:55924_solr     ] o.a.s.c.c.ConnectionManager Waiting for client to connect to ZooKeeper
   [junit4]   2> 461599 INFO  (zkCallback-4117-thread-1) [     ] o.a.s.c.c.ZkStateReader Updated live nodes from ZooKeeper... (2) -> (3)
   [junit4]   2> 461599 INFO  (zkCallback-4091-thread-1) [     ] o.a.s.c.c.ZkStateReader Updated live nodes from ZooKeeper... (2) -> (3)
   [junit4]   2> 461603 INFO  (zkConnectionManagerCallback-4123-thread-1) [     ] o.a.s.c.c.ConnectionManager zkClient has connected
   [junit4]   2> 461603 INFO  (jetty-launcher-4069-thread-2) [n:127.0.0.1:55924_solr     ] o.a.s.c.c.ConnectionManager Client is connected to ZooKeeper
   [junit4]   2> 461606 INFO  (jetty-launcher-4069-thread-2) [n:127.0.0.1:55924_solr     ] o.a.s.c.c.ZkStateReader Updated live nodes from ZooKeeper... (0) -> (3)
   [junit4]   2> 461609 INFO  (jetty-launcher-4069-thread-2) [n:127.0.0.1:55924_solr     ] o.a.s.c.s.i.ZkClientClusterStateProvider Cluster at 127.0.0.1:55905/solr ready
   [junit4]   2> 461610 INFO  (jetty-launcher-4069-thread-2) [n:127.0.0.1:55924_solr     ] o.a.s.c.LibListener clusterprops.json changed , version -1
   [junit4]   2> 461636 INFO  (jetty-launcher-4069-thread-1) [n:127.0.0.1:55921_solr     ] o.a.s.h.a.MetricsHistoryHandler No .system collection, keeping metrics history in memory.
   [junit4]   2> 461636 INFO  (jetty-launcher-4069-thread-3) [n:127.0.0.1:55918_solr     ] o.a.s.h.a.MetricsHistoryHandler No .system collection, keeping metrics history in memory.
   [junit4]   2> 461655 INFO  (jetty-launcher-4069-thread-2) [n:127.0.0.1:55924_solr     ] o.a.s.h.a.MetricsHistoryHandler No .system collection, keeping metrics history in memory.
   [junit4]   2> 461775 INFO  (jetty-launcher-4069-thread-1) [n:127.0.0.1:55921_solr     ] o.a.s.m.r.SolrJmxReporter JMX monitoring for 'solr_55921.solr.node' (registry 'solr.node') enabled at server: com.sun.jmx.mbeanserver.JmxMBeanServer@1be9bd0d
   [junit4]   2> 461776 INFO  (jetty-launcher-4069-thread-2) [n:127.0.0.1:55924_solr     ] o.a.s.m.r.SolrJmxReporter JMX monitoring for 'solr_55924.solr.node' (registry 'solr.node') enabled at server: com.sun.jmx.mbeanserver.JmxMBeanServer@1be9bd0d
   [junit4]   2> 461783 INFO  (jetty-launcher-4069-thread-3) [n:127.0.0.1:55918_solr     ] o.a.s.m.r.SolrJmxReporter JMX monitoring for 'solr_55918.solr.node' (registry 'solr.node') enabled at server: com.sun.jmx.mbeanserver.JmxMBeanServer@1be9bd0d
   [junit4]   2> 461786 INFO  (jetty-launcher-4069-thread-1) [n:127.0.0.1:55921_solr     ] o.a.s.m.r.SolrJmxReporter JMX monitoring for 'solr_55921.solr.jvm' (registry 'solr.jvm') enabled at server: com.sun.jmx.mbeanserver.JmxMBeanServer@1be9bd0d
   [junit4]   2> 461786 INFO  (jetty-launcher-4069-thread-1) [n:127.0.0.1:55921_solr     ] o.a.s.m.r.SolrJmxReporter JMX monitoring for 'solr_55921.solr.jetty' (registry 'solr.jetty') enabled at server: com.sun.jmx.mbeanserver.JmxMBeanServer@1be9bd0d
   [junit4]   2> 461789 INFO  (jetty-launcher-4069-thread-2) [n:127.0.0.1:55924_solr     ] o.a.s.m.r.SolrJmxReporter JMX monitoring for 'solr_55924.solr.jvm' (registry 'solr.jvm') enabled at server: com.sun.jmx.mbeanserver.JmxMBeanServer@1be9bd0d
   [junit4]   2> 461789 INFO  (jetty-launcher-4069-thread-2) [n:127.0.0.1:55924_solr     ] o.a.s.m.r.SolrJmxReporter JMX monitoring for 'solr_55924.solr.jetty' (registry 'solr.jetty') enabled at server: com.sun.jmx.mbeanserver.JmxMBeanServer@1be9bd0d
   [junit4]   2> 461789 INFO  (jetty-launcher-4069-thread-1) [n:127.0.0.1:55921_solr     ] o.a.s.c.CorePropertiesLocator Found 0 core definitions underneath C:\Users\jenkins\workspace\Lucene-Solr-8.x-Windows\solr\build\solr-core\test\J0\temp\solr.security.BasicAuthIntegrationTest_918E42EC0808B6BE-001\tempDir-001\node1\.
   [junit4]   2> 461791 INFO  (jetty-launcher-4069-thread-2) [n:127.0.0.1:55924_solr     ] o.a.s.c.CorePropertiesLocator Found 0 core definitions underneath C:\Users\jenkins\workspace\Lucene-Solr-8.x-Windows\solr\build\solr-core\test\J0\temp\solr.security.BasicAuthIntegrationTest_918E42EC0808B6BE-001\tempDir-001\node2\.
   [junit4]   2> 461793 INFO  (jetty-launcher-4069-thread-3) [n:127.0.0.1:55918_solr     ] o.a.s.m.r.SolrJmxReporter JMX monitoring for 'solr_55918.solr.jvm' (registry 'solr.jvm') enabled at server: com.sun.jmx.mbeanserver.JmxMBeanServer@1be9bd0d
   [junit4]   2> 461793 INFO  (jetty-launcher-4069-thread-3) [n:127.0.0.1:55918_solr     ] o.a.s.m.r.SolrJmxReporter JMX monitoring for 'solr_55918.solr.jetty' (registry 'solr.jetty') enabled at server: com.sun.jmx.mbeanserver.JmxMBeanServer@1be9bd0d
   [junit4]   2> 461796 INFO  (jetty-launcher-4069-thread-3) [n:127.0.0.1:55918_solr     ] o.a.s.c.CorePropertiesLocator Found 0 core definitions underneath C:\Users\jenkins\workspace\Lucene-Solr-8.x-Windows\solr\build\solr-core\test\J0\temp\solr.security.BasicAuthIntegrationTest_918E42EC0808B6BE-001\tempDir-001\node3\.
   [junit4]   2> 461929 INFO  (TEST-BasicAuthIntegrationTest.testBasicAuth-seed#[918E42EC0808B6BE]) [     ] o.a.s.c.c.ConnectionManager Waiting for client to connect to ZooKeeper
   [junit4]   2> 461933 INFO  (zkConnectionManagerCallback-4131-thread-1) [     ] o.a.s.c.c.ConnectionManager zkClient has connected
   [junit4]   2> 461933 INFO  (TEST-BasicAuthIntegrationTest.testBasicAuth-seed#[918E42EC0808B6BE]) [     ] o.a.s.c.c.ConnectionManager Client is connected to ZooKeeper
   [junit4]   2> 461935 INFO  (TEST-BasicAuthIntegrationTest.testBasicAuth-seed#[918E42EC0808B6BE]) [     ] o.a.s.c.c.ZkStateReader Updated live nodes from ZooKeeper... (0) -> (3)
   [junit4]   2> 461937 INFO  (TEST-BasicAuthIntegrationTest.testBasicAuth-seed#[918E42EC0808B6BE]) [     ] o.a.s.c.s.i.ZkClientClusterStateProvider Cluster at 127.0.0.1:55905/solr ready
   [junit4]   2> 461945 INFO  (qtp2056909752-10339) [n:127.0.0.1:55918_solr     ] o.a.s.h.a.CollectionsHandler Invoked Collection Action :create with params collection.configName=conf&name=authCollection&nrtReplicas=1&action=CREATE&numShards=3&wt=javabin&version=2 and sendToOCPQueue=true
   [junit4]   2> 461950 INFO  (OverseerThreadFactory-3011-thread-1-processing-n:127.0.0.1:55918_solr) [n:127.0.0.1:55918_solr     ] o.a.s.c.a.c.CreateCollectionCmd Create collection authCollection
   [junit4]   2> 462080 INFO  (OverseerStateUpdate-72140572216066058-127.0.0.1:55918_solr-n_0000000000) [n:127.0.0.1:55918_solr     ] o.a.s.c.o.SliceMutator createReplica() {
   [junit4]   2>   "operation":"ADDREPLICA",
   [junit4]   2>   "collection":"authCollection",
   [junit4]   2>   "shard":"shard1",
   [junit4]   2>   "core":"authCollection_shard1_replica_n1",
   [junit4]   2>   "state":"down",
   [junit4]   2>   "base_url":"http://127.0.0.1:55924/solr",
   [junit4]   2>   "type":"NRT",
   [junit4]   2>   "waitForFinalState":"false"} 
   [junit4]   2> 462084 INFO  (OverseerStateUpdate-72140572216066058-127.0.0.1:55918_solr-n_0000000000) [n:127.0.0.1:55918_solr     ] o.a.s.c.o.SliceMutator createReplica() {
   [junit4]   2>   "operation":"ADDREPLICA",
   [junit4]   2>   "collection":"authCollection",
   [junit4]   2>   "shard":"shard2",
   [junit4]   2>   "core":"authCollection_shard2_replica_n2",
   [junit4]   2>   "state":"down",
   [junit4]   2>   "base_url":"http://127.0.0.1:55921/solr",
   [junit4]   2>   "type":"NRT",
   [junit4]   2>   "waitForFinalState":"false"} 
   [junit4]   2> 462087 INFO  (OverseerStateUpdate-72140572216066058-127.0.0.1:55918_solr-n_0000000000) [n:127.0.0.1:55918_solr     ] o.a.s.c.o.SliceMutator createReplica() {
   [junit4]   2>   "operation":"ADDREPLICA",
   [junit4]   2>   "collection":"authCollection",
   [junit4]   2>   "shard":"shard3",
   [junit4]   2>   "core":"authCollection_shard3_replica_n4",
   [junit4]   2>   "state":"down",
   [junit4]   2>   "base_url":"http://127.0.0.1:55918/solr",
   [junit4]   2>   "type":"NRT",
   [junit4]   2>   "waitForFinalState":"false"} 
   [junit4]   2> 462324 INFO  (qtp248148796-10350) [n:127.0.0.1:55924_solr    x:authCollection_shard1_replica_n1 ] o.a.s.h.a.CoreAdminOperation core create command qt=/admin/cores&coreNodeName=core_node3&collection.configName=conf&newCollection=true&name=authCollection_shard1_replica_n1&action=CREATE&numShards=3&collection=authCollection&shard=shard1&wt=javabin&version=2&replicaType=NRT
   [junit4]   2> 462324 INFO  (qtp2056909752-10341) [n:127.0.0.1:55918_solr    x:authCollection_shard3_replica_n4 ] o.a.s.h.a.CoreAdminOperation core create command qt=/admin/cores&coreNodeName=core_node6&collection.configName=conf&newCollection=true&name=authCollection_shard3_replica_n4&action=CREATE&numShards=3&collection=authCollection&shard=shard3&wt=javabin&version=2&replicaType=NRT
   [junit4]   2> 462324 INFO  (qtp595891794-10330) [n:127.0.0.1:55921_solr    x:authCollection_shard2_replica_n2 ] o.a.s.h.a.CoreAdminOperation core create command qt=/admin/cores&coreNodeName=core_node5&collection.configName=conf&newCollection=true&name=authCollection_shard2_replica_n2&action=CREATE&numShards=3&collection=authCollection&shard=shard2&wt=javabin&version=2&replicaType=NRT
   [junit4]   2> 462328 INFO  (qtp2056909752-10341) [n:127.0.0.1:55918_solr    x:authCollection_shard3_replica_n4 ] o.a.s.c.TransientSolrCoreCacheDefault Allocating transient cache for 2147483647 transient cores
   [junit4]   2> 463468 INFO  (qtp2056909752-10341) [n:127.0.0.1:55918_solr c:authCollection s:shard3 r:core_node6 x:authCollection_shard3_replica_n4 ] o.a.s.c.SolrConfig Using Lucene MatchVersion: 8.3.0
   [junit4]   2> 463468 INFO  (qtp595891794-10330) [n:127.0.0.1:55921_solr c:authCollection s:shard2 r:core_node5 x:authCollection_shard2_replica_n2 ] o.a.s.c.SolrConfig Using Lucene MatchVersion: 8.3.0
   [junit4]   2> 463468 INFO  (qtp248148796-10350) [n:127.0.0.1:55924_solr c:authCollection s:shard1 r:core_node3 x:authCollection_shard1_replica_n1 ] o.a.s.c.SolrConfig Using Lucene MatchVersion: 8.3.0
   [junit4]   2> 463502 INFO  (qtp2056909752-10341) [n:127.0.0.1:55918_solr c:authCollection s:shard3 r:core_node6 x:authCollection_shard3_replica_n4 ] o.a.s.s.IndexSchema [authCollection_shard3_replica_n4] Schema name=minimal
   [junit4]   2> 463502 INFO  (qtp595891794-10330) [n:127.0.0.1:55921_solr c:authCollection s:shard2 r:core_node5 x:authCollection_shard2_replica_n2 ] o.a.s.s.IndexSchema [authCollection_shard2_replica_n2] Schema name=minimal
   [junit4]   2> 463502 INFO  (qtp248148796-10350) [n:127.0.0.1:55924_solr c:authCollection s:shard1 r:core_node3 x:authCollection_shard1_replica_n1 ] o.a.s.s.IndexSchema [authCollection_shard1_replica_n1] Schema name=minimal
   [junit4]   2> 463514 INFO  (qtp595891794-10330) [n:127.0.0.1:55921_solr c:authCollection s:shard2 r:core_node5 x:authCollection_shard2_replica_n2 ] o.a.s.s.IndexSchema Loaded schema minimal/1.1 with uniqueid field id
   [junit4]   2> 463514 INFO  (qtp595891794-10330) [n:127.0.0.1:55921_solr c:authCollection s:shard2 r:core_node5 x:authCollection_shard2_replica_n2 ] o.a.s.c.CoreContainer Creating SolrCore 'authCollection_shard2_replica_n2' using configuration from collection authCollection, trusted=true
   [junit4]   2> 463514 INFO  (qtp2056909752-10341) [n:127.0.0.1:55918_solr c:authCollection s:shard3 r:core_node6 x:authCollection_shard3_replica_n4 ] o.a.s.s.IndexSchema Loaded schema minimal/1.1 with uniqueid field id
   [junit4]   2> 463514 INFO  (qtp2056909752-10341) [n:127.0.0.1:55918_solr c:authCollection s:shard3 r:core_node6 x:authCollection_shard3_replica_n4 ] o.a.s.c.CoreContainer Creating SolrCore 'authCollection_shard3_replica_n4' using configuration from collection authCollection, trusted=true
   [junit4]   2> 463514 INFO  (qtp248148796-10350) [n:127.0.0.1:55924_solr c:authCollection s:shard1 r:core_node3 x:authCollection_shard1_replica_n1 ] o.a.s.s.IndexSchema Loaded schema minimal/1.1 with uniqueid field id
   [junit4]   2> 463514 INFO  (qtp248148796-10350) [n:127.0.0.1:55924_solr c:authCollection s:shard1 r:core_node3 x:authCollection_shard1_replica_n1 ] o.a.s.c.CoreContainer Creating SolrCore 'authCollection_shard1_replica_n1' using configuration from collection authCollection, trusted=true
   [junit4]   2> 463514 INFO  (qtp595891794-10330) [n:127.0.0.1:55921_solr c:authCollection s:shard2 r:core_node5 x:authCollection_shard2_replica_n2 ] o.a.s.m.r.SolrJmxReporter JMX monitoring for 'solr_55921.solr.core.authCollection.shard2.replica_n2' (registry 'solr.core.authCollection.shard2.replica_n2') enabled at server: com.sun.jmx.mbeanserver.JmxMBeanServer@1be9bd0d
   [junit4]   2> 463515 INFO  (qtp595891794-10330) [n:127.0.0.1:55921_solr c:authCollection s:shard2 r:core_node5 x:authCollection_shard2_replica_n2 ] o.a.s.c.SolrCore [[authCollection_shard2_replica_n2] ] Opening new SolrCore at [C:\Users\jenkins\workspace\Lucene-Solr-8.x-Windows\solr\build\solr-core\test\J0\temp\solr.security.BasicAuthIntegrationTest_918E42EC0808B6BE-001\tempDir-001\node1\authCollection_shard2_replica_n2], dataDir=[C:\Users\jenkins\workspace\Lucene-Solr-8.x-Windows\solr\build\solr-core\test\J0\temp\solr.security.BasicAuthIntegrationTest_918E42EC0808B6BE-001\tempDir-001\node1\.\authCollection_shard2_replica_n2\data\]
   [junit4]   2> 463515 INFO  (qtp2056909752-10341) [n:127.0.0.1:55918_solr c:authCollection s:shard3 r:core_node6 x:authCollection_shard3_replica_n4 ] o.a.s.m.r.SolrJmxReporter JMX monitoring for 'solr_55918.solr.core.authCollection.shard3.replica_n4' (registry 'solr.core.authCollection.shard3.replica_n4') enabled at server: com.sun.jmx.mbeanserver.JmxMBeanServer@1be9bd0d
   [junit4]   2> 463515 INFO  (qtp2056909752-10341) [n:127.0.0.1:55918_solr c:authCollection s:shard3 r:core_node6 x:authCollection_shard3_replica_n4 ] o.a.s.c.SolrCore [[authCollection_shard3_replica_n4] ] Opening new SolrCore at [C:\Users\jenkins\workspace\Lucene-Solr-8.x-Windows\solr\build\solr-core\test\J0\temp\solr.security.BasicAuthIntegrationTest_918E42EC0808B6BE-001\tempDir-001\node3\authCollection_shard3_replica_n4], dataDir=[C:\Users\jenkins\workspace\Lucene-Solr-8.x-Windows\solr\build\solr-core\test\J0\temp\solr.security.BasicAuthIntegrationTest_918E42EC0808B6BE-001\tempDir-001\node3\.\authCollection_shard3_replica_n4\data\]
   [junit4]   2> 463516 INFO  (qtp248148796-10350) [n:127.0.0.1:55924_solr c:authCollection s:shard1 r:core_node3 x:authCollection_shard1_replica_n1 ] o.a.s.m.r.SolrJmxReporter JMX monitoring for 'solr_55924.solr.core.authCollection.shard1.replica_n1' (registry 'solr.core.authCollection.shard1.replica_n1') enabled at server: com.sun.jmx.mbeanserver.JmxMBeanServer@1be9bd0d
   [junit4]   2> 463517 INFO  (qtp248148796-10350) [n:127.0.0.1:55924_solr c:authCollection s:shard1 r:core_node3 x:authCollection_shard1_replica_n1 ] o.a.s.c.SolrCore [[authCollection_shard1_replica_n1] ] Opening new SolrCore at [C:\Users\jenkins\workspace\Lucene-Solr-8.x-Windows\solr\build\solr-core\test\J0\temp\solr.security.BasicAuthIntegrationTest_918E42EC0808B6BE-001\tempDir-001\node2\authCollection_shard1_replica_n1], dataDir=[C:\Users\jenkins\workspace\Lucene-Solr-8.x-Windows\solr\build\solr-core\test\J0\temp\solr.security.BasicAuthIntegrationTest_918E42EC0808B6BE-001\tempDir-001\node2\.\authCollection_shard1_replica_n1\data\]
   [junit4]   2> 463831 INFO  (qtp2056909752-10341) [n:127.0.0.1:55918_solr c:authCollection s:shard3 r:core_node6 x:authCollection_shard3_replica_n4 ] o.a.s.u.UpdateHandler Using UpdateLog implementation: org.apache.solr.update.UpdateLog
   [junit4]   2> 463831 INFO  (qtp248148796-10350) [n:127.0.0.1:55924_solr c:authCollection s:shard1 r:core_node3 x:authCollection_shard1_replica_n1 ] o.a.s.u.UpdateHandler Using UpdateLog implementation: org.apache.solr.update.UpdateLog
   [junit4]   2> 463831 INFO  (qtp2056909752-10341) [n:127.0.0.1:55918_solr c:authCollection s:shard3 r:core_node6 x:authCollection_shard3_replica_n4 ] o.a.s.u.UpdateLog Initializing UpdateLog: dataDir=null defaultSyncLevel=FLUSH numRecordsToKeep=100 maxNumLogsToKeep=10 numVersionBuckets=65536
   [junit4]   2> 463832 INFO  (qtp248148796-10350) [n:127.0.0.1:55924_solr c:authCollection s:shard1 r:core_node3 x:authCollection_shard1_replica_n1 ] o.a.s.u.UpdateLog Initializing UpdateLog: dataDir=null defaultSyncLevel=FLUSH numRecordsToKeep=100 maxNumLogsToKeep=10 numVersionBuckets=65536
   [junit4]   2> 463834 INFO  (qtp595891794-10330) [n:127.0.0.1:55921_solr c:authCollection s:shard2 r:core_node5 x:authCollection_shard2_replica_n2 ] o.a.s.u.UpdateHandler Using UpdateLog implementation: org.apache.solr.update.UpdateLog
   [junit4]   2> 463834 INFO  (qtp595891794-10330) [n:127.0.0.1:55921_solr c:authCollection s:shard2 r:core_node5 x:authCollection_shard2_replica_n2 ] o.a.s.u.UpdateLog Initializing UpdateLog: dataDir=null defaultSyncLevel=FLUSH numRecordsToKeep=100 maxNumLogsToKeep=10 numVersionBuckets=65536
   [junit4]   2> 463835 INFO  (qtp2056909752-10341) [n:127.0.0.1:55918_solr c:authCollection s:shard3 r:core_node6 x:authCollection_shard3_replica_n4 ] o.a.s.u.CommitTracker Hard AutoCommit: disabled
   [junit4]   2> 463835 INFO  (qtp2056909752-10341) [n:127.0.0.1:55918_solr c:authCollection s:shard3 r:core_node6 x:authCollection_shard3_replica_n4 ] o.a.s.u.CommitTracker Soft AutoCommit: disabled
   [junit4]   2> 463835 INFO  (qtp248148796-10350) [n:127.0.0.1:55924_solr c:authCollection s:shard1 r:core_node3 x:authCollection_shard1_replica_n1 ] o.a.s.u.CommitTracker Hard AutoCommit: disabled
   [junit4]   2> 463835 INFO  (qtp248148796-10350) [n:127.0.0.1:55924_solr c:authCollection s:shard1 r:core_node3 x:authCollection_shard1_replica_n1 ] o.a.s.u.CommitTracker Soft AutoCommit: disabled
   [junit4]   2> 463836 INFO  (qtp248148796-10350) [n:127.0.0.1:55924_solr c:authCollection s:shard1 r:core_node3 x:authCollection_shard1_replica_n1 ] o.a.s.s.SolrIndexSearcher Opening [Searcher@6a299340[authCollection_shard1_replica_n1] main]
   [junit4]   2> 463836 INFO  (qtp2056909752-10341) [n:127.0.0.1:55918_solr c:authCollection s:shard3 r:core_node6 x:authCollection_shard3_replica_n4 ] o.a.s.s.SolrIndexSearcher Opening [Searcher@186a4b77[authCollection_shard3_replica_n4] main]
   [junit4]   2> 463836 INFO  (qtp595891794-10330) [n:127.0.0.1:55921_solr c:authCollection s:shard2 r:core_node5 x:authCollection_shard2_replica_n2 ] o.a.s.u.CommitTracker Hard AutoCommit: disabled
   [junit4]   2> 463836 INFO  (qtp595891794-10330) [n:127.0.0.1:55921_solr c:authCollection s:shard2 r:core_node5 x:authCollection_shard2_replica_n2 ] o.a.s.u.CommitTracker Soft AutoCommit: disabled
   [junit4]   2> 463839 INFO  (qtp248148796-10350) [n:127.0.0.1:55924_solr c:authCollection s:shard1 r:core_node3 x:authCollection_shard1_replica_n1 ] o.a.s.r.ManagedResourceStorage Configured ZooKeeperStorageIO with znodeBase: /configs/conf
   [junit4]   2> 463839 INFO  (qtp2056909752-10341) [n:127.0.0.1:55918_solr c:authCollection s:shard3 r:core_node6 x:authCollection_shard3_replica_n4 ] o.a.s.r.ManagedResourceStorage Configured ZooKeeperStorageIO with znodeBase: /configs/conf
   [junit4]   2> 463839 INFO  (qtp2056909752-10341) [n:127.0.0.1:55918_solr c:authCollection s:shard3 r:core_node6 x:authCollection_shard3_replica_n4 ] o.a.s.r.ManagedResourceStorage Loaded null at path _rest_managed.json using ZooKeeperStorageIO:path=/configs/conf
   [junit4]   2> 463839 INFO  (qtp248148796-10350) [n:127.0.0.1:55924_solr c:authCollection s:shard1 r:core_node3 x:authCollection_shard1_replica_n1 ] o.a.s.r.ManagedResourceStorage Loaded null at path _rest_managed.json using ZooKeeperStorageIO:path=/configs/conf
   [junit4]   2> 463840 INFO  (qtp595891794-10330) [n:127.0.0.1:55921_solr c:authCollection s:shard2 r:core_node5 x:authCollection_shard2_replica_n2 ] o.a.s.s.SolrIndexSearcher Opening [Searcher@31f27abc[authCollection_shard2_replica_n2] main]
   [junit4]   2> 463840 INFO  (qtp248148796-10350) [n:127.0.0.1:55924_solr c:authCollection s:shard1 r:core_node3 x:authCollection_shard1_replica_n1 ] o.a.s.h.ReplicationHandler Commits will be reserved for 10000ms.
   [junit4]   2> 463840 INFO  (qtp2056909752-10341) [n:127.0.0.1:55918_solr c:authCollection s:shard3 r:core_node6 x:authCollection_shard3_replica_n4 ] o.a.s.h.ReplicationHandler Commits will be reserved for 10000ms.
   [junit4]   2> 463840 INFO  (qtp248148796-10350) [n:127.0.0.1:55924_solr c:authCollection s:shard1 r:core_node3 x:authCollection_shard1_replica_n1 ] o.a.s.u.UpdateLog Could not find max version in index or recent updates, using new clock 1640007144985067520
   [junit4]   2> 463840 INFO  (qtp2056909752-10341) [n:127.0.0.1:55918_solr c:authCollection s:shard3 r:core_node6 x:authCollection_shard3_replica_n4 ] o.a.s.u.UpdateLog Could not find max version in index or recent updates, using new clock 1640007144985067520
   [junit4]   2> 463844 INFO  (searcherExecutor-3026-thread-1-processing-n:127.0.0.1:55924_solr x:authCollection_shard1_replica_n1 c:authCollection s:shard1 r:core_node3) [n:127.0.0.1:55924_solr c:authCollection s:shard1 r:core_node3 x:authCollection_shard1_replica_n1 ] o.a.s.c.SolrCore [authCollection_shard1_replica_n1] Registered new searcher Searcher@6a299340[authCollection_shard1_replica_n1] main{ExitableDirectoryReader(UninvertingDirectoryReader())}
   [junit4]   2> 463845 INFO  (qtp595891794-10330) [n:127.0.0.1:55921_solr c:authCollection s:shard2 r:core_node5 x:authCollection_shard2_replica_n2 ] o.a.s.r.ManagedResourceStorage Configured ZooKeeperStorageIO with znodeBase: /configs/conf
   [junit4]   2> 463845 INFO  (searcherExecutor-3025-thread-1-processing-n:127.0.0.1:55918_solr x:authCollection_shard3_replica_n4 c:authCollection s:shard3 r:core_node6) [n:127.0.0.1:55918_solr c:authCollection s:shard3 r:core_node6 x:authCollection_shard3_replica_n4 ] o.a.s.c.SolrCore [authCollection_shard3_replica_n4] Registered new searcher Searcher@186a4b77[authCollection_shard3_replica_n4] main{ExitableDirectoryReader(UninvertingDirectoryReader())}
   [junit4]   2> 463845 INFO  (qtp595891794-10330) [n:127.0.0.1:55921_solr c:authCollection s:shard2 r:core_node5 x:authCollection_shard2_replica_n2 ] o.a.s.r.ManagedResourceStorage Loaded null at path _rest_managed.json using ZooKeeperStorageIO:path=/configs/conf
   [junit4]   2> 463846 INFO  (qtp595891794-10330) [n:127.0.0.1:55921_solr c:authCollection s:shard2 r:core_node5 x:authCollection_shard2_replica_n2 ] o.a.s.h.ReplicationHandler Commits will be reserved for 10000ms.
   [junit4]   2> 463846 INFO  (qtp595891794-10330) [n:127.0.0.1:55921_solr c:authCollection s:shard2 r:core_node5 x:authCollection_shard2_replica_n2 ] o.a.s.u.UpdateLog Could not find max version in index or recent updates, using new clock 1640007144991358976
   [junit4]   2> 463850 INFO  (searcherExecutor-3024-thread-1-processing-n:127.0.0.1:55921_solr x:authCollection_shard2_replica_n2 c:authCollection s:shard2 r:core_node5) [n:127.0.0.1:55921_solr c:authCollection s:shard2 r:core_node5 x:authCollection_shard2_replica_n2 ] o.a.s.c.SolrCore [authCollection_shard2_replica_n2] Registered new searcher Searcher@31f27abc[authCollection_shard2_replica_n2] main{ExitableDirectoryReader(UninvertingDirectoryReader())}
   [junit4]   2> 463850 INFO  (qtp2056909752-10341) [n:127.0.0.1:55918_solr c:authCollection s:shard3 r:core_node6 x:authCollection_shard3_replica_n4 ] o.a.s.c.ZkShardTerms Successful update of terms at /collections/authCollection/terms/shard3 to Terms{values={core_node6=0}, version=0}
   [junit4]   2> 463850 INFO  (qtp248148796-10350) [n:127.0.0.1:55924_solr c:authCollection s:shard1 r:core_node3 x:authCollection_shard1_replica_n1 ] o.a.s.c.ZkShardTerms Successful update of terms at /collections/authCollection/terms/shard1 to Terms{values={core_node3=0}, version=0}
   [junit4]   2> 463850 INFO  (qtp2056909752-10341) [n:127.0.0.1:55918_solr c:authCollection s:shard3 r:core_node6 x:authCollection_shard3_replica_n4 ] o.a.s.c.ShardLeaderElectionContextBase make sure parent is created /collections/authCollection/leaders/shard3
   [junit4]   2> 463850 INFO  (qtp248148796-10350) [n:127.0.0.1:55924_solr c:authCollection s:shard1 r:core_node3 x:authCollection_shard1_replica_n1 ] o.a.s.c.ShardLeaderElectionContextBase make sure parent is created /collections/authCollection/leaders/shard1
   [junit4]   2> 463855 INFO  (qtp595891794-10330) [n:127.0.0.1:55921_solr c:authCollection s:shard2 r:core_node5 x:authCollection_shard2_replica_n2 ] o.a.s.c.ZkShardTerms Successful update of terms at /collections/authCollection/terms/shard2 to Terms{values={core_node5=0}, version=0}
   [junit4]   2> 463855 INFO  (qtp595891794-10330) [n:127.0.0.1:55921_solr c:authCollection s:shard2 r:core_node5 x:authCollection_shard2_replica_n2 ] o.a.s.c.ShardLeaderElectionContextBase make sure parent is created /collections/authCollection/leaders/shard2
   [junit4]   2> 463857 INFO  (qtp248148796-10350) [n:127.0.0.1:55924_solr c:authCollection s:shard1 r:core_node3 x:authCollection_shard1_replica_n1 ] o.a.s.c.ShardLeaderElectionContext Enough replicas found to continue.
   [junit4]   2> 463857 INFO  (qtp248148796-10350) [n:127.0.0.1:55924_solr c:authCollection s:shard1 r:core_node3 x:authCollection_shard1_replica_n1 ] o.a.s.c.ShardLeaderElectionContext I may be the new leader - try and sync
   [junit4]   2> 463857 INFO  (qtp248148796-10350) [n:127.0.0.1:55924_solr c:authCollection s:shard1 r:core_node3 x:authCollection_shard1_replica_n1 ] o.a.s.c.SyncStrategy Sync replicas to http://127.0.0.1:55924/solr/authCollection_shard1_replica_n1/
   [junit4]   2> 463857 INFO  (qtp2056909752-10341) [n:127.0.0.1:55918_solr c:authCollection s:shard3 r:core_node6 x:authCollection_shard3_replica_n4 ] o.a.s.c.ShardLeaderElectionContext Enough replicas found to continue.
   [junit4]   2> 463857 INFO  (qtp2056909752-10341) [n:127.0.0.1:55918_solr c:authCollection s:shard3 r:core_node6 x:authCollection_shard3_replica_n4 ] o.a.s.c.ShardLeaderElectionContext I may be the new leader - try and sync
   [junit4]   2> 463857 INFO  (qtp2056909752-10341) [n:127.0.0.1:55918_solr c:authCollection s:shard3 r:core_node6 x:authCollection_shard3_replica_n4 ] o.a.s.c.SyncStrategy Sync replicas to http://127.0.0.1:55918/solr/authCollection_shard3_replica_n4/
   [junit4]   2> 463858 INFO  (qtp248148796-10350) [n:127.0.0.1:55924_solr c:authCollection s:shard1 r:core_node3 x:authCollection_shard1_replica_n1 ] o.a.s.c.SyncStrategy Sync Success - now sync replicas to me
   [junit4]   2> 463858 INFO  (qtp2056909752-10341) [n:127.0.0.1:55918_solr c:authCollection s:shard3 r:core_node6 x:authCollection_shard3_replica_n4 ] o.a.s.c.SyncStrategy Sync Success - now sync replicas to me
   [junit4]   2> 463858 INFO  (qtp248148796-10350) [n:127.0.0.1:55924_solr c:authCollection s:shard1 r:core_node3 x:authCollection_shard1_replica_n1 ] o.a.s.c.SyncStrategy http://127.0.0.1:55924/solr/authCollection_shard1_replica_n1/ has no replicas
   [junit4]   2> 463858 INFO  (qtp248148796-10350) [n:127.0.0.1:55924_solr c:authCollection s:shard1 r:core_node3 x:authCollection_shard1_replica_n1 ] o.a.s.c.ShardLeaderElectionContextBase Creating leader registration node /collections/authCollection/leaders/shard1/leader after winning as /collections/authCollection/leader_elect/shard1/election/72140572216066056-core_node3-n_0000000000
   [junit4]   2> 463858 INFO  (qtp2056909752-10341) [n:127.0.0.1:55918_solr c:authCollection s:shard3 r:core_node6 x:authCollection_shard3_replica_n4 ] o.a.s.c.SyncStrategy http://127.0.0.1:55918/solr/authCollection_shard3_replica_n4/ has no replicas
   [junit4]   2> 463858 INFO  (qtp2056909752-10341) [n:127.0.0.1:55918_solr c:authCollection s:shard3 r:core_node6 x:authCollection_shard3_replica_n4 ] o.a.s.c.ShardLeaderElectionContextBase Creating leader registration node /collections/authCollection/leaders/shard3/leader after winning as /collections/authCollection/leader_elect/shard3/election/72140572216066058-core_node6-n_0000000000
   [junit4]   2> 463860 INFO  (qtp595891794-10330) [n:127.0.0.1:55921_solr c:authCollection s:shard2 r:core_node5 x:authCollection_shard2_replica_n2 ] o.a.s.c.ShardLeaderElectionContext Enough replicas found to continue.
   [junit4]   2> 463860 INFO  (qtp595891794-10330) [n:127.0.0.1:55921_solr c:authCollection s:shard2 r:core_node5 x:authCollection_shard2_replica_n2 ] o.a.s.c.ShardLeaderElectionContext I may be the new leader - try and sync
   [junit4]   2> 463860 INFO  (qtp595891794-10330) [n:127.0.0.1:55921_solr c:authCollection s:shard2 r:core_node5 x:authCollection_shard2_replica_n2 ] o.a.s.c.SyncStrategy Sync replicas to http://127.0.0.1:55921/solr/authCollection_shard2_replica_n2/
   [junit4]   2> 463860 INFO  (qtp2056909752-10341) [n:127.0.0.1:55918_solr c:authCollection s:shard3 r:core_node6 x:authCollection_shard3_replica_n4 ] o.a.s.c.ShardLeaderElectionContext I am the new leader: http://127.0.0.1:55918/solr/authCollection_shard3_replica_n4/ shard3
   [junit4]   2> 463860 INFO  (qtp248148796-10350) [n:127.0.0.1:55924_solr c:authCollection s:shard1 r:core_node3 x:authCollection_shard1_replica_n1 ] o.a.s.c.ShardLeaderElectionContext I am the new leader: http://127.0.0.1:55924/solr/authCollection_shard1_replica_n1/ shard1
   [junit4]   2> 463860 INFO  (qtp595891794-10330) [n:127.0.0.1:55921_solr c:authCollection s:shard2 r:core_node5 x:authCollection_shard2_replica_n2 ] o.a.s.c.SyncStrategy Sync Success - now sync replicas to me
   [junit4]   2> 463861 INFO  (qtp595891794-10330) [n:127.0.0.1:55921_solr c:authCollection s:shard2 r:core_node5 x:authCollection_shard2_replica_n2 ] o.a.s.c.SyncStrategy http://127.0.0.1:55921/solr/authCollection_shard2_replica_n2/ has no replicas
   [junit4]   2> 463861 INFO  (qtp595891794-10330) [n:127.0.0.1:55921_solr c:authCollection s:shard2 r:core_node5 x:authCollection_shard2_replica_n2 ] o.a.s.c.ShardLeaderElectionContextBase Creating leader registration node /collections/authCollection/leaders/shard2/leader after winning as /collections/authCollection/leader_elect/shard2/election/72140572216066060-core_node5-n_0000000000
   [junit4]   2> 463868 INFO  (qtp595891794-10330) [n:127.0.0.1:55921_solr c:authCollection s:shard2 r:core_node5 x:authCollection_shard2_replica_n2 ] o.a.s.c.ShardLeaderElectionContext I am the new leader: http://127.0.0.1:55921/solr/authCollection_shard2_replica_n2/ shard2
   [junit4]   2> 463976 INFO  (zkCallback-4091-thread-1) [     ] o.a.s.c.c.ZkStateReader A cluster state change: [WatchedEvent state:SyncConnected type:NodeDataChanged path:/collections/authCollection/state.json] for collection [authCollection] has occurred - updating... (live nodes size: [3])
   [junit4]   2> 463976 INFO  (zkCallback-4110-thread-1) [     ] o.a.s.c.c.ZkStateReader A cluster state change: [WatchedEvent state:SyncConnected type:NodeDataChanged path:/collections/authCollection/state.json] for collection [authCollection] has occurred - updating... (live nodes size: [3])
   [junit4]   2> 463976 INFO  (zkCallback-4101-thread-1) [     ] o.a.s.c.c.ZkStateReader A cluster state change: [WatchedEvent state:SyncConnected type:NodeDataChanged path:/collections/authCollection/state.json] for collection [authCollection] has occurred - updating... (live nodes size: [3])
   [junit4]   2> 463977 INFO  (qtp595891794-10330) [n:127.0.0.1:55921_solr c:authCollection s:shard2 r:core_node5 x:authCollection_shard2_replica_n2 ] o.a.s.c.ZkController I am the leader, no recovery necessary
   [junit4]   2> 463977 INFO  (qtp248148796-10350) [n:127.0.0.1:55924_solr c:authCollection s:shard1 r:core_node3 x:authCollection_shard1_replica_n1 ] o.a.s.c.ZkController I am the leader, no recovery necessary
   [junit4]   2> 463977 INFO  (qtp2056909752-10341) [n:127.0.0.1:55918_solr c:authCollection s:shard3 r:core_node6 x:authCollection_shard3_replica_n4 ] o.a.s.c.ZkController I am the leader, no recovery necessary
   [junit4]   2> 464005 INFO  (qtp2056909752-10341) [n:127.0.0.1:55918_solr c:authCollection s:shard3 r:core_node6 x:authCollection_shard3_replica_n4 ] o.a.s.s.HttpSolrCall [admin] webapp=null path=/admin/cores params={qt=/admin/cores&coreNodeName=core_node6&collection.configName=conf&newCollection=true&name=authCollection_shard3_replica_n4&action=CREATE&numShards=3&collection=authCollection&shard=shard3&wt=javabin&version=2&replicaType=NRT} status=0 QTime=1570
   [junit4]   2> 464005 INFO  (qtp248148796-10350) [n:127.0.0.1:55924_solr c:authCollection s:shard1 r:core_node3 x:authCollection_shard1_replica_n1 ] o.a.s.s.HttpSolrCall [admin] webapp=null path=/admin/cores params={qt=/admin/cores&coreNodeName=core_node3&collection.configName=conf&newCollection=true&name=authCollection_shard1_replica_n1&action=CREATE&numShards=3&collection=authCollection&shard=shard1&wt=javabin&version=2&replicaType=NRT} status=0 QTime=1570
   [junit4]   2> 464005 INFO  (qtp595891794-10330) [n:127.0.0.1:55921_solr c:authCollection s:shard2 r:core_node5 x:authCollection_shard2_replica_n2 ] o.a.s.s.HttpSolrCall [admin] webapp=null path=/admin/cores params={qt=/admin/cores&coreNodeName=core_node5&collection.configName=conf&newCollection=true&name=authCollection_shard2_replica_n2&action=CREATE&numShards=3&collection=authCollection&shard=shard2&wt=javabin&version=2&replicaType=NRT} status=0 QTime=1571
   [junit4]   2> 464009 INFO  (qtp2056909752-10339) [n:127.0.0.1:55918_solr     ] o.a.s.h.a.CollectionsHandler Wait for new collection to be active for at most 45 seconds. Check all shard replicas
   [junit4]   2> 464112 INFO  (zkCallback-4101-thread-3) [     ] o.a.s.c.c.ZkStateReader A cluster state change: [WatchedEvent state:SyncConnected type:NodeDataChanged path:/collections/authCollection/state.json] for collection [authCollection] has occurred - updating... (live nodes size: [3])
   [junit4]   2> 464112 INFO  (zkCallback-4101-thread-2) [     ] o.a.s.c.c.ZkStateReader A cluster state change: [WatchedEvent state:SyncConnected type:NodeDataChanged path:/collections/authCollection/state.json] for collection [authCollection] has occurred - updating... (live nodes size: [3])
   [junit4]   2> 464112 INFO  (zkCallback-4091-thread-2) [     ] o.a.s.c.c.ZkStateReader A cluster state change: [WatchedEvent state:SyncConnected type:NodeDataChanged path:/collections/authCollection/state.json] for collection [authCollection] has occurred - updating... (live nodes size: [3])
   [junit4]   2> 464113 INFO  (zkCallback-4091-thread-1) [     ] o.a.s.c.c.ZkStateReader A cluster state change: [WatchedEvent state:SyncConnected type:NodeDataChanged path:/collections/authCollection/state.json] for collection [authCollection] has occurred - updating... (live nodes size: [3])
   [junit4]   2> 464113 INFO  (zkCallback-4110-thread-1) [     ] o.a.s.c.c.ZkStateReader A cluster state change: [WatchedEvent state:SyncConnected type:NodeDataChanged path:/collections/authCollection/state.json] for collection [authCollection] has occurred - updating... (live nodes size: [3])
   [junit4]   2> 464113 INFO  (zkCallback-4110-thread-2) [     ] o.a.s.c.c.ZkStateReader A cluster state change: [WatchedEvent state:SyncConnected type:NodeDataChanged path:/collections/authCollection/state.json] for collection [authCollection] has occurred - updating... (live nodes size: [3])
   [junit4]   2> 464114 INFO  (qtp2056909752-10339) [n:127.0.0.1:55918_solr     ] o.a.s.s.Http

[...truncated too long message...]

_solr
   [junit4]   2> 553354 INFO  (closeThreadPool-1314-thread-2) [     ] o.a.s.c.Overseer Overseer (id=72141183024627722-127.0.0.1:58849_solr-n_0000000001) closing
   [junit4]   2> 553406 INFO  (zkCallback-1258-thread-1) [     ] o.a.s.c.c.ZkStateReader Updated live nodes from ZooKeeper... (3) -> (2)
   [junit4]   2> 553406 INFO  (zkCallback-1299-thread-1) [     ] o.a.s.c.c.ZkStateReader Updated live nodes from ZooKeeper... (3) -> (2)
   [junit4]   2> 553407 INFO  (zkCallback-1268-thread-1) [     ] o.a.s.c.c.ZkStateReader Updated live nodes from ZooKeeper... (3) -> (2)
   [junit4]   2> 553407 INFO  (zkCallback-1244-thread-1) [     ] o.a.s.c.c.ZkStateReader Updated live nodes from ZooKeeper... (3) -> (2)
   [junit4]   2> 553407 INFO  (zkCallback-1260-thread-2) [     ] o.a.s.c.c.ZkStateReader Updated live nodes from ZooKeeper... (3) -> (2)
   [junit4]   2> 553644 INFO  (jetty-closer-1303-thread-2) [     ] o.a.s.c.Overseer Overseer (id=72141183024627722-127.0.0.1:58849_solr-n_0000000001) closing
   [junit4]   2> 553647 INFO  (jetty-closer-1303-thread-2) [     ] o.e.j.s.AbstractConnector Stopped ServerConnector@16ceb788{HTTP/1.1,[http/1.1, h2c]}{127.0.0.1:0}
   [junit4]   2> 553700 INFO  (jetty-closer-1303-thread-2) [     ] o.e.j.s.h.ContextHandler Stopped o.e.j.s.ServletContextHandler@708a9ed8{/solr,null,UNAVAILABLE}
   [junit4]   2> 553702 INFO  (jetty-closer-1303-thread-2) [     ] o.e.j.s.session node0 Stopped scavenging
   [junit4]   2> 553769 INFO  (jetty-closer-1303-thread-3) [     ] o.e.j.s.AbstractConnector Stopped ServerConnector@7d1132dc{HTTP/1.1,[http/1.1, h2c]}{127.0.0.1:0}
   [junit4]   2> 553777 INFO  (jetty-closer-1303-thread-3) [     ] o.e.j.s.h.ContextHandler Stopped o.e.j.s.ServletContextHandler@64252c01{/solr,null,UNAVAILABLE}
   [junit4]   2> 553777 INFO  (jetty-closer-1303-thread-3) [     ] o.e.j.s.session node0 Stopped scavenging
   [junit4]   2> 553831 INFO  (jetty-closer-1303-thread-1) [     ] o.e.j.s.AbstractConnector Stopped ServerConnector@2d8235ac{HTTP/1.1,[http/1.1, h2c]}{127.0.0.1:58846}
   [junit4]   2> 553831 INFO  (jetty-closer-1303-thread-1) [     ] o.e.j.s.h.ContextHandler Stopped o.e.j.s.ServletContextHandler@7f0542d7{/solr,null,UNAVAILABLE}
   [junit4]   2> 553831 INFO  (jetty-closer-1303-thread-1) [     ] o.e.j.s.session node0 Stopped scavenging
   [junit4]   2> 553837 INFO  (TEST-BasicAuthIntegrationTest.testBasicAuth-seed#[918E42EC0808B6BE]) [     ] o.a.s.c.ZkTestServer Shutting down ZkTestServer.
   [junit4]   2> 554100 WARN  (ZkTestServer Run Thread) [     ] o.a.s.c.ZkTestServer Watch limit violations: 
   [junit4]   2> Maximum concurrent create/delete watches above limit:
   [junit4]   2> 
   [junit4]   2> 	9	/solr/aliases.json
   [junit4]   2> 	9	/solr/clusterprops.json
   [junit4]   2> 	4	/solr/security.json
   [junit4]   2> 	4	/solr/configs/conf
   [junit4]   2> 	3	/solr/collections/authCollection/terms/shard2
   [junit4]   2> 	2	/solr/collections/authCollection/terms/shard1
   [junit4]   2> 	2	/solr/collections/authCollection/terms/shard3
   [junit4]   2> 
   [junit4]   2> Maximum concurrent data watches above limit:
   [junit4]   2> 
   [junit4]   2> 	58	/solr/collections/authCollection/state.json
   [junit4]   2> 	9	/solr/clusterstate.json
   [junit4]   2> 	3	/solr/security.json
   [junit4]   2> 	2	/solr/autoscaling.json
   [junit4]   2> 
   [junit4]   2> Maximum concurrent children watches above limit:
   [junit4]   2> 
   [junit4]   2> 	36	/solr/live_nodes
   [junit4]   2> 	29	/solr/overseer/queue
   [junit4]   2> 	16	/solr/collections
   [junit4]   2> 	6	/solr/overseer/collection-queue-work
   [junit4]   2> 	2	/solr/autoscaling/events/.scheduled_maintenance
   [junit4]   2> 	2	/solr/autoscaling/events/.auto_add_replicas
   [junit4]   2> 	2	/solr/overseer/queue-work
   [junit4]   2> 
   [junit4]   2> 554116 INFO  (TEST-BasicAuthIntegrationTest.testBasicAuth-seed#[918E42EC0808B6BE]) [     ] o.a.s.c.ZkTestServer parse host and port list: 127.0.0.1:58833
   [junit4]   2> 554116 INFO  (TEST-BasicAuthIntegrationTest.testBasicAuth-seed#[918E42EC0808B6BE]) [     ] o.a.s.c.ZkTestServer connecting to 127.0.0.1 58833
   [junit4]   2> 556404 INFO  (TEST-BasicAuthIntegrationTest.testBasicAuth-seed#[918E42EC0808B6BE]) [     ] o.a.s.SolrTestCaseJ4 ###Ending testBasicAuth
   [junit4]   2> NOTE: reproduce with: ant test  -Dtestcase=BasicAuthIntegrationTest -Dtests.method=testBasicAuth -Dtests.seed=918E42EC0808B6BE -Dtests.slow=true -Dtests.badapples=true -Dtests.locale=pt -Dtests.timezone=Australia/Melbourne -Dtests.asserts=true -Dtests.file.encoding=ISO-8859-1
   [junit4] FAILURE 11.7s J1 | BasicAuthIntegrationTest.testBasicAuth <<<
   [junit4]    > Throwable #1: java.lang.AssertionError: expected:<401> but was:<400>
   [junit4]    > 	at __randomizedtesting.SeedInfo.seed([918E42EC0808B6BE:2DE034FEAC5B35C4]:0)
   [junit4]    > 	at org.apache.solr.security.BasicAuthIntegrationTest.testBasicAuth(BasicAuthIntegrationTest.java:151)
   [junit4]    > 	at java.lang.Thread.run(Thread.java:748)
   [junit4]   2> NOTE: leaving temporary files on disk at: C:\Users\jenkins\workspace\Lucene-Solr-8.x-Windows\solr\build\solr-core\test\J1\temp\solr.security.BasicAuthIntegrationTest_918E42EC0808B6BE-005
   [junit4]   2> NOTE: test params are: codec=Asserting(Lucene80): {}, docValues:{}, maxPointsInLeafNode=2006, maxMBSortInHeap=7.2570412267543425, sim=Asserting(org.apache.lucene.search.similarities.AssertingSimilarity@3881c92f), locale=pt, timezone=Australia/Melbourne
   [junit4]   2> NOTE: Windows 10 10.0 amd64/Oracle Corporation 1.8.0_201 (64-bit)/cpus=3,threads=1,free=354834896,total=518979584
   [junit4]   2> NOTE: All tests run in this JVM: [DimensionalRoutedAliasUpdateProcessorTest, BasicAuthIntegrationTest, BasicAuthIntegrationTest, BasicAuthIntegrationTest, DimensionalRoutedAliasUpdateProcessorTest, BasicAuthIntegrationTest, BasicAuthIntegrationTest]
   [junit4] Completed [9/10 (5!)] on J1 in 11.96s, 1 test, 1 failure <<< FAILURES!
   [junit4] 
   [junit4] HEARTBEAT J0 PID(19320@serv1-vm1): 2019-07-25T08:06:55, stalled for 72.0s at: DimensionalRoutedAliasUpdateProcessorTest.testCatTime
   [junit4] Suite: org.apache.solr.update.processor.DimensionalRoutedAliasUpdateProcessorTest
   [junit4] OK      97.4s J0 | DimensionalRoutedAliasUpdateProcessorTest.testTimeCat
   [junit4] OK      85.7s J0 | DimensionalRoutedAliasUpdateProcessorTest.testCatTime
   [junit4] Completed [10/10 (5!)] on J0 in 184.26s, 2 tests
   [junit4] 
   [junit4] 
   [junit4] Tests with failures [seed: 918E42EC0808B6BE]:
   [junit4]   - org.apache.solr.security.BasicAuthIntegrationTest.testBasicAuth
   [junit4]   - org.apache.solr.security.BasicAuthIntegrationTest.testBasicAuth
   [junit4]   - org.apache.solr.security.BasicAuthIntegrationTest.testBasicAuth
   [junit4]   - org.apache.solr.security.BasicAuthIntegrationTest.testBasicAuth
   [junit4]   - org.apache.solr.security.BasicAuthIntegrationTest.testBasicAuth
   [junit4] 
   [junit4] 
   [junit4] JVM J0:     0.63 ..   675.33 =   674.71s
   [junit4] JVM J1:     0.83 ..   557.46 =   556.63s
   [junit4] Execution time total: 11 minutes 15 seconds
   [junit4] Tests summary: 10 suites, 15 tests, 5 failures

BUILD FAILED
C:\Users\jenkins\workspace\Lucene-Solr-8.x-Windows\lucene\common-build.xml:1572: The following error occurred while executing this line:
C:\Users\jenkins\workspace\Lucene-Solr-8.x-Windows\lucene\common-build.xml:1099: There were test failures: 10 suites, 15 tests, 5 failures [seed: 918E42EC0808B6BE]

Total time: 11 minutes 17 seconds

[repro] Setting last failure code to 1

[repro] Failures:
[repro]   0/5 failed: org.apache.solr.update.processor.DimensionalRoutedAliasUpdateProcessorTest
[repro]   5/5 failed: org.apache.solr.security.BasicAuthIntegrationTest
[repro] Exiting with code 1

C:\Users\jenkins\workspace\Lucene-Solr-8.x-Windows>IF EXIST lucene\build move /y lucene\build lucene\build.repro 
        1 dir(s) moved.

C:\Users\jenkins\workspace\Lucene-Solr-8.x-Windows>IF EXIST solr\build move /y solr\build solr\build.repro 
        1 dir(s) moved.

C:\Users\jenkins\workspace\Lucene-Solr-8.x-Windows>IF EXIST lucene\build.orig move /y lucene\build.orig lucene\build 
        1 dir(s) moved.

C:\Users\jenkins\workspace\Lucene-Solr-8.x-Windows>IF EXIST solr\build.orig move /y solr\build.orig solr\build 
        1 dir(s) moved.

C:\Users\jenkins\workspace\Lucene-Solr-8.x-Windows>exit 0 
Archiving artifacts
Setting ANT_1_8_2_HOME=C:\Users\jenkins\tools\hudson.tasks.Ant_AntInstallation\ANT_1.8.2
[WARNINGS] Parsing warnings in console log with parser Java Compiler (javac)
Setting ANT_1_8_2_HOME=C:\Users\jenkins\tools\hudson.tasks.Ant_AntInstallation\ANT_1.8.2
No credentials specified
Setting ANT_1_8_2_HOME=C:\Users\jenkins\tools\hudson.tasks.Ant_AntInstallation\ANT_1.8.2
<Git Blamer> Using GitBlamer to create author and commit information for all warnings.
<Git Blamer> GIT_COMMIT=d842b45727bf65443c10f82968791c124aa5f5a5, workspace=C:\Users\jenkins\workspace\Lucene-Solr-8.x-Windows
[WARNINGS] Computing warning deltas based on reference build #379
Recording test results
Setting ANT_1_8_2_HOME=C:\Users\jenkins\tools\hudson.tasks.Ant_AntInstallation\ANT_1.8.2
Build step 'Publish JUnit test result report' changed build result to UNSTABLE
Email was triggered for: Unstable (Test Failures)
Sending email for trigger: Unstable (Test Failures)
Setting ANT_1_8_2_HOME=C:\Users\jenkins\tools\hudson.tasks.Ant_AntInstallation\ANT_1.8.2
Setting ANT_1_8_2_HOME=C:\Users\jenkins\tools\hudson.tasks.Ant_AntInstallation\ANT_1.8.2
Setting ANT_1_8_2_HOME=C:\Users\jenkins\tools\hudson.tasks.Ant_AntInstallation\ANT_1.8.2
Setting ANT_1_8_2_HOME=C:\Users\jenkins\tools\hudson.tasks.Ant_AntInstallation\ANT_1.8.2
Setting ANT_1_8_2_HOME=C:\Users\jenkins\tools\hudson.tasks.Ant_AntInstallation\ANT_1.8.2
Setting ANT_1_8_2_HOME=C:\Users\jenkins\tools\hudson.tasks.Ant_AntInstallation\ANT_1.8.2

Mime
View raw message