lucene-dev mailing list archives

Site index · List index
Message view « Date » · « Thread »
Top « Date » · « Thread »
From Policeman Jenkins Server <jenk...@thetaphi.de>
Subject [JENKINS] Lucene-Solr-master-Linux (64bit/jdk-12.0.1) - Build # 24431 - Still Unstable!
Date Mon, 22 Jul 2019 11:06:08 GMT
Build: https://jenkins.thetaphi.de/job/Lucene-Solr-master-Linux/24431/
Java: 64bit/jdk-12.0.1 -XX:+UseCompressedOops -XX:+UseParallelGC

4 tests failed.
FAILED:  org.apache.solr.security.BasicAuthIntegrationTest.testBasicAuth

Error Message:
expected:<401> but was:<400>

Stack Trace:
java.lang.AssertionError: expected:<401> but was:<400>
	at __randomizedtesting.SeedInfo.seed([C55C200D0B21752C:7932561FAF72F656]:0)
	at org.junit.Assert.fail(Assert.java:88)
	at org.junit.Assert.failNotEquals(Assert.java:834)
	at org.junit.Assert.assertEquals(Assert.java:645)
	at org.junit.Assert.assertEquals(Assert.java:631)
	at org.apache.solr.security.BasicAuthIntegrationTest.testBasicAuth(BasicAuthIntegrationTest.java:151)
	at java.base/jdk.internal.reflect.NativeMethodAccessorImpl.invoke0(Native Method)
	at java.base/jdk.internal.reflect.NativeMethodAccessorImpl.invoke(NativeMethodAccessorImpl.java:62)
	at java.base/jdk.internal.reflect.DelegatingMethodAccessorImpl.invoke(DelegatingMethodAccessorImpl.java:43)
	at java.base/java.lang.reflect.Method.invoke(Method.java:567)
	at com.carrotsearch.randomizedtesting.RandomizedRunner.invoke(RandomizedRunner.java:1750)
	at com.carrotsearch.randomizedtesting.RandomizedRunner$8.evaluate(RandomizedRunner.java:938)
	at com.carrotsearch.randomizedtesting.RandomizedRunner$9.evaluate(RandomizedRunner.java:974)
	at com.carrotsearch.randomizedtesting.RandomizedRunner$10.evaluate(RandomizedRunner.java:988)
	at com.carrotsearch.randomizedtesting.rules.SystemPropertiesRestoreRule$1.evaluate(SystemPropertiesRestoreRule.java:57)
	at org.apache.lucene.util.TestRuleSetupTeardownChained$1.evaluate(TestRuleSetupTeardownChained.java:49)
	at org.apache.lucene.util.AbstractBeforeAfterRule$1.evaluate(AbstractBeforeAfterRule.java:45)
	at org.apache.lucene.util.TestRuleThreadAndTestName$1.evaluate(TestRuleThreadAndTestName.java:48)
	at org.apache.lucene.util.TestRuleIgnoreAfterMaxFailures$1.evaluate(TestRuleIgnoreAfterMaxFailures.java:64)
	at org.apache.lucene.util.TestRuleMarkFailure$1.evaluate(TestRuleMarkFailure.java:47)
	at com.carrotsearch.randomizedtesting.rules.StatementAdapter.evaluate(StatementAdapter.java:36)
	at com.carrotsearch.randomizedtesting.ThreadLeakControl$StatementRunner.run(ThreadLeakControl.java:368)
	at com.carrotsearch.randomizedtesting.ThreadLeakControl.forkTimeoutingTask(ThreadLeakControl.java:817)
	at com.carrotsearch.randomizedtesting.ThreadLeakControl$3.evaluate(ThreadLeakControl.java:468)
	at com.carrotsearch.randomizedtesting.RandomizedRunner.runSingleTest(RandomizedRunner.java:947)
	at com.carrotsearch.randomizedtesting.RandomizedRunner$5.evaluate(RandomizedRunner.java:832)
	at com.carrotsearch.randomizedtesting.RandomizedRunner$6.evaluate(RandomizedRunner.java:883)
	at com.carrotsearch.randomizedtesting.RandomizedRunner$7.evaluate(RandomizedRunner.java:894)
	at com.carrotsearch.randomizedtesting.rules.StatementAdapter.evaluate(StatementAdapter.java:36)
	at com.carrotsearch.randomizedtesting.rules.SystemPropertiesRestoreRule$1.evaluate(SystemPropertiesRestoreRule.java:57)
	at org.apache.lucene.util.AbstractBeforeAfterRule$1.evaluate(AbstractBeforeAfterRule.java:45)
	at com.carrotsearch.randomizedtesting.rules.StatementAdapter.evaluate(StatementAdapter.java:36)
	at org.apache.lucene.util.TestRuleStoreClassName$1.evaluate(TestRuleStoreClassName.java:41)
	at com.carrotsearch.randomizedtesting.rules.NoShadowingOrOverridesOnMethodsRule$1.evaluate(NoShadowingOrOverridesOnMethodsRule.java:40)
	at com.carrotsearch.randomizedtesting.rules.NoShadowingOrOverridesOnMethodsRule$1.evaluate(NoShadowingOrOverridesOnMethodsRule.java:40)
	at com.carrotsearch.randomizedtesting.rules.StatementAdapter.evaluate(StatementAdapter.java:36)
	at com.carrotsearch.randomizedtesting.rules.StatementAdapter.evaluate(StatementAdapter.java:36)
	at org.apache.lucene.util.TestRuleAssertionsRequired$1.evaluate(TestRuleAssertionsRequired.java:53)
	at org.apache.lucene.util.TestRuleMarkFailure$1.evaluate(TestRuleMarkFailure.java:47)
	at org.apache.lucene.util.TestRuleIgnoreAfterMaxFailures$1.evaluate(TestRuleIgnoreAfterMaxFailures.java:64)
	at org.apache.lucene.util.TestRuleIgnoreTestSuites$1.evaluate(TestRuleIgnoreTestSuites.java:54)
	at com.carrotsearch.randomizedtesting.rules.StatementAdapter.evaluate(StatementAdapter.java:36)
	at com.carrotsearch.randomizedtesting.ThreadLeakControl$StatementRunner.run(ThreadLeakControl.java:368)
	at java.base/java.lang.Thread.run(Thread.java:835)


FAILED:  org.apache.solr.security.BasicAuthIntegrationTest.testBasicAuth

Error Message:
expected:<401> but was:<400>

Stack Trace:
java.lang.AssertionError: expected:<401> but was:<400>
	at __randomizedtesting.SeedInfo.seed([C55C200D0B21752C:7932561FAF72F656]:0)
	at org.junit.Assert.fail(Assert.java:88)
	at org.junit.Assert.failNotEquals(Assert.java:834)
	at org.junit.Assert.assertEquals(Assert.java:645)
	at org.junit.Assert.assertEquals(Assert.java:631)
	at org.apache.solr.security.BasicAuthIntegrationTest.testBasicAuth(BasicAuthIntegrationTest.java:151)
	at java.base/jdk.internal.reflect.NativeMethodAccessorImpl.invoke0(Native Method)
	at java.base/jdk.internal.reflect.NativeMethodAccessorImpl.invoke(NativeMethodAccessorImpl.java:62)
	at java.base/jdk.internal.reflect.DelegatingMethodAccessorImpl.invoke(DelegatingMethodAccessorImpl.java:43)
	at java.base/java.lang.reflect.Method.invoke(Method.java:567)
	at com.carrotsearch.randomizedtesting.RandomizedRunner.invoke(RandomizedRunner.java:1750)
	at com.carrotsearch.randomizedtesting.RandomizedRunner$8.evaluate(RandomizedRunner.java:938)
	at com.carrotsearch.randomizedtesting.RandomizedRunner$9.evaluate(RandomizedRunner.java:974)
	at com.carrotsearch.randomizedtesting.RandomizedRunner$10.evaluate(RandomizedRunner.java:988)
	at com.carrotsearch.randomizedtesting.rules.SystemPropertiesRestoreRule$1.evaluate(SystemPropertiesRestoreRule.java:57)
	at org.apache.lucene.util.TestRuleSetupTeardownChained$1.evaluate(TestRuleSetupTeardownChained.java:49)
	at org.apache.lucene.util.AbstractBeforeAfterRule$1.evaluate(AbstractBeforeAfterRule.java:45)
	at org.apache.lucene.util.TestRuleThreadAndTestName$1.evaluate(TestRuleThreadAndTestName.java:48)
	at org.apache.lucene.util.TestRuleIgnoreAfterMaxFailures$1.evaluate(TestRuleIgnoreAfterMaxFailures.java:64)
	at org.apache.lucene.util.TestRuleMarkFailure$1.evaluate(TestRuleMarkFailure.java:47)
	at com.carrotsearch.randomizedtesting.rules.StatementAdapter.evaluate(StatementAdapter.java:36)
	at com.carrotsearch.randomizedtesting.ThreadLeakControl$StatementRunner.run(ThreadLeakControl.java:368)
	at com.carrotsearch.randomizedtesting.ThreadLeakControl.forkTimeoutingTask(ThreadLeakControl.java:817)
	at com.carrotsearch.randomizedtesting.ThreadLeakControl$3.evaluate(ThreadLeakControl.java:468)
	at com.carrotsearch.randomizedtesting.RandomizedRunner.runSingleTest(RandomizedRunner.java:947)
	at com.carrotsearch.randomizedtesting.RandomizedRunner$5.evaluate(RandomizedRunner.java:832)
	at com.carrotsearch.randomizedtesting.RandomizedRunner$6.evaluate(RandomizedRunner.java:883)
	at com.carrotsearch.randomizedtesting.RandomizedRunner$7.evaluate(RandomizedRunner.java:894)
	at com.carrotsearch.randomizedtesting.rules.StatementAdapter.evaluate(StatementAdapter.java:36)
	at com.carrotsearch.randomizedtesting.rules.SystemPropertiesRestoreRule$1.evaluate(SystemPropertiesRestoreRule.java:57)
	at org.apache.lucene.util.AbstractBeforeAfterRule$1.evaluate(AbstractBeforeAfterRule.java:45)
	at com.carrotsearch.randomizedtesting.rules.StatementAdapter.evaluate(StatementAdapter.java:36)
	at org.apache.lucene.util.TestRuleStoreClassName$1.evaluate(TestRuleStoreClassName.java:41)
	at com.carrotsearch.randomizedtesting.rules.NoShadowingOrOverridesOnMethodsRule$1.evaluate(NoShadowingOrOverridesOnMethodsRule.java:40)
	at com.carrotsearch.randomizedtesting.rules.NoShadowingOrOverridesOnMethodsRule$1.evaluate(NoShadowingOrOverridesOnMethodsRule.java:40)
	at com.carrotsearch.randomizedtesting.rules.StatementAdapter.evaluate(StatementAdapter.java:36)
	at com.carrotsearch.randomizedtesting.rules.StatementAdapter.evaluate(StatementAdapter.java:36)
	at org.apache.lucene.util.TestRuleAssertionsRequired$1.evaluate(TestRuleAssertionsRequired.java:53)
	at org.apache.lucene.util.TestRuleMarkFailure$1.evaluate(TestRuleMarkFailure.java:47)
	at org.apache.lucene.util.TestRuleIgnoreAfterMaxFailures$1.evaluate(TestRuleIgnoreAfterMaxFailures.java:64)
	at org.apache.lucene.util.TestRuleIgnoreTestSuites$1.evaluate(TestRuleIgnoreTestSuites.java:54)
	at com.carrotsearch.randomizedtesting.rules.StatementAdapter.evaluate(StatementAdapter.java:36)
	at com.carrotsearch.randomizedtesting.ThreadLeakControl$StatementRunner.run(ThreadLeakControl.java:368)
	at java.base/java.lang.Thread.run(Thread.java:835)


FAILED:  org.apache.solr.security.BasicAuthIntegrationTest.testBasicAuth

Error Message:
expected:<401> but was:<400>

Stack Trace:
java.lang.AssertionError: expected:<401> but was:<400>
	at __randomizedtesting.SeedInfo.seed([C55C200D0B21752C:7932561FAF72F656]:0)
	at org.junit.Assert.fail(Assert.java:88)
	at org.junit.Assert.failNotEquals(Assert.java:834)
	at org.junit.Assert.assertEquals(Assert.java:645)
	at org.junit.Assert.assertEquals(Assert.java:631)
	at org.apache.solr.security.BasicAuthIntegrationTest.testBasicAuth(BasicAuthIntegrationTest.java:151)
	at java.base/jdk.internal.reflect.NativeMethodAccessorImpl.invoke0(Native Method)
	at java.base/jdk.internal.reflect.NativeMethodAccessorImpl.invoke(NativeMethodAccessorImpl.java:62)
	at java.base/jdk.internal.reflect.DelegatingMethodAccessorImpl.invoke(DelegatingMethodAccessorImpl.java:43)
	at java.base/java.lang.reflect.Method.invoke(Method.java:567)
	at com.carrotsearch.randomizedtesting.RandomizedRunner.invoke(RandomizedRunner.java:1750)
	at com.carrotsearch.randomizedtesting.RandomizedRunner$8.evaluate(RandomizedRunner.java:938)
	at com.carrotsearch.randomizedtesting.RandomizedRunner$9.evaluate(RandomizedRunner.java:974)
	at com.carrotsearch.randomizedtesting.RandomizedRunner$10.evaluate(RandomizedRunner.java:988)
	at com.carrotsearch.randomizedtesting.rules.SystemPropertiesRestoreRule$1.evaluate(SystemPropertiesRestoreRule.java:57)
	at org.apache.lucene.util.TestRuleSetupTeardownChained$1.evaluate(TestRuleSetupTeardownChained.java:49)
	at org.apache.lucene.util.AbstractBeforeAfterRule$1.evaluate(AbstractBeforeAfterRule.java:45)
	at org.apache.lucene.util.TestRuleThreadAndTestName$1.evaluate(TestRuleThreadAndTestName.java:48)
	at org.apache.lucene.util.TestRuleIgnoreAfterMaxFailures$1.evaluate(TestRuleIgnoreAfterMaxFailures.java:64)
	at org.apache.lucene.util.TestRuleMarkFailure$1.evaluate(TestRuleMarkFailure.java:47)
	at com.carrotsearch.randomizedtesting.rules.StatementAdapter.evaluate(StatementAdapter.java:36)
	at com.carrotsearch.randomizedtesting.ThreadLeakControl$StatementRunner.run(ThreadLeakControl.java:368)
	at com.carrotsearch.randomizedtesting.ThreadLeakControl.forkTimeoutingTask(ThreadLeakControl.java:817)
	at com.carrotsearch.randomizedtesting.ThreadLeakControl$3.evaluate(ThreadLeakControl.java:468)
	at com.carrotsearch.randomizedtesting.RandomizedRunner.runSingleTest(RandomizedRunner.java:947)
	at com.carrotsearch.randomizedtesting.RandomizedRunner$5.evaluate(RandomizedRunner.java:832)
	at com.carrotsearch.randomizedtesting.RandomizedRunner$6.evaluate(RandomizedRunner.java:883)
	at com.carrotsearch.randomizedtesting.RandomizedRunner$7.evaluate(RandomizedRunner.java:894)
	at com.carrotsearch.randomizedtesting.rules.StatementAdapter.evaluate(StatementAdapter.java:36)
	at com.carrotsearch.randomizedtesting.rules.SystemPropertiesRestoreRule$1.evaluate(SystemPropertiesRestoreRule.java:57)
	at org.apache.lucene.util.AbstractBeforeAfterRule$1.evaluate(AbstractBeforeAfterRule.java:45)
	at com.carrotsearch.randomizedtesting.rules.StatementAdapter.evaluate(StatementAdapter.java:36)
	at org.apache.lucene.util.TestRuleStoreClassName$1.evaluate(TestRuleStoreClassName.java:41)
	at com.carrotsearch.randomizedtesting.rules.NoShadowingOrOverridesOnMethodsRule$1.evaluate(NoShadowingOrOverridesOnMethodsRule.java:40)
	at com.carrotsearch.randomizedtesting.rules.NoShadowingOrOverridesOnMethodsRule$1.evaluate(NoShadowingOrOverridesOnMethodsRule.java:40)
	at com.carrotsearch.randomizedtesting.rules.StatementAdapter.evaluate(StatementAdapter.java:36)
	at com.carrotsearch.randomizedtesting.rules.StatementAdapter.evaluate(StatementAdapter.java:36)
	at org.apache.lucene.util.TestRuleAssertionsRequired$1.evaluate(TestRuleAssertionsRequired.java:53)
	at org.apache.lucene.util.TestRuleMarkFailure$1.evaluate(TestRuleMarkFailure.java:47)
	at org.apache.lucene.util.TestRuleIgnoreAfterMaxFailures$1.evaluate(TestRuleIgnoreAfterMaxFailures.java:64)
	at org.apache.lucene.util.TestRuleIgnoreTestSuites$1.evaluate(TestRuleIgnoreTestSuites.java:54)
	at com.carrotsearch.randomizedtesting.rules.StatementAdapter.evaluate(StatementAdapter.java:36)
	at com.carrotsearch.randomizedtesting.ThreadLeakControl$StatementRunner.run(ThreadLeakControl.java:368)
	at java.base/java.lang.Thread.run(Thread.java:835)


FAILED:  org.apache.solr.security.BasicAuthIntegrationTest.testBasicAuth

Error Message:
expected:<401> but was:<400>

Stack Trace:
java.lang.AssertionError: expected:<401> but was:<400>
	at __randomizedtesting.SeedInfo.seed([C55C200D0B21752C:7932561FAF72F656]:0)
	at org.junit.Assert.fail(Assert.java:88)
	at org.junit.Assert.failNotEquals(Assert.java:834)
	at org.junit.Assert.assertEquals(Assert.java:645)
	at org.junit.Assert.assertEquals(Assert.java:631)
	at org.apache.solr.security.BasicAuthIntegrationTest.testBasicAuth(BasicAuthIntegrationTest.java:151)
	at java.base/jdk.internal.reflect.NativeMethodAccessorImpl.invoke0(Native Method)
	at java.base/jdk.internal.reflect.NativeMethodAccessorImpl.invoke(NativeMethodAccessorImpl.java:62)
	at java.base/jdk.internal.reflect.DelegatingMethodAccessorImpl.invoke(DelegatingMethodAccessorImpl.java:43)
	at java.base/java.lang.reflect.Method.invoke(Method.java:567)
	at com.carrotsearch.randomizedtesting.RandomizedRunner.invoke(RandomizedRunner.java:1750)
	at com.carrotsearch.randomizedtesting.RandomizedRunner$8.evaluate(RandomizedRunner.java:938)
	at com.carrotsearch.randomizedtesting.RandomizedRunner$9.evaluate(RandomizedRunner.java:974)
	at com.carrotsearch.randomizedtesting.RandomizedRunner$10.evaluate(RandomizedRunner.java:988)
	at com.carrotsearch.randomizedtesting.rules.SystemPropertiesRestoreRule$1.evaluate(SystemPropertiesRestoreRule.java:57)
	at org.apache.lucene.util.TestRuleSetupTeardownChained$1.evaluate(TestRuleSetupTeardownChained.java:49)
	at org.apache.lucene.util.AbstractBeforeAfterRule$1.evaluate(AbstractBeforeAfterRule.java:45)
	at org.apache.lucene.util.TestRuleThreadAndTestName$1.evaluate(TestRuleThreadAndTestName.java:48)
	at org.apache.lucene.util.TestRuleIgnoreAfterMaxFailures$1.evaluate(TestRuleIgnoreAfterMaxFailures.java:64)
	at org.apache.lucene.util.TestRuleMarkFailure$1.evaluate(TestRuleMarkFailure.java:47)
	at com.carrotsearch.randomizedtesting.rules.StatementAdapter.evaluate(StatementAdapter.java:36)
	at com.carrotsearch.randomizedtesting.ThreadLeakControl$StatementRunner.run(ThreadLeakControl.java:368)
	at com.carrotsearch.randomizedtesting.ThreadLeakControl.forkTimeoutingTask(ThreadLeakControl.java:817)
	at com.carrotsearch.randomizedtesting.ThreadLeakControl$3.evaluate(ThreadLeakControl.java:468)
	at com.carrotsearch.randomizedtesting.RandomizedRunner.runSingleTest(RandomizedRunner.java:947)
	at com.carrotsearch.randomizedtesting.RandomizedRunner$5.evaluate(RandomizedRunner.java:832)
	at com.carrotsearch.randomizedtesting.RandomizedRunner$6.evaluate(RandomizedRunner.java:883)
	at com.carrotsearch.randomizedtesting.RandomizedRunner$7.evaluate(RandomizedRunner.java:894)
	at com.carrotsearch.randomizedtesting.rules.StatementAdapter.evaluate(StatementAdapter.java:36)
	at com.carrotsearch.randomizedtesting.rules.SystemPropertiesRestoreRule$1.evaluate(SystemPropertiesRestoreRule.java:57)
	at org.apache.lucene.util.AbstractBeforeAfterRule$1.evaluate(AbstractBeforeAfterRule.java:45)
	at com.carrotsearch.randomizedtesting.rules.StatementAdapter.evaluate(StatementAdapter.java:36)
	at org.apache.lucene.util.TestRuleStoreClassName$1.evaluate(TestRuleStoreClassName.java:41)
	at com.carrotsearch.randomizedtesting.rules.NoShadowingOrOverridesOnMethodsRule$1.evaluate(NoShadowingOrOverridesOnMethodsRule.java:40)
	at com.carrotsearch.randomizedtesting.rules.NoShadowingOrOverridesOnMethodsRule$1.evaluate(NoShadowingOrOverridesOnMethodsRule.java:40)
	at com.carrotsearch.randomizedtesting.rules.StatementAdapter.evaluate(StatementAdapter.java:36)
	at com.carrotsearch.randomizedtesting.rules.StatementAdapter.evaluate(StatementAdapter.java:36)
	at org.apache.lucene.util.TestRuleAssertionsRequired$1.evaluate(TestRuleAssertionsRequired.java:53)
	at org.apache.lucene.util.TestRuleMarkFailure$1.evaluate(TestRuleMarkFailure.java:47)
	at org.apache.lucene.util.TestRuleIgnoreAfterMaxFailures$1.evaluate(TestRuleIgnoreAfterMaxFailures.java:64)
	at org.apache.lucene.util.TestRuleIgnoreTestSuites$1.evaluate(TestRuleIgnoreTestSuites.java:54)
	at com.carrotsearch.randomizedtesting.rules.StatementAdapter.evaluate(StatementAdapter.java:36)
	at com.carrotsearch.randomizedtesting.ThreadLeakControl$StatementRunner.run(ThreadLeakControl.java:368)
	at java.base/java.lang.Thread.run(Thread.java:835)




Build Log:
[...truncated 13439 lines...]
   [junit4] Suite: org.apache.solr.security.BasicAuthIntegrationTest
   [junit4]   2> Creating dataDir: /home/jenkins/workspace/Lucene-Solr-master-Linux/solr/build/solr-core/test/J2/temp/solr.security.BasicAuthIntegrationTest_C55C200D0B21752C-001/init-core-data-001
   [junit4]   2> 559411 WARN  (SUITE-BasicAuthIntegrationTest-seed#[C55C200D0B21752C]-worker) [     ] o.a.s.SolrTestCaseJ4 startTrackingSearchers: numOpens=11 numCloses=11
   [junit4]   2> 559411 INFO  (SUITE-BasicAuthIntegrationTest-seed#[C55C200D0B21752C]-worker) [     ] o.a.s.SolrTestCaseJ4 Using PointFields (NUMERIC_POINTS_SYSPROP=true) w/NUMERIC_DOCVALUES_SYSPROP=false
   [junit4]   2> 559412 INFO  (SUITE-BasicAuthIntegrationTest-seed#[C55C200D0B21752C]-worker) [     ] o.a.s.SolrTestCaseJ4 Randomized ssl (true) and clientAuth (true) via: @org.apache.solr.util.RandomizeSSL(reason="", value=0.0/0.0, ssl=0.0/0.0, clientAuth=0.0/0.0)
   [junit4]   2> 559412 INFO  (SUITE-BasicAuthIntegrationTest-seed#[C55C200D0B21752C]-worker) [     ] o.a.s.SolrTestCaseJ4 SecureRandom sanity checks: test.solr.allowed.securerandom=null & java.security.egd=file:/dev/./urandom
   [junit4]   2> 559414 INFO  (TEST-BasicAuthIntegrationTest.testBasicAuth-seed#[C55C200D0B21752C]) [     ] o.a.s.SolrTestCaseJ4 ###Starting testBasicAuth
   [junit4]   2> 559414 INFO  (TEST-BasicAuthIntegrationTest.testBasicAuth-seed#[C55C200D0B21752C]) [     ] o.a.s.c.MiniSolrCloudCluster Starting cluster of 3 servers in /home/jenkins/workspace/Lucene-Solr-master-Linux/solr/build/solr-core/test/J2/temp/solr.security.BasicAuthIntegrationTest_C55C200D0B21752C-001/tempDir-001
   [junit4]   2> 559414 INFO  (TEST-BasicAuthIntegrationTest.testBasicAuth-seed#[C55C200D0B21752C]) [     ] o.a.s.c.ZkTestServer STARTING ZK TEST SERVER
   [junit4]   2> 559415 INFO  (ZkTestServer Run Thread) [     ] o.a.s.c.ZkTestServer client port:0.0.0.0/0.0.0.0:0
   [junit4]   2> 559415 INFO  (ZkTestServer Run Thread) [     ] o.a.s.c.ZkTestServer Starting server
   [junit4]   2> 559515 INFO  (TEST-BasicAuthIntegrationTest.testBasicAuth-seed#[C55C200D0B21752C]) [     ] o.a.s.c.ZkTestServer start zk server on port:39411
   [junit4]   2> 559515 INFO  (TEST-BasicAuthIntegrationTest.testBasicAuth-seed#[C55C200D0B21752C]) [     ] o.a.s.c.ZkTestServer parse host and port list: 127.0.0.1:39411
   [junit4]   2> 559515 INFO  (TEST-BasicAuthIntegrationTest.testBasicAuth-seed#[C55C200D0B21752C]) [     ] o.a.s.c.ZkTestServer connecting to 127.0.0.1 39411
   [junit4]   2> 559516 INFO  (TEST-BasicAuthIntegrationTest.testBasicAuth-seed#[C55C200D0B21752C]) [     ] o.a.s.c.c.ConnectionManager Waiting for client to connect to ZooKeeper
   [junit4]   2> 559518 INFO  (zkConnectionManagerCallback-6692-thread-1) [     ] o.a.s.c.c.ConnectionManager zkClient has connected
   [junit4]   2> 559518 INFO  (TEST-BasicAuthIntegrationTest.testBasicAuth-seed#[C55C200D0B21752C]) [     ] o.a.s.c.c.ConnectionManager Client is connected to ZooKeeper
   [junit4]   2> 559519 INFO  (TEST-BasicAuthIntegrationTest.testBasicAuth-seed#[C55C200D0B21752C]) [     ] o.a.s.c.c.ConnectionManager Waiting for client to connect to ZooKeeper
   [junit4]   2> 559520 INFO  (zkConnectionManagerCallback-6694-thread-1) [     ] o.a.s.c.c.ConnectionManager zkClient has connected
   [junit4]   2> 559520 INFO  (TEST-BasicAuthIntegrationTest.testBasicAuth-seed#[C55C200D0B21752C]) [     ] o.a.s.c.c.ConnectionManager Client is connected to ZooKeeper
   [junit4]   2> 559520 INFO  (TEST-BasicAuthIntegrationTest.testBasicAuth-seed#[C55C200D0B21752C]) [     ] o.a.s.c.c.ConnectionManager Waiting for client to connect to ZooKeeper
   [junit4]   2> 559521 INFO  (zkConnectionManagerCallback-6696-thread-1) [     ] o.a.s.c.c.ConnectionManager zkClient has connected
   [junit4]   2> 559521 INFO  (TEST-BasicAuthIntegrationTest.testBasicAuth-seed#[C55C200D0B21752C]) [     ] o.a.s.c.c.ConnectionManager Client is connected to ZooKeeper
   [junit4]   2> 559625 WARN  (jetty-launcher-6697-thread-3) [     ] o.e.j.s.AbstractConnector Ignoring deprecated socket close linger time
   [junit4]   2> 559625 WARN  (jetty-launcher-6697-thread-2) [     ] o.e.j.s.AbstractConnector Ignoring deprecated socket close linger time
   [junit4]   2> 559625 WARN  (jetty-launcher-6697-thread-1) [     ] o.e.j.s.AbstractConnector Ignoring deprecated socket close linger time
   [junit4]   2> 559625 INFO  (jetty-launcher-6697-thread-3) [     ] o.a.s.c.s.e.JettySolrRunner Start Jetty (original configured port=0)
   [junit4]   2> 559625 INFO  (jetty-launcher-6697-thread-2) [     ] o.a.s.c.s.e.JettySolrRunner Start Jetty (original configured port=0)
   [junit4]   2> 559625 INFO  (jetty-launcher-6697-thread-1) [     ] o.a.s.c.s.e.JettySolrRunner Start Jetty (original configured port=0)
   [junit4]   2> 559625 INFO  (jetty-launcher-6697-thread-3) [     ] o.a.s.c.s.e.JettySolrRunner Trying to start Jetty on port 0 try number 1 ...
   [junit4]   2> 559625 INFO  (jetty-launcher-6697-thread-2) [     ] o.a.s.c.s.e.JettySolrRunner Trying to start Jetty on port 0 try number 1 ...
   [junit4]   2> 559625 INFO  (jetty-launcher-6697-thread-1) [     ] o.a.s.c.s.e.JettySolrRunner Trying to start Jetty on port 0 try number 1 ...
   [junit4]   2> 559625 INFO  (jetty-launcher-6697-thread-3) [     ] o.e.j.s.Server jetty-9.4.19.v20190610; built: 2019-06-10T16:30:51.723Z; git: afcf563148970e98786327af5e07c261fda175d3; jvm 12.0.1+12
   [junit4]   2> 559625 INFO  (jetty-launcher-6697-thread-1) [     ] o.e.j.s.Server jetty-9.4.19.v20190610; built: 2019-06-10T16:30:51.723Z; git: afcf563148970e98786327af5e07c261fda175d3; jvm 12.0.1+12
   [junit4]   2> 559625 INFO  (jetty-launcher-6697-thread-2) [     ] o.e.j.s.Server jetty-9.4.19.v20190610; built: 2019-06-10T16:30:51.723Z; git: afcf563148970e98786327af5e07c261fda175d3; jvm 12.0.1+12
   [junit4]   2> 559627 INFO  (jetty-launcher-6697-thread-2) [     ] o.e.j.s.session DefaultSessionIdManager workerName=node0
   [junit4]   2> 559627 INFO  (jetty-launcher-6697-thread-2) [     ] o.e.j.s.session No SessionScavenger set, using defaults
   [junit4]   2> 559627 INFO  (jetty-launcher-6697-thread-2) [     ] o.e.j.s.session node0 Scavenging every 600000ms
   [junit4]   2> 559627 INFO  (jetty-launcher-6697-thread-2) [     ] o.e.j.s.h.ContextHandler Started o.e.j.s.ServletContextHandler@6433c9aa{/solr,null,AVAILABLE}
   [junit4]   2> 559627 INFO  (jetty-launcher-6697-thread-1) [     ] o.e.j.s.session DefaultSessionIdManager workerName=node0
   [junit4]   2> 559627 INFO  (jetty-launcher-6697-thread-1) [     ] o.e.j.s.session No SessionScavenger set, using defaults
   [junit4]   2> 559627 INFO  (jetty-launcher-6697-thread-1) [     ] o.e.j.s.session node0 Scavenging every 600000ms
   [junit4]   2> 559627 INFO  (jetty-launcher-6697-thread-3) [     ] o.e.j.s.session DefaultSessionIdManager workerName=node0
   [junit4]   2> 559627 INFO  (jetty-launcher-6697-thread-3) [     ] o.e.j.s.session No SessionScavenger set, using defaults
   [junit4]   2> 559627 INFO  (jetty-launcher-6697-thread-3) [     ] o.e.j.s.session node0 Scavenging every 600000ms
   [junit4]   2> 559627 INFO  (jetty-launcher-6697-thread-1) [     ] o.e.j.s.h.ContextHandler Started o.e.j.s.ServletContextHandler@6ac8129a{/solr,null,AVAILABLE}
   [junit4]   2> 559627 INFO  (jetty-launcher-6697-thread-2) [     ] o.e.j.s.AbstractConnector Started ServerConnector@3115bc71{ssl,[ssl, alpn, http/1.1, h2]}{127.0.0.1:?????}
   [junit4]   2> 559627 INFO  (jetty-launcher-6697-thread-2) [     ] o.e.j.s.Server Started @??????ms
   [junit4]   2> 559627 INFO  (jetty-launcher-6697-thread-2) [     ] o.a.s.c.s.e.JettySolrRunner Jetty properties: {hostContext=/solr, hostPort=44971}
   [junit4]   2> 559627 ERROR (jetty-launcher-6697-thread-2) [     ] o.a.s.u.StartupLoggingUtils Missing Java Option solr.log.dir. Logging may be missing or incomplete.
   [junit4]   2> 559627 INFO  (jetty-launcher-6697-thread-2) [     ] o.a.s.s.SolrDispatchFilter Using logger factory org.apache.logging.slf4j.Log4jLoggerFactory
   [junit4]   2> 559627 INFO  (jetty-launcher-6697-thread-2) [     ] o.a.s.s.SolrDispatchFilter  ___      _       Welcome to Apache Solr? version 9.0.0
   [junit4]   2> 559627 INFO  (jetty-launcher-6697-thread-2) [     ] o.a.s.s.SolrDispatchFilter / __| ___| |_ _   Starting in cloud mode on port null
   [junit4]   2> 559627 INFO  (jetty-launcher-6697-thread-2) [     ] o.a.s.s.SolrDispatchFilter \__ \/ _ \ | '_|  Install dir: null
   [junit4]   2> 559627 INFO  (jetty-launcher-6697-thread-2) [     ] o.a.s.s.SolrDispatchFilter |___/\___/_|_|    Start time: 2019-07-22T10:17:35.499990Z
   [junit4]   2> 559628 INFO  (jetty-launcher-6697-thread-1) [     ] o.e.j.s.AbstractConnector Started ServerConnector@1122af05{ssl,[ssl, alpn, http/1.1, h2]}{127.0.0.1:?????}
   [junit4]   2> 559628 INFO  (jetty-launcher-6697-thread-1) [     ] o.e.j.s.Server Started @??????ms
   [junit4]   2> 559628 INFO  (jetty-launcher-6697-thread-1) [     ] o.a.s.c.s.e.JettySolrRunner Jetty properties: {hostContext=/solr, hostPort=38619}
   [junit4]   2> 559628 ERROR (jetty-launcher-6697-thread-1) [     ] o.a.s.u.StartupLoggingUtils Missing Java Option solr.log.dir. Logging may be missing or incomplete.
   [junit4]   2> 559628 INFO  (jetty-launcher-6697-thread-1) [     ] o.a.s.s.SolrDispatchFilter Using logger factory org.apache.logging.slf4j.Log4jLoggerFactory
   [junit4]   2> 559628 INFO  (jetty-launcher-6697-thread-1) [     ] o.a.s.s.SolrDispatchFilter  ___      _       Welcome to Apache Solr? version 9.0.0
   [junit4]   2> 559628 INFO  (jetty-launcher-6697-thread-1) [     ] o.a.s.s.SolrDispatchFilter / __| ___| |_ _   Starting in cloud mode on port null
   [junit4]   2> 559628 INFO  (jetty-launcher-6697-thread-1) [     ] o.a.s.s.SolrDispatchFilter \__ \/ _ \ | '_|  Install dir: null
   [junit4]   2> 559628 INFO  (jetty-launcher-6697-thread-1) [     ] o.a.s.s.SolrDispatchFilter |___/\___/_|_|    Start time: 2019-07-22T10:17:35.500334Z
   [junit4]   2> 559628 INFO  (jetty-launcher-6697-thread-3) [     ] o.e.j.s.h.ContextHandler Started o.e.j.s.ServletContextHandler@219769bb{/solr,null,AVAILABLE}
   [junit4]   2> 559628 INFO  (jetty-launcher-6697-thread-2) [     ] o.a.s.c.c.ConnectionManager Waiting for client to connect to ZooKeeper
   [junit4]   2> 559629 INFO  (jetty-launcher-6697-thread-3) [     ] o.e.j.s.AbstractConnector Started ServerConnector@47a44247{ssl,[ssl, alpn, http/1.1, h2]}{127.0.0.1:?????}
   [junit4]   2> 559629 INFO  (jetty-launcher-6697-thread-3) [     ] o.e.j.s.Server Started @??????ms
   [junit4]   2> 559629 INFO  (jetty-launcher-6697-thread-3) [     ] o.a.s.c.s.e.JettySolrRunner Jetty properties: {hostContext=/solr, hostPort=34039}
   [junit4]   2> 559629 INFO  (jetty-launcher-6697-thread-1) [     ] o.a.s.c.c.ConnectionManager Waiting for client to connect to ZooKeeper
   [junit4]   2> 559629 INFO  (zkConnectionManagerCallback-6699-thread-1) [     ] o.a.s.c.c.ConnectionManager zkClient has connected
   [junit4]   2> 559629 ERROR (jetty-launcher-6697-thread-3) [     ] o.a.s.u.StartupLoggingUtils Missing Java Option solr.log.dir. Logging may be missing or incomplete.
   [junit4]   2> 559629 INFO  (jetty-launcher-6697-thread-2) [     ] o.a.s.c.c.ConnectionManager Client is connected to ZooKeeper
   [junit4]   2> 559629 INFO  (jetty-launcher-6697-thread-3) [     ] o.a.s.s.SolrDispatchFilter Using logger factory org.apache.logging.slf4j.Log4jLoggerFactory
   [junit4]   2> 559629 INFO  (jetty-launcher-6697-thread-3) [     ] o.a.s.s.SolrDispatchFilter  ___      _       Welcome to Apache Solr? version 9.0.0
   [junit4]   2> 559629 INFO  (jetty-launcher-6697-thread-3) [     ] o.a.s.s.SolrDispatchFilter / __| ___| |_ _   Starting in cloud mode on port null
   [junit4]   2> 559629 INFO  (jetty-launcher-6697-thread-3) [     ] o.a.s.s.SolrDispatchFilter \__ \/ _ \ | '_|  Install dir: null
   [junit4]   2> 559629 INFO  (jetty-launcher-6697-thread-3) [     ] o.a.s.s.SolrDispatchFilter |___/\___/_|_|    Start time: 2019-07-22T10:17:35.501242Z
   [junit4]   2> 559629 INFO  (zkConnectionManagerCallback-6701-thread-1) [     ] o.a.s.c.c.ConnectionManager zkClient has connected
   [junit4]   2> 559629 INFO  (jetty-launcher-6697-thread-1) [     ] o.a.s.c.c.ConnectionManager Client is connected to ZooKeeper
   [junit4]   2> 559629 INFO  (jetty-launcher-6697-thread-2) [     ] o.a.s.s.SolrDispatchFilter solr.xml found in ZooKeeper. Loading...
   [junit4]   2> 559629 INFO  (jetty-launcher-6697-thread-1) [     ] o.a.s.s.SolrDispatchFilter solr.xml found in ZooKeeper. Loading...
   [junit4]   2> 559629 INFO  (jetty-launcher-6697-thread-3) [     ] o.a.s.c.c.ConnectionManager Waiting for client to connect to ZooKeeper
   [junit4]   2> 559630 INFO  (zkConnectionManagerCallback-6703-thread-1) [     ] o.a.s.c.c.ConnectionManager zkClient has connected
   [junit4]   2> 559630 INFO  (jetty-launcher-6697-thread-3) [     ] o.a.s.c.c.ConnectionManager Client is connected to ZooKeeper
   [junit4]   2> 559630 INFO  (jetty-launcher-6697-thread-3) [     ] o.a.s.s.SolrDispatchFilter solr.xml found in ZooKeeper. Loading...
   [junit4]   2> 559787 INFO  (jetty-launcher-6697-thread-2) [     ] o.a.s.h.c.HttpShardHandlerFactory Host whitelist initialized: WhitelistHostChecker [whitelistHosts=null, whitelistHostCheckingEnabled=true]
   [junit4]   2> 559788 WARN  (jetty-launcher-6697-thread-2) [     ] o.e.j.u.s.S.config Trusting all certificates configured for Client@77485489[provider=null,keyStore=null,trustStore=null]
   [junit4]   2> 559788 WARN  (jetty-launcher-6697-thread-2) [     ] o.e.j.u.s.S.config No Client EndPointIdentificationAlgorithm configured for Client@77485489[provider=null,keyStore=null,trustStore=null]
   [junit4]   2> 559790 WARN  (jetty-launcher-6697-thread-2) [     ] o.e.j.u.s.S.config Trusting all certificates configured for Client@576bef7f[provider=null,keyStore=null,trustStore=null]
   [junit4]   2> 559790 WARN  (jetty-launcher-6697-thread-2) [     ] o.e.j.u.s.S.config No Client EndPointIdentificationAlgorithm configured for Client@576bef7f[provider=null,keyStore=null,trustStore=null]
   [junit4]   2> 559791 INFO  (jetty-launcher-6697-thread-2) [     ] o.a.s.c.ZkContainer Zookeeper client=127.0.0.1:39411/solr
   [junit4]   2> 559791 INFO  (jetty-launcher-6697-thread-2) [     ] o.a.s.c.c.ConnectionManager Waiting for client to connect to ZooKeeper
   [junit4]   2> 559792 INFO  (zkConnectionManagerCallback-6710-thread-1) [     ] o.a.s.c.c.ConnectionManager zkClient has connected
   [junit4]   2> 559792 INFO  (jetty-launcher-6697-thread-2) [     ] o.a.s.c.c.ConnectionManager Client is connected to ZooKeeper
   [junit4]   2> 559994 INFO  (jetty-launcher-6697-thread-3) [     ] o.a.s.h.c.HttpShardHandlerFactory Host whitelist initialized: WhitelistHostChecker [whitelistHosts=null, whitelistHostCheckingEnabled=true]
   [junit4]   2> 559995 WARN  (jetty-launcher-6697-thread-3) [     ] o.e.j.u.s.S.config Trusting all certificates configured for Client@52f3f3aa[provider=null,keyStore=null,trustStore=null]
   [junit4]   2> 559995 WARN  (jetty-launcher-6697-thread-3) [     ] o.e.j.u.s.S.config No Client EndPointIdentificationAlgorithm configured for Client@52f3f3aa[provider=null,keyStore=null,trustStore=null]
   [junit4]   2> 560006 WARN  (jetty-launcher-6697-thread-3) [     ] o.e.j.u.s.S.config Trusting all certificates configured for Client@79cb3a6b[provider=null,keyStore=null,trustStore=null]
   [junit4]   2> 560006 WARN  (jetty-launcher-6697-thread-3) [     ] o.e.j.u.s.S.config No Client EndPointIdentificationAlgorithm configured for Client@79cb3a6b[provider=null,keyStore=null,trustStore=null]
   [junit4]   2> 560007 INFO  (jetty-launcher-6697-thread-3) [     ] o.a.s.c.ZkContainer Zookeeper client=127.0.0.1:39411/solr
   [junit4]   2> 560009 INFO  (jetty-launcher-6697-thread-3) [     ] o.a.s.c.c.ConnectionManager Waiting for client to connect to ZooKeeper
   [junit4]   2> 560009 INFO  (zkConnectionManagerCallback-6718-thread-1) [     ] o.a.s.c.c.ConnectionManager zkClient has connected
   [junit4]   2> 560009 INFO  (jetty-launcher-6697-thread-3) [     ] o.a.s.c.c.ConnectionManager Client is connected to ZooKeeper
   [junit4]   2> 560033 INFO  (jetty-launcher-6697-thread-2) [n:127.0.0.1:44971_solr     ] o.a.s.c.c.ConnectionManager Waiting for client to connect to ZooKeeper
   [junit4]   2> 560033 INFO  (zkConnectionManagerCallback-6720-thread-1) [     ] o.a.s.c.c.ConnectionManager zkClient has connected
   [junit4]   2> 560033 INFO  (jetty-launcher-6697-thread-2) [n:127.0.0.1:44971_solr     ] o.a.s.c.c.ConnectionManager Client is connected to ZooKeeper
   [junit4]   2> 560067 INFO  (jetty-launcher-6697-thread-2) [n:127.0.0.1:44971_solr     ] o.a.s.c.OverseerElectionContext I am going to be the leader 127.0.0.1:44971_solr
   [junit4]   2> 560067 INFO  (jetty-launcher-6697-thread-2) [n:127.0.0.1:44971_solr     ] o.a.s.c.Overseer Overseer (id=72208617002958856-127.0.0.1:44971_solr-n_0000000000) starting
   [junit4]   2> 560070 INFO  (jetty-launcher-6697-thread-2) [n:127.0.0.1:44971_solr     ] o.a.s.c.c.ConnectionManager Waiting for client to connect to ZooKeeper
   [junit4]   2> 560072 INFO  (zkConnectionManagerCallback-6727-thread-1) [     ] o.a.s.c.c.ConnectionManager zkClient has connected
   [junit4]   2> 560072 INFO  (jetty-launcher-6697-thread-2) [n:127.0.0.1:44971_solr     ] o.a.s.c.c.ConnectionManager Client is connected to ZooKeeper
   [junit4]   2> 560073 INFO  (jetty-launcher-6697-thread-2) [n:127.0.0.1:44971_solr     ] o.a.s.c.s.i.ZkClientClusterStateProvider Cluster at 127.0.0.1:39411/solr ready
   [junit4]   2> 560074 INFO  (OverseerStateUpdate-72208617002958856-127.0.0.1:44971_solr-n_0000000000) [n:127.0.0.1:44971_solr     ] o.a.s.c.Overseer Starting to work on the main queue : 127.0.0.1:44971_solr
   [junit4]   2> 560076 INFO  (jetty-launcher-6697-thread-2) [n:127.0.0.1:44971_solr     ] o.a.s.c.ZkController Register node as live in ZooKeeper:/live_nodes/127.0.0.1:44971_solr
   [junit4]   2> 560077 INFO  (jetty-launcher-6697-thread-2) [n:127.0.0.1:44971_solr     ] o.a.s.c.LibListener clusterprops.json changed , version 0
   [junit4]   2> 560080 INFO  (zkCallback-6726-thread-1) [     ] o.a.s.c.c.ZkStateReader Updated live nodes from ZooKeeper... (0) -> (1)
   [junit4]   2> 560083 INFO  (zkCallback-6719-thread-1) [     ] o.a.s.c.c.ZkStateReader Updated live nodes from ZooKeeper... (0) -> (1)
   [junit4]   2> 560092 INFO  (jetty-launcher-6697-thread-2) [n:127.0.0.1:44971_solr     ] o.a.s.h.a.MetricsHistoryHandler No .system collection, keeping metrics history in memory.
   [junit4]   2> 560103 INFO  (jetty-launcher-6697-thread-2) [n:127.0.0.1:44971_solr     ] o.a.s.m.r.SolrJmxReporter JMX monitoring for 'solr_44971.solr.node' (registry 'solr.node') enabled at server: com.sun.jmx.mbeanserver.JmxMBeanServer@5d216e67
   [junit4]   2> 560109 INFO  (jetty-launcher-6697-thread-2) [n:127.0.0.1:44971_solr     ] o.a.s.m.r.SolrJmxReporter JMX monitoring for 'solr_44971.solr.jvm' (registry 'solr.jvm') enabled at server: com.sun.jmx.mbeanserver.JmxMBeanServer@5d216e67
   [junit4]   2> 560109 INFO  (jetty-launcher-6697-thread-2) [n:127.0.0.1:44971_solr     ] o.a.s.m.r.SolrJmxReporter JMX monitoring for 'solr_44971.solr.jetty' (registry 'solr.jetty') enabled at server: com.sun.jmx.mbeanserver.JmxMBeanServer@5d216e67
   [junit4]   2> 560109 INFO  (jetty-launcher-6697-thread-2) [n:127.0.0.1:44971_solr     ] o.a.s.c.CorePropertiesLocator Found 0 core definitions underneath /home/jenkins/workspace/Lucene-Solr-master-Linux/solr/build/solr-core/test/J2/temp/solr.security.BasicAuthIntegrationTest_C55C200D0B21752C-001/tempDir-001/node2/.
   [junit4]   2> 560114 INFO  (jetty-launcher-6697-thread-1) [     ] o.a.s.h.c.HttpShardHandlerFactory Host whitelist initialized: WhitelistHostChecker [whitelistHosts=null, whitelistHostCheckingEnabled=true]
   [junit4]   2> 560115 WARN  (jetty-launcher-6697-thread-1) [     ] o.e.j.u.s.S.config Trusting all certificates configured for Client@1da5ec61[provider=null,keyStore=null,trustStore=null]
   [junit4]   2> 560115 WARN  (jetty-launcher-6697-thread-1) [     ] o.e.j.u.s.S.config No Client EndPointIdentificationAlgorithm configured for Client@1da5ec61[provider=null,keyStore=null,trustStore=null]
   [junit4]   2> 560117 WARN  (jetty-launcher-6697-thread-1) [     ] o.e.j.u.s.S.config Trusting all certificates configured for Client@67ddc949[provider=null,keyStore=null,trustStore=null]
   [junit4]   2> 560117 WARN  (jetty-launcher-6697-thread-1) [     ] o.e.j.u.s.S.config No Client EndPointIdentificationAlgorithm configured for Client@67ddc949[provider=null,keyStore=null,trustStore=null]
   [junit4]   2> 560118 INFO  (jetty-launcher-6697-thread-1) [     ] o.a.s.c.ZkContainer Zookeeper client=127.0.0.1:39411/solr
   [junit4]   2> 560122 INFO  (jetty-launcher-6697-thread-1) [     ] o.a.s.c.c.ConnectionManager Waiting for client to connect to ZooKeeper
   [junit4]   2> 560122 INFO  (zkConnectionManagerCallback-6734-thread-1) [     ] o.a.s.c.c.ConnectionManager zkClient has connected
   [junit4]   2> 560122 INFO  (jetty-launcher-6697-thread-1) [     ] o.a.s.c.c.ConnectionManager Client is connected to ZooKeeper
   [junit4]   2> 560133 INFO  (jetty-launcher-6697-thread-3) [n:127.0.0.1:34039_solr     ] o.a.s.c.c.ConnectionManager Waiting for client to connect to ZooKeeper
   [junit4]   2> 560134 INFO  (zkConnectionManagerCallback-6736-thread-1) [     ] o.a.s.c.c.ConnectionManager zkClient has connected
   [junit4]   2> 560134 INFO  (jetty-launcher-6697-thread-3) [n:127.0.0.1:34039_solr     ] o.a.s.c.c.ConnectionManager Client is connected to ZooKeeper
   [junit4]   2> 560136 INFO  (jetty-launcher-6697-thread-3) [n:127.0.0.1:34039_solr     ] o.a.s.c.c.ZkStateReader Updated live nodes from ZooKeeper... (0) -> (1)
   [junit4]   2> 560138 INFO  (jetty-launcher-6697-thread-3) [n:127.0.0.1:34039_solr     ] o.a.s.c.ZkController Publish node=127.0.0.1:34039_solr as DOWN
   [junit4]   2> 560138 INFO  (jetty-launcher-6697-thread-3) [n:127.0.0.1:34039_solr     ] o.a.s.c.TransientSolrCoreCacheDefault Allocating transient cache for 2147483647 transient cores
   [junit4]   2> 560138 INFO  (jetty-launcher-6697-thread-3) [n:127.0.0.1:34039_solr     ] o.a.s.c.ZkController Register node as live in ZooKeeper:/live_nodes/127.0.0.1:34039_solr
   [junit4]   2> 560139 INFO  (zkCallback-6719-thread-1) [     ] o.a.s.c.c.ZkStateReader Updated live nodes from ZooKeeper... (1) -> (2)
   [junit4]   2> 560139 INFO  (zkCallback-6726-thread-1) [     ] o.a.s.c.c.ZkStateReader Updated live nodes from ZooKeeper... (1) -> (2)
   [junit4]   2> 560139 INFO  (zkCallback-6735-thread-1) [     ] o.a.s.c.c.ZkStateReader Updated live nodes from ZooKeeper... (1) -> (2)
   [junit4]   2> 560140 INFO  (jetty-launcher-6697-thread-3) [n:127.0.0.1:34039_solr     ] o.a.s.c.c.ConnectionManager Waiting for client to connect to ZooKeeper
   [junit4]   2> 560142 INFO  (zkConnectionManagerCallback-6743-thread-1) [     ] o.a.s.c.c.ConnectionManager zkClient has connected
   [junit4]   2> 560142 INFO  (jetty-launcher-6697-thread-3) [n:127.0.0.1:34039_solr     ] o.a.s.c.c.ConnectionManager Client is connected to ZooKeeper
   [junit4]   2> 560142 INFO  (jetty-launcher-6697-thread-3) [n:127.0.0.1:34039_solr     ] o.a.s.c.c.ZkStateReader Updated live nodes from ZooKeeper... (0) -> (2)
   [junit4]   2> 560143 INFO  (jetty-launcher-6697-thread-3) [n:127.0.0.1:34039_solr     ] o.a.s.c.s.i.ZkClientClusterStateProvider Cluster at 127.0.0.1:39411/solr ready
   [junit4]   2> 560143 INFO  (jetty-launcher-6697-thread-3) [n:127.0.0.1:34039_solr     ] o.a.s.c.LibListener clusterprops.json changed , version 0
   [junit4]   2> 560152 INFO  (jetty-launcher-6697-thread-3) [n:127.0.0.1:34039_solr     ] o.a.s.h.a.MetricsHistoryHandler No .system collection, keeping metrics history in memory.
   [junit4]   2> 560163 INFO  (jetty-launcher-6697-thread-3) [n:127.0.0.1:34039_solr     ] o.a.s.m.r.SolrJmxReporter JMX monitoring for 'solr_34039.solr.node' (registry 'solr.node') enabled at server: com.sun.jmx.mbeanserver.JmxMBeanServer@5d216e67
   [junit4]   2> 560169 INFO  (jetty-launcher-6697-thread-3) [n:127.0.0.1:34039_solr     ] o.a.s.m.r.SolrJmxReporter JMX monitoring for 'solr_34039.solr.jvm' (registry 'solr.jvm') enabled at server: com.sun.jmx.mbeanserver.JmxMBeanServer@5d216e67
   [junit4]   2> 560169 INFO  (jetty-launcher-6697-thread-3) [n:127.0.0.1:34039_solr     ] o.a.s.m.r.SolrJmxReporter JMX monitoring for 'solr_34039.solr.jetty' (registry 'solr.jetty') enabled at server: com.sun.jmx.mbeanserver.JmxMBeanServer@5d216e67
   [junit4]   2> 560170 INFO  (jetty-launcher-6697-thread-3) [n:127.0.0.1:34039_solr     ] o.a.s.c.CorePropertiesLocator Found 0 core definitions underneath /home/jenkins/workspace/Lucene-Solr-master-Linux/solr/build/solr-core/test/J2/temp/solr.security.BasicAuthIntegrationTest_C55C200D0B21752C-001/tempDir-001/node3/.
   [junit4]   2> 560233 INFO  (jetty-launcher-6697-thread-1) [n:127.0.0.1:38619_solr     ] o.a.s.c.c.ConnectionManager Waiting for client to connect to ZooKeeper
   [junit4]   2> 560234 INFO  (zkConnectionManagerCallback-6746-thread-1) [     ] o.a.s.c.c.ConnectionManager zkClient has connected
   [junit4]   2> 560234 INFO  (jetty-launcher-6697-thread-1) [n:127.0.0.1:38619_solr     ] o.a.s.c.c.ConnectionManager Client is connected to ZooKeeper
   [junit4]   2> 560236 INFO  (jetty-launcher-6697-thread-1) [n:127.0.0.1:38619_solr     ] o.a.s.c.c.ZkStateReader Updated live nodes from ZooKeeper... (0) -> (2)
   [junit4]   2> 560238 INFO  (jetty-launcher-6697-thread-1) [n:127.0.0.1:38619_solr     ] o.a.s.c.ZkController Publish node=127.0.0.1:38619_solr as DOWN
   [junit4]   2> 560238 INFO  (jetty-launcher-6697-thread-1) [n:127.0.0.1:38619_solr     ] o.a.s.c.TransientSolrCoreCacheDefault Allocating transient cache for 2147483647 transient cores
   [junit4]   2> 560238 INFO  (jetty-launcher-6697-thread-1) [n:127.0.0.1:38619_solr     ] o.a.s.c.ZkController Register node as live in ZooKeeper:/live_nodes/127.0.0.1:38619_solr
   [junit4]   2> 560238 INFO  (zkCallback-6735-thread-1) [     ] o.a.s.c.c.ZkStateReader Updated live nodes from ZooKeeper... (2) -> (3)
   [junit4]   2> 560238 INFO  (zkCallback-6726-thread-1) [     ] o.a.s.c.c.ZkStateReader Updated live nodes from ZooKeeper... (2) -> (3)
   [junit4]   2> 560238 INFO  (zkCallback-6719-thread-1) [     ] o.a.s.c.c.ZkStateReader Updated live nodes from ZooKeeper... (2) -> (3)
   [junit4]   2> 560238 INFO  (zkCallback-6745-thread-1) [     ] o.a.s.c.c.ZkStateReader Updated live nodes from ZooKeeper... (2) -> (3)
   [junit4]   2> 560239 INFO  (zkCallback-6742-thread-1) [     ] o.a.s.c.c.ZkStateReader Updated live nodes from ZooKeeper... (2) -> (3)
   [junit4]   2> 560239 INFO  (jetty-launcher-6697-thread-1) [n:127.0.0.1:38619_solr     ] o.a.s.c.c.ConnectionManager Waiting for client to connect to ZooKeeper
   [junit4]   2> 560239 INFO  (zkConnectionManagerCallback-6753-thread-1) [     ] o.a.s.c.c.ConnectionManager zkClient has connected
   [junit4]   2> 560239 INFO  (jetty-launcher-6697-thread-1) [n:127.0.0.1:38619_solr     ] o.a.s.c.c.ConnectionManager Client is connected to ZooKeeper
   [junit4]   2> 560240 INFO  (jetty-launcher-6697-thread-1) [n:127.0.0.1:38619_solr     ] o.a.s.c.c.ZkStateReader Updated live nodes from ZooKeeper... (0) -> (3)
   [junit4]   2> 560240 INFO  (jetty-launcher-6697-thread-1) [n:127.0.0.1:38619_solr     ] o.a.s.c.s.i.ZkClientClusterStateProvider Cluster at 127.0.0.1:39411/solr ready
   [junit4]   2> 560241 INFO  (jetty-launcher-6697-thread-1) [n:127.0.0.1:38619_solr     ] o.a.s.c.LibListener clusterprops.json changed , version 0
   [junit4]   2> 560249 INFO  (jetty-launcher-6697-thread-1) [n:127.0.0.1:38619_solr     ] o.a.s.h.a.MetricsHistoryHandler No .system collection, keeping metrics history in memory.
   [junit4]   2> 560264 INFO  (jetty-launcher-6697-thread-1) [n:127.0.0.1:38619_solr     ] o.a.s.m.r.SolrJmxReporter JMX monitoring for 'solr_38619.solr.node' (registry 'solr.node') enabled at server: com.sun.jmx.mbeanserver.JmxMBeanServer@5d216e67
   [junit4]   2> 560273 INFO  (jetty-launcher-6697-thread-1) [n:127.0.0.1:38619_solr     ] o.a.s.m.r.SolrJmxReporter JMX monitoring for 'solr_38619.solr.jvm' (registry 'solr.jvm') enabled at server: com.sun.jmx.mbeanserver.JmxMBeanServer@5d216e67
   [junit4]   2> 560274 INFO  (jetty-launcher-6697-thread-1) [n:127.0.0.1:38619_solr     ] o.a.s.m.r.SolrJmxReporter JMX monitoring for 'solr_38619.solr.jetty' (registry 'solr.jetty') enabled at server: com.sun.jmx.mbeanserver.JmxMBeanServer@5d216e67
   [junit4]   2> 560274 INFO  (jetty-launcher-6697-thread-1) [n:127.0.0.1:38619_solr     ] o.a.s.c.CorePropertiesLocator Found 0 core definitions underneath /home/jenkins/workspace/Lucene-Solr-master-Linux/solr/build/solr-core/test/J2/temp/solr.security.BasicAuthIntegrationTest_C55C200D0B21752C-001/tempDir-001/node1/.
   [junit4]   2> 560329 INFO  (TEST-BasicAuthIntegrationTest.testBasicAuth-seed#[C55C200D0B21752C]) [     ] o.a.s.c.c.ConnectionManager Waiting for client to connect to ZooKeeper
   [junit4]   2> 560332 INFO  (zkConnectionManagerCallback-6759-thread-1) [     ] o.a.s.c.c.ConnectionManager zkClient has connected
   [junit4]   2> 560332 INFO  (TEST-BasicAuthIntegrationTest.testBasicAuth-seed#[C55C200D0B21752C]) [     ] o.a.s.c.c.ConnectionManager Client is connected to ZooKeeper
   [junit4]   2> 560333 INFO  (TEST-BasicAuthIntegrationTest.testBasicAuth-seed#[C55C200D0B21752C]) [     ] o.a.s.c.c.ZkStateReader Updated live nodes from ZooKeeper... (0) -> (3)
   [junit4]   2> 560334 INFO  (TEST-BasicAuthIntegrationTest.testBasicAuth-seed#[C55C200D0B21752C]) [     ] o.a.s.c.s.i.ZkClientClusterStateProvider Cluster at 127.0.0.1:39411/solr ready
   [junit4]   2> 560356 INFO  (qtp140424967-17229) [n:127.0.0.1:34039_solr     ] o.a.s.h.a.CollectionsHandler Invoked Collection Action :create with params collection.configName=conf&name=authCollection&nrtReplicas=1&action=CREATE&numShards=3&wt=javabin&version=2 and sendToOCPQueue=true
   [junit4]   2> 560359 INFO  (OverseerThreadFactory-4715-thread-1-processing-n:127.0.0.1:44971_solr) [n:127.0.0.1:44971_solr     ] o.a.s.c.a.c.CreateCollectionCmd Create collection authCollection
   [junit4]   2> 560467 INFO  (OverseerStateUpdate-72208617002958856-127.0.0.1:44971_solr-n_0000000000) [n:127.0.0.1:44971_solr     ] o.a.s.c.o.SliceMutator createReplica() {
   [junit4]   2>   "operation":"ADDREPLICA",
   [junit4]   2>   "collection":"authCollection",
   [junit4]   2>   "shard":"shard1",
   [junit4]   2>   "core":"authCollection_shard1_replica_n1",
   [junit4]   2>   "state":"down",
   [junit4]   2>   "base_url":"https://127.0.0.1:44971/solr",
   [junit4]   2>   "type":"NRT",
   [junit4]   2>   "waitForFinalState":"false"} 
   [junit4]   2> 560473 INFO  (OverseerStateUpdate-72208617002958856-127.0.0.1:44971_solr-n_0000000000) [n:127.0.0.1:44971_solr     ] o.a.s.c.o.SliceMutator createReplica() {
   [junit4]   2>   "operation":"ADDREPLICA",
   [junit4]   2>   "collection":"authCollection",
   [junit4]   2>   "shard":"shard2",
   [junit4]   2>   "core":"authCollection_shard2_replica_n2",
   [junit4]   2>   "state":"down",
   [junit4]   2>   "base_url":"https://127.0.0.1:38619/solr",
   [junit4]   2>   "type":"NRT",
   [junit4]   2>   "waitForFinalState":"false"} 
   [junit4]   2> 560474 INFO  (OverseerStateUpdate-72208617002958856-127.0.0.1:44971_solr-n_0000000000) [n:127.0.0.1:44971_solr     ] o.a.s.c.o.SliceMutator createReplica() {
   [junit4]   2>   "operation":"ADDREPLICA",
   [junit4]   2>   "collection":"authCollection",
   [junit4]   2>   "shard":"shard3",
   [junit4]   2>   "core":"authCollection_shard3_replica_n4",
   [junit4]   2>   "state":"down",
   [junit4]   2>   "base_url":"https://127.0.0.1:34039/solr",
   [junit4]   2>   "type":"NRT",
   [junit4]   2>   "waitForFinalState":"false"} 
   [junit4]   2> 560683 INFO  (qtp140424967-17226) [n:127.0.0.1:34039_solr    x:authCollection_shard3_replica_n4 ] o.a.s.h.a.CoreAdminOperation core create command qt=/admin/cores&coreNodeName=core_node6&collection.configName=conf&newCollection=true&name=authCollection_shard3_replica_n4&action=CREATE&numShards=3&collection=authCollection&shard=shard3&wt=javabin&version=2&replicaType=NRT
   [junit4]   2> 560685 INFO  (qtp1591234709-17230) [n:127.0.0.1:38619_solr    x:authCollection_shard2_replica_n2 ] o.a.s.h.a.CoreAdminOperation core create command qt=/admin/cores&coreNodeName=core_node5&collection.configName=conf&newCollection=true&name=authCollection_shard2_replica_n2&action=CREATE&numShards=3&collection=authCollection&shard=shard2&wt=javabin&version=2&replicaType=NRT
   [junit4]   2> 560685 INFO  (qtp2129614823-17223) [n:127.0.0.1:44971_solr    x:authCollection_shard1_replica_n1 ] o.a.s.h.a.CoreAdminOperation core create command qt=/admin/cores&coreNodeName=core_node3&collection.configName=conf&newCollection=true&name=authCollection_shard1_replica_n1&action=CREATE&numShards=3&collection=authCollection&shard=shard1&wt=javabin&version=2&replicaType=NRT
   [junit4]   2> 560685 INFO  (qtp2129614823-17223) [n:127.0.0.1:44971_solr    x:authCollection_shard1_replica_n1 ] o.a.s.c.TransientSolrCoreCacheDefault Allocating transient cache for 2147483647 transient cores
   [junit4]   2> 561693 INFO  (qtp140424967-17226) [n:127.0.0.1:34039_solr c:authCollection s:shard3 r:core_node6 x:authCollection_shard3_replica_n4 ] o.a.s.c.SolrConfig Using Lucene MatchVersion: 9.0.0
   [junit4]   2> 561704 INFO  (qtp1591234709-17230) [n:127.0.0.1:38619_solr c:authCollection s:shard2 r:core_node5 x:authCollection_shard2_replica_n2 ] o.a.s.c.SolrConfig Using Lucene MatchVersion: 9.0.0
   [junit4]   2> 561706 INFO  (qtp2129614823-17223) [n:127.0.0.1:44971_solr c:authCollection s:shard1 r:core_node3 x:authCollection_shard1_replica_n1 ] o.a.s.c.SolrConfig Using Lucene MatchVersion: 9.0.0
   [junit4]   2> 561709 INFO  (qtp140424967-17226) [n:127.0.0.1:34039_solr c:authCollection s:shard3 r:core_node6 x:authCollection_shard3_replica_n4 ] o.a.s.s.IndexSchema [authCollection_shard3_replica_n4] Schema name=minimal
   [junit4]   2> 561710 INFO  (qtp1591234709-17230) [n:127.0.0.1:38619_solr c:authCollection s:shard2 r:core_node5 x:authCollection_shard2_replica_n2 ] o.a.s.s.IndexSchema [authCollection_shard2_replica_n2] Schema name=minimal
   [junit4]   2> 561710 INFO  (qtp140424967-17226) [n:127.0.0.1:34039_solr c:authCollection s:shard3 r:core_node6 x:authCollection_shard3_replica_n4 ] o.a.s.s.IndexSchema Loaded schema minimal/1.1 with uniqueid field id
   [junit4]   2> 561710 INFO  (qtp140424967-17226) [n:127.0.0.1:34039_solr c:authCollection s:shard3 r:core_node6 x:authCollection_shard3_replica_n4 ] o.a.s.c.CoreContainer Creating SolrCore 'authCollection_shard3_replica_n4' using configuration from collection authCollection, trusted=true
   [junit4]   2> 561710 INFO  (qtp140424967-17226) [n:127.0.0.1:34039_solr c:authCollection s:shard3 r:core_node6 x:authCollection_shard3_replica_n4 ] o.a.s.m.r.SolrJmxReporter JMX monitoring for 'solr_34039.solr.core.authCollection.shard3.replica_n4' (registry 'solr.core.authCollection.shard3.replica_n4') enabled at server: com.sun.jmx.mbeanserver.JmxMBeanServer@5d216e67
   [junit4]   2> 561710 INFO  (qtp140424967-17226) [n:127.0.0.1:34039_solr c:authCollection s:shard3 r:core_node6 x:authCollection_shard3_replica_n4 ] o.a.s.c.SolrCore [[authCollection_shard3_replica_n4] ] Opening new SolrCore at [/home/jenkins/workspace/Lucene-Solr-master-Linux/solr/build/solr-core/test/J2/temp/solr.security.BasicAuthIntegrationTest_C55C200D0B21752C-001/tempDir-001/node3/authCollection_shard3_replica_n4], dataDir=[/home/jenkins/workspace/Lucene-Solr-master-Linux/solr/build/solr-core/test/J2/temp/solr.security.BasicAuthIntegrationTest_C55C200D0B21752C-001/tempDir-001/node3/./authCollection_shard3_replica_n4/data/]
   [junit4]   2> 561711 INFO  (qtp2129614823-17223) [n:127.0.0.1:44971_solr c:authCollection s:shard1 r:core_node3 x:authCollection_shard1_replica_n1 ] o.a.s.s.IndexSchema [authCollection_shard1_replica_n1] Schema name=minimal
   [junit4]   2> 561711 INFO  (qtp1591234709-17230) [n:127.0.0.1:38619_solr c:authCollection s:shard2 r:core_node5 x:authCollection_shard2_replica_n2 ] o.a.s.s.IndexSchema Loaded schema minimal/1.1 with uniqueid field id
   [junit4]   2> 561711 INFO  (qtp1591234709-17230) [n:127.0.0.1:38619_solr c:authCollection s:shard2 r:core_node5 x:authCollection_shard2_replica_n2 ] o.a.s.c.CoreContainer Creating SolrCore 'authCollection_shard2_replica_n2' using configuration from collection authCollection, trusted=true
   [junit4]   2> 561712 INFO  (qtp1591234709-17230) [n:127.0.0.1:38619_solr c:authCollection s:shard2 r:core_node5 x:authCollection_shard2_replica_n2 ] o.a.s.m.r.SolrJmxReporter JMX monitoring for 'solr_38619.solr.core.authCollection.shard2.replica_n2' (registry 'solr.core.authCollection.shard2.replica_n2') enabled at server: com.sun.jmx.mbeanserver.JmxMBeanServer@5d216e67
   [junit4]   2> 561712 INFO  (qtp1591234709-17230) [n:127.0.0.1:38619_solr c:authCollection s:shard2 r:core_node5 x:authCollection_shard2_replica_n2 ] o.a.s.c.SolrCore [[authCollection_shard2_replica_n2] ] Opening new SolrCore at [/home/jenkins/workspace/Lucene-Solr-master-Linux/solr/build/solr-core/test/J2/temp/solr.security.BasicAuthIntegrationTest_C55C200D0B21752C-001/tempDir-001/node1/authCollection_shard2_replica_n2], dataDir=[/home/jenkins/workspace/Lucene-Solr-master-Linux/solr/build/solr-core/test/J2/temp/solr.security.BasicAuthIntegrationTest_C55C200D0B21752C-001/tempDir-001/node1/./authCollection_shard2_replica_n2/data/]
   [junit4]   2> 561712 INFO  (qtp2129614823-17223) [n:127.0.0.1:44971_solr c:authCollection s:shard1 r:core_node3 x:authCollection_shard1_replica_n1 ] o.a.s.s.IndexSchema Loaded schema minimal/1.1 with uniqueid field id
   [junit4]   2> 561712 INFO  (qtp2129614823-17223) [n:127.0.0.1:44971_solr c:authCollection s:shard1 r:core_node3 x:authCollection_shard1_replica_n1 ] o.a.s.c.CoreContainer Creating SolrCore 'authCollection_shard1_replica_n1' using configuration from collection authCollection, trusted=true
   [junit4]   2> 561713 INFO  (qtp2129614823-17223) [n:127.0.0.1:44971_solr c:authCollection s:shard1 r:core_node3 x:authCollection_shard1_replica_n1 ] o.a.s.m.r.SolrJmxReporter JMX monitoring for 'solr_44971.solr.core.authCollection.shard1.replica_n1' (registry 'solr.core.authCollection.shard1.replica_n1') enabled at server: com.sun.jmx.mbeanserver.JmxMBeanServer@5d216e67
   [junit4]   2> 561713 INFO  (qtp2129614823-17223) [n:127.0.0.1:44971_solr c:authCollection s:shard1 r:core_node3 x:authCollection_shard1_replica_n1 ] o.a.s.c.SolrCore [[authCollection_shard1_replica_n1] ] Opening new SolrCore at [/home/jenkins/workspace/Lucene-Solr-master-Linux/solr/build/solr-core/test/J2/temp/solr.security.BasicAuthIntegrationTest_C55C200D0B21752C-001/tempDir-001/node2/authCollection_shard1_replica_n1], dataDir=[/home/jenkins/workspace/Lucene-Solr-master-Linux/solr/build/solr-core/test/J2/temp/solr.security.BasicAuthIntegrationTest_C55C200D0B21752C-001/tempDir-001/node2/./authCollection_shard1_replica_n1/data/]
   [junit4]   2> 561776 INFO  (qtp1591234709-17230) [n:127.0.0.1:38619_solr c:authCollection s:shard2 r:core_node5 x:authCollection_shard2_replica_n2 ] o.a.s.u.UpdateHandler Using UpdateLog implementation: org.apache.solr.update.UpdateLog
   [junit4]   2> 561776 INFO  (qtp1591234709-17230) [n:127.0.0.1:38619_solr c:authCollection s:shard2 r:core_node5 x:authCollection_shard2_replica_n2 ] o.a.s.u.UpdateLog Initializing UpdateLog: dataDir=null defaultSyncLevel=FLUSH numRecordsToKeep=100 maxNumLogsToKeep=10 numVersionBuckets=65536
   [junit4]   2> 561777 INFO  (qtp1591234709-17230) [n:127.0.0.1:38619_solr c:authCollection s:shard2 r:core_node5 x:authCollection_shard2_replica_n2 ] o.a.s.u.CommitTracker Hard AutoCommit: disabled
   [junit4]   2> 561777 INFO  (qtp1591234709-17230) [n:127.0.0.1:38619_solr c:authCollection s:shard2 r:core_node5 x:authCollection_shard2_replica_n2 ] o.a.s.u.CommitTracker Soft AutoCommit: disabled
   [junit4]   2> 561778 INFO  (qtp1591234709-17230) [n:127.0.0.1:38619_solr c:authCollection s:shard2 r:core_node5 x:authCollection_shard2_replica_n2 ] o.a.s.s.SolrIndexSearcher Opening [Searcher@f5fd7bd[authCollection_shard2_replica_n2] main]
   [junit4]   2> 561780 INFO  (qtp1591234709-17230) [n:127.0.0.1:38619_solr c:authCollection s:shard2 r:core_node5 x:authCollection_shard2_replica_n2 ] o.a.s.r.ManagedResourceStorage Configured ZooKeeperStorageIO with znodeBase: /configs/conf
   [junit4]   2> 561780 INFO  (qtp140424967-17226) [n:127.0.0.1:34039_solr c:authCollection s:shard3 r:core_node6 x:authCollection_shard3_replica_n4 ] o.a.s.u.UpdateHandler Using UpdateLog implementation: org.apache.solr.update.UpdateLog
   [junit4]   2> 561780 INFO  (qtp140424967-17226) [n:127.0.0.1:34039_solr c:authCollection s:shard3 r:core_node6 x:authCollection_shard3_replica_n4 ] o.a.s.u.UpdateLog Initializing UpdateLog: dataDir=null defaultSyncLevel=FLUSH numRecordsToKeep=100 maxNumLogsToKeep=10 numVersionBuckets=65536
   [junit4]   2> 561780 INFO  (qtp2129614823-17223) [n:127.0.0.1:44971_solr c:authCollection s:shard1 r:core_node3 x:authCollection_shard1_replica_n1 ] o.a.s.u.UpdateHandler Using UpdateLog implementation: org.apache.solr.update.UpdateLog
   [junit4]   2> 561780 INFO  (qtp2129614823-17223) [n:127.0.0.1:44971_solr c:authCollection s:shard1 r:core_node3 x:authCollection_shard1_replica_n1 ] o.a.s.u.UpdateLog Initializing UpdateLog: dataDir=null defaultSyncLevel=FLUSH numRecordsToKeep=100 maxNumLogsToKeep=10 numVersionBuckets=65536
   [junit4]   2> 561780 INFO  (qtp1591234709-17230) [n:127.0.0.1:38619_solr c:authCollection s:shard2 r:core_node5 x:authCollection_shard2_replica_n2 ] o.a.s.r.ManagedResourceStorage Loaded null at path _rest_managed.json using ZooKeeperStorageIO:path=/configs/conf
   [junit4]   2> 561780 INFO  (qtp1591234709-17230) [n:127.0.0.1:38619_solr c:authCollection s:shard2 r:core_node5 x:authCollection_shard2_replica_n2 ] o.a.s.h.ReplicationHandler Commits will be reserved for 10000ms.
   [junit4]   2> 561780 INFO  (qtp1591234709-17230) [n:127.0.0.1:38619_solr c:authCollection s:shard2 r:core_node5 x:authCollection_shard2_replica_n2 ] o.a.s.u.UpdateLog Could not find max version in index or recent updates, using new clock 1639753352638103552
   [junit4]   2> 561781 INFO  (qtp140424967-17226) [n:127.0.0.1:34039_solr c:authCollection s:shard3 r:core_node6 x:authCollection_shard3_replica_n4 ] o.a.s.u.CommitTracker Hard AutoCommit: disabled
   [junit4]   2> 561781 INFO  (qtp140424967-17226) [n:127.0.0.1:34039_solr c:authCollection s:shard3 r:core_node6 x:authCollection_shard3_replica_n4 ] o.a.s.u.CommitTracker Soft AutoCommit: disabled
   [junit4]   2> 561781 INFO  (qtp2129614823-17223) [n:127.0.0.1:44971_solr c:authCollection s:shard1 r:core_node3 x:authCollection_shard1_replica_n1 ] o.a.s.u.CommitTracker Hard AutoCommit: disabled
   [junit4]   2> 561781 INFO  (qtp2129614823-17223) [n:127.0.0.1:44971_solr c:authCollection s:shard1 r:core_node3 x:authCollection_shard1_replica_n1 ] o.a.s.u.CommitTracker Soft AutoCommit: disabled
   [junit4]   2> 561782 INFO  (qtp2129614823-17223) [n:127.0.0.1:44971_solr c:authCollection s:shard1 r:core_node3 x:authCollection_shard1_replica_n1 ] o.a.s.s.SolrIndexSearcher Opening [Searcher@52ce29cd[authCollection_shard1_replica_n1] main]
   [junit4]   2> 561783 INFO  (qtp140424967-17226) [n:127.0.0.1:34039_solr c:authCollection s:shard3 r:core_node6 x:authCollection_shard3_replica_n4 ] o.a.s.s.SolrIndexSearcher Opening [Searcher@70fac20b[authCollection_shard3_replica_n4] main]
   [junit4]   2> 561783 INFO  (qtp2129614823-17223) [n:127.0.0.1:44971_solr c:authCollection s:shard1 r:core_node3 x:authCollection_shard1_replica_n1 ] o.a.s.r.ManagedResourceStorage Configured ZooKeeperStorageIO with znodeBase: /configs/conf
   [junit4]   2> 561784 INFO  (qtp2129614823-17223) [n:127.0.0.1:44971_solr c:authCollection s:shard1 r:core_node3 x:authCollection_shard1_replica_n1 ] o.a.s.r.ManagedResourceStorage Loaded null at path _rest_managed.json using ZooKeeperStorageIO:path=/configs/conf
   [junit4]   2> 561784 INFO  (qtp140424967-17226) [n:127.0.0.1:34039_solr c:authCollection s:shard3 r:core_node6 x:authCollection_shard3_replica_n4 ] o.a.s.r.ManagedResourceStorage Configured ZooKeeperStorageIO with znodeBase: /configs/conf
   [junit4]   2> 561784 INFO  (qtp2129614823-17223) [n:127.0.0.1:44971_solr c:authCollection s:shard1 r:core_node3 x:authCollection_shard1_replica_n1 ] o.a.s.h.ReplicationHandler Commits will be reserved for 10000ms.
   [junit4]   2> 561784 INFO  (qtp2129614823-17223) [n:127.0.0.1:44971_solr c:authCollection s:shard1 r:core_node3 x:authCollection_shard1_replica_n1 ] o.a.s.u.UpdateLog Could not find max version in index or recent updates, using new clock 1639753352642297856
   [junit4]   2> 561785 INFO  (qtp140424967-17226) [n:127.0.0.1:34039_solr c:authCollection s:shard3 r:core_node6 x:authCollection_shard3_replica_n4 ] o.a.s.r.ManagedResourceStorage Loaded null at path _rest_managed.json using ZooKeeperStorageIO:path=/configs/conf
   [junit4]   2> 561785 INFO  (qtp140424967-17226) [n:127.0.0.1:34039_solr c:authCollection s:shard3 r:core_node6 x:authCollection_shard3_replica_n4 ] o.a.s.h.ReplicationHandler Commits will be reserved for 10000ms.
   [junit4]   2> 561785 INFO  (qtp140424967-17226) [n:127.0.0.1:34039_solr c:authCollection s:shard3 r:core_node6 x:authCollection_shard3_replica_n4 ] o.a.s.u.UpdateLog Could not find max version in index or recent updates, using new clock 1639753352643346432
   [junit4]   2> 561785 INFO  (qtp1591234709-17230) [n:127.0.0.1:38619_solr c:authCollection s:shard2 r:core_node5 x:authCollection_shard2_replica_n2 ] o.a.s.c.ZkShardTerms Successful update of terms at /collections/authCollection/terms/shard2 to Terms{values={core_node5=0}, version=0}
   [junit4]   2> 561785 INFO  (qtp1591234709-17230) [n:127.0.0.1:38619_solr c:authCollection s:shard2 r:core_node5 x:authCollection_shard2_replica_n2 ] o.a.s.c.ShardLeaderElectionContextBase make sure parent is created /collections/authCollection/leaders/shard2
   [junit4]   2> 561787 INFO  (searcherExecutor-4732-thread-1-processing-n:127.0.0.1:38619_solr x:authCollection_shard2_replica_n2 c:authCollection s:shard2 r:core_node5) [n:127.0.0.1:38619_solr c:authCollection s:shard2 r:core_node5 x:authCollection_shard2_replica_n2 ] o.a.s.c.SolrCore [authCollection_shard2_replica_n2] Registered new searcher Searcher@f5fd7bd[authCollection_shard2_replica_n2] main{ExitableDirectoryReader(UninvertingDirectoryReader())}
   [junit4]   2> 561788 INFO  (searcherExecutor-4733-thread-1-processing-n:127.0.0.1:44971_solr x:authCollection_shard1_replica_n1 c:authCollection s:shard1 r:core_node3) [n:127.0.0.1:44971_solr c:authCollection s:shard1 r:core_node3 x:authCollection_shard1_replica_n1 ] o.a.s.c.SolrCore [authCollection_shard1_replica_n1] Registered new searcher Searcher@52ce29cd[authCollection_shard1_replica_n1] main{ExitableDirectoryReader(UninvertingDirectoryReader())}
   [junit4]   2> 561788 INFO  (searcherExecutor-4731-thread-1-processing-n:127.0.0.1:34039_solr x:authCollection_shard3_replica_n4 c:authCollection s:shard3 r:core_node6) [n:127.0.0.1:34039_solr c:authCollection s:shard3 r:core_node6 x:authCollection_shard3_replica_n4 ] o.a.s.c.SolrCore [authCollection_shard3_replica_n4] Registered new searcher Searcher@70fac20b[authCollection_shard3_replica_n4] main{ExitableDirectoryReader(UninvertingDirectoryReader())}
   [junit4]   2> 561788 INFO  (qtp1591234709-17230) [n:127.0.0.1:38619_solr c:authCollection s:shard2 r:core_node5 x:authCollection_shard2_replica_n2 ] o.a.s.c.ShardLeaderElectionContext Enough replicas found to continue.
   [junit4]   2> 561788 INFO  (qtp1591234709-17230) [n:127.0.0.1:38619_solr c:authCollection s:shard2 r:core_node5 x:authCollection_shard2_replica_n2 ] o.a.s.c.ShardLeaderElectionContext I may be the new leader - try and sync
   [junit4]   2> 561788 INFO  (qtp1591234709-17230) [n:127.0.0.1:38619_solr c:authCollection s:shard2 r:core_node5 x:authCollection_shard2_replica_n2 ] o.a.s.c.SyncStrategy Sync replicas to https://127.0.0.1:38619/solr/authCollection_shard2_replica_n2/
   [junit4]   2> 561789 INFO  (qtp1591234709-17230) [n:127.0.0.1:38619_solr c:authCollection s:shard2 r:core_node5 x:authCollection_shard2_replica_n2 ] o.a.s.c.SyncStrategy Sync Success - now sync replicas to me
   [junit4]   2> 561789 INFO  (qtp1591234709-17230) [n:127.0.0.1:38619_solr c:authCollection s:shard2 r:core_node5 x:authCollection_shard2_replica_n2 ] o.a.s.c.SyncStrategy https://127.0.0.1:38619/solr/authCollection_shard2_replica_n2/ has no replicas
   [junit4]   2> 561789 INFO  (qtp1591234709-17230) [n:127.0.0.1:38619_solr c:authCollection s:shard2 r:core_node5 x:authCollection_shard2_replica_n2 ] o.a.s.c.ShardLeaderElectionContextBase Creating leader registration node /collections/authCollection/leaders/shard2/leader after winning as /collections/authCollection/leader_elect/shard2/election/72208617002958861-core_node5-n_0000000000
   [junit4]   2> 561790 INFO  (qtp2129614823-17223) [n:127.0.0.1:44971_solr c:authCollection s:shard1 r:core_node3 x:authCollection_shard1_replica_n1 ] o.a.s.c.ZkShardTerms Successful update of terms at /collections/authCollection/terms/shard1 to Terms{values={core_node3=0}, version=0}
   [junit4]   2> 561791 INFO  (qtp2129614823-17223) [n:127.0.0.1:44971_solr c:authCollection s:shard1 r:core_node3 x:authCollection_shard1_replica_n1 ] o.a.s.c.ShardLeaderElectionContextBase make sure parent is created /collections/authCollection/leaders/shard1
   [junit4]   2> 561791 INFO  (qtp1591234709-17230) [n:127.0.0.1:38619_solr c:authCollection s:shard2 r:core_node5 x:authCollection_shard2_replica_n2 ] o.a.s.c.ShardLeaderElectionContext I am the new leader: https://127.0.0.1:38619/solr/authCollection_shard2_replica_n2/ shard2
   [junit4]   2> 561793 INFO  (qtp140424967-17226) [n:127.0.0.1:34039_solr c:authCollection s:shard3 r:core_node6 x:authCollection_shard3_replica_n4 ] o.a.s.c.ZkShardTerms Successful update of terms at /collections/authCollection/terms/shard3 to Terms{values={core_node6=0}, version=0}
   [junit4]   2> 561793 INFO  (qtp140424967-17226) [n:127.0.0.1:34039_solr c:authCollection s:shard3 r:core_node6 x:authCollection_shard3_replica_n4 ] o.a.s.c.ShardLeaderElectionContextBase make sure parent is created /collections/authCollection/leaders/shard3
   [junit4]   2> 561794 INFO  (qtp2129614823-17223) [n:127.0.0.1:44971_solr c:authCollection s:shard1 r:core_node3 x:authCollection_shard1_replica_n1 ] o.a.s.c.ShardLeaderElectionContext Enough replicas found to continue.
   [junit4]   2> 561795 INFO  (qtp2129614823-17223) [n:127.0.0.1:44971_solr c:authCollection s:shard1 r:core_node3 x:authCollection_shard1_replica_n1 ] o.a.s.c.ShardLeaderElectionContext I may be the new leader - try and sync
   [junit4]   2> 561795 INFO  (qtp2129614823-17223) [n:127.0.0.1:44971_solr c:authCollection s:shard1 r:core_node3 x:authCollection_shard1_replica_n1 ] o.a.s.c.SyncStrategy Sync replicas to https://127.0.0.1:44971/solr/authCollection_shard1_replica_n1/
   [junit4]   2> 561795 INFO  (qtp2129614823-17223) [n:127.0.0.1:44971_solr c:authCollection s:shard1 r:core_node3 x:authCollection_shard1_replica_n1 ] o.a.s.c.SyncStrategy Sync Success - now sync replicas to me
   [junit4]   2> 561795 INFO  (qtp2129614823-17223) [n:127.0.0.1:44971_solr c:authCollection s:shard1 r:core_node3 x:authCollection_shard1_replica_n1 ] o.a.s.c.SyncStrategy https://127.0.0.1:44971/solr/authCollection_shard1_replica_n1/ has no replicas
   [junit4]   2> 561795 INFO  (qtp2129614823-17223) [n:127.0.0.1:44971_solr c:authCollection s:shard1 r:core_node3 x:authCollection_shard1_replica_n1 ] o.a.s.c.ShardLeaderElectionContextBase Creating leader registration node /collections/authCollection/leaders/shard1/leader after winning as /collections/authCollection/leader_elect/shard1/election/72208617002958856-core_node3-n_0000000000
   [junit4]   2> 561795 INFO  (qtp140424967-17226) [n:127.0.0.1:34039_solr c:authCollection s:shard3 r:core_node6 x:authCollection_shard3_replica_n4 ] o.a.s.c.ShardLeaderElectionContext Enough replicas found to continue.
   [junit4]   2> 561795 INFO  (qtp140424967-17226) [n:127.0.0.1:34039_solr c:authCollection s:shard3 r:core_node6 x:authCollection_shard3_replica_n4 ] o.a.s.c.ShardLeaderElectionContext I may be the new leader - try and sync
   [junit4]   2> 561795 INFO  (qtp140424967-17226) [n:127.0.0.1:34039_solr c:authCollection s:shard3 r:core_node6 x:authCollection_shard3_replica_n4 ] o.a.s.c.SyncStrategy Sync replicas to https://127.0.0.1:34039/solr/authCollection_shard3_replica_n4/
   [junit4]   2> 561796 INFO  (qtp140424967-17226) [n:127.0.0.1:34039_solr c:authCollection s:shard3 r:core_node6 x:authCollection_shard3_replica_n4 ] o.a.s.c.SyncStrategy Sync Success - now sync replicas to me
   [junit4]   2> 561796 INFO  (qtp140424967-17226) [n:127.0.0.1:34039_solr c:authCollection s:shard3 r:core_node6 x:authCollection_shard3_replica_n4 ] o.a.s.c.SyncStrategy https://127.0.0.1:34039/solr/authCollection_shard3_replica_n4/ has no replicas
   [junit4]   2> 561796 INFO  (qtp140424967-17226) [n:127.0.0.1:34039_solr c:authCollection s:shard3 r:core_node6 x:authCollection_shard3_replica_n4 ] o.a.s.c.ShardLeaderElectionContextBase Creating leader registration node /collections/authCollection/leaders/shard3/leader after winning as /collections/authCollection/leader_elect/shard3/election/72208617002958859-core_node6-n_0000000000
   [junit4]   2> 561796 INFO  (qtp2129614823-17223) [n:127.0.0.1:44971_solr c:authCollection s:shard1 r:core_node3 x:authCollection_shard1_replica_n1 ] o.a.s.c.ShardLeaderElectionContext I am the new leader: https://127.0.0.1:44971/solr/authCollection_shard1_replica_n1/ shard1
   [junit4]   2> 561797 INFO  (qtp140424967-17226) [n:127.0.0.1:34039_solr c:authCollection s:shard3 r:core_node6 x:authCollection_shard3_replica_n4 ] o.a.s.c.ShardLeaderElectionContext I am the new leader: https://127.0.0.1:34039/solr/authCollection_shard3_replica_n4/ shard3
   [junit4]   2> 561898 INFO  (zkCallback-6719-thread-1) [     ] o.a.s.c.c.ZkStateReader A cluster state change: [WatchedEvent state:SyncConnected type:NodeDataChanged path:/collections/authCollection/state.json] for collection [authCollection] has occurred - updating... (live nodes size: [3])
   [junit4]   2> 561898 INFO  (zkCallback-6735-thread-1) [     ] o.a.s.c.c.ZkStateReader A cluster state change: [WatchedEvent state:SyncConnected type:NodeDataChanged path:/collections/authCollection/state.json] for collection [authCollection] has occurred - updating... (live nodes size: [3])
   [junit4]   2> 561898 INFO  (zkCallback-6745-thread-1) [     ] o.a.s.c.c.ZkStateReader A cluster state change: [WatchedEvent state:SyncConnected type:NodeDataChanged path:/collections/authCollection/state.json] for collection [authCollection] has occurred - updating... (live nodes size: [3])
   [junit4]   2> 561899 INFO  (zkCallback-6719-thread-2) [     ] o.a.s.c.c.ZkStateReader A cluster state change: [WatchedEvent state:SyncConnected type:NodeDataChanged path:/collections/authCollection/state.json] for collection [authCollection] has occurred - updating... (live nodes size: [3])
   [junit4]   2> 561899 INFO  (qtp1591234709-17230) [n:127.0.0.1:38619_solr c:authCollection s:shard2 r:core_node5 x:authCollection_shard2_replica_n2 ] o.a.s.c.ZkController I am the leader, no recovery necessary
   [junit4]   2> 561899 INFO  (qtp140424967-17226) [n:127.0.0.1:34039_solr c:authCollection s:shard3 r:core_node6 x:authCollection_shard3_replica_n4 ] o.a.s.c.ZkController I am the leader, no recovery necessary
   [junit4]   2> 561900 INFO  (qtp2129614823-17223) [n:127.0.0.1:44971_solr c:authCollection s:shard1 r:core_node3 x:authCollection_shard1_replica_n1 ] o.a.s.c.ZkController I am the leader, no recovery necessary
   [junit4]   2> 561901 INFO  (qtp140424967-17226) [n:127.0.0.1:34039_solr c:authCollection s:shard3 r:core_node6 x:authCollection_shard3_replica_n4 ] o.a.s.s.HttpSolrCall [admin] webapp=null path=/admin/cores params={qt=/admin/cores&coreNodeName=core_node6&collection.configName=conf&newCollection=true&name=authCollection_shard3_replica_n4&action=CREATE&numShards=3&collection=authCollection&shard=shard3&wt=javabin&version=2&replicaType=NRT} status=0 QTime=1217
   [junit4]   2> 561901 INFO  (qtp1591234709-17230) [n:127.0.0.1:38619_solr c:authCollection s:shard2 r:core_node5 x:authCollection_shard2_replica_n2 ] o.a.s.s.HttpSolrCall [admin] webapp=null path=/admin/cores params={qt=/admin/cores&coreNodeName=core_node5&collection.configName=conf&newCollection=true&name=authCollection_shard2_replica_n2&action=CREATE&numShards=3&collection=authCollection&shard=shard2&wt=javabin&version=2&replicaType=NRT} status=0 QTime=1216
   [junit4]   2> 561906 INFO  (qtp2129614823-17223) [n:127.0.0.1:44971_solr c:authCollection s:shard1 r:core_node3 x:authCollection_shard1_replica_n1 ] o.a.s.s.HttpSolrCall [admin] webapp=null path=/admin/cores params={qt=/admin/cores&coreNodeName=core_node3&collection.configName=conf&newCollection=true&name=authCollection_shard1_replica_n1&action=CREATE&numShards=3&collection=authCollection&shard=shard1&wt=javabin&version=2&replicaType=NRT} status=0 QTime=1221
   [junit4]   2> 561907 INFO  (qtp140424967-17229) [n:127.0.0.1:34039_solr     ] o.a.s.h.a.CollectionsHandler Wait for new collection to be active for at most 45 seconds. Check all shard replicas
   [junit4]   2> 562007 INFO  (zkCallback-6719-thread-2) [     ] o.a.s.c.c.ZkStateReader A cluster state change: [WatchedEvent state:SyncConnected type:NodeDataChanged path:/collections/authCollection/state.json] for collection [authCollection] has occurred - updating... (live nodes size: [3])
   [junit4]   2> 562007 INFO  (zkCallback-6719-thread-1) [     ] o.a.s.c.c.ZkStateReader A cluster state change: [WatchedEvent state:SyncConnected type:NodeDataChanged path:/collections/authCollection/state.json] for collection [authCollection] has occurred - updating... (live nodes size: [3])
   [junit4]   2> 562007 INFO  (zkCallback-6719-thread-3) [     ] o.a.s.c.c.ZkStateReader A cluster state change: [WatchedEvent state:SyncConnected type:NodeDataChanged path:/collections/authCollection/state.json] for collection [authCollection] has occurred - updating... (live nodes size: [3])
   [junit4]   2> 562007 INFO  (zkCallback-6745-thread-2) [     ] o.a.s.c.c.ZkStateReader A cluster state change: [WatchedEvent state:SyncConnected type:NodeDataChanged path:/collections/authCollection/state.json] for collection [authCollection] has occurred - updating... (live nodes size: [3])
   [junit4]   2> 562007 INFO  (zkCallback-6735-thread-2) [     ] o.a.s.c.c.ZkStateReader A cluster state change: [WatchedEvent state:SyncConnected type:NodeDataChanged path:/collections/authCollection/state.json] for collection [authCollection] has occurred - updating... (live nodes size: [3])
   [junit4]   2> 562007 INFO  (zkCallback-6745-thread-1) [     ] o.a.s.c.c.ZkStateReader A cluster state change: [WatchedEvent state:SyncConnected type:NodeDataChanged path:/collections/authCollection/state.json] for collection [authCollection] has occurred - updating... (live nodes size: [3])
   [junit4]   2> 562007 INFO  (zkCallback-6735-thread-1) [     ] o.a.s.c.c.ZkStateReader A cluster state change: [WatchedEvent state:SyncConnected type:NodeDataChanged path:/collections/authCollection/state.json] for collection [authCollection] has occurred - updating... (live nodes size: [3])
   [junit4]   2> 562007 INFO  (qtp140424967-17229) [n:127.0.0.1:34039_solr     ] o.a.s.s.HttpSolrCall [admin] webapp=null path=/admin/collections params={collection.configName=conf&name=authCollection&nrtReplicas=1&action=CREATE&numShards=3&wt=javabin&version=2} status=0 QTime=1651
   [junit4]   2> 562017 INFO  (qtp1591234709-17230) [n:127.0.0.1:38619_solr     ] o.a.s.s.HttpSolrCall [admin] webapp=null path=/cluster/security/authentication params={} status=0 QTime=0
   [junit4]   2> 562019 INFO  (zkCallback-6735-thread-1) [     ] o.a.s.c.CoreContainer Security node changed, reloading security.json
   [junit4]   2> 562019 INFO  (zkCallback-6735-thread-1) [     ] o.a.s.c.CoreContainer Initializing authorization plugin: solr.RuleBasedAuthorizationPlugin
   [junit4]   2> 562019 INFO  (zkCallback-6719-thread-1) [     ] o.a.s.c.CoreContainer Security node changed, reloading security.json
   [junit4]   2> 562020 INFO  (zkCallback-6719-thread-1) [     ] o.a.s.c.CoreContainer Initializing authorization plugin: solr.RuleBasedAuthorizationPlugin
   [junit4]   2> 562022 INFO  (zkCallback-6745-thread-1) [     ] o.a.s.c.CoreContainer Security node changed, reloading security.json
   [junit4]   2> 562022 INFO  (zkCallback-6745-thread-1) [     ] o.a.s.c.CoreContainer Initializing authorization plugin: solr.RuleBasedAuthorizationPlugin
   [junit4]   2> 562029 INFO  (qtp1591234709-17230) [n:127.0.0.1:38619_solr     ] o.a.s.s.HttpSolrCall [admin] webapp=null path=/cluster/security/authentication params={} status=0 QTime=0
   [junit4]   2> 562029 INFO  (zkCallback-6745-thread-1) [     ] o.a.s.c.CoreContainer Initializing authentication plugin: solr.BasicAuthPlugin
   [junit4]   2> 562029 INFO  (zkCallback-6719-thread-1) [     ] o.a.s.c.CoreContainer Initializing authentication plugin: solr.BasicAuthPlugin
   [junit4]   2> 562029 INFO  (zkCallback-6735-thread-1) [     ] o.a.s.c.CoreContainer Initializing authentication plugin: solr.BasicAuthPlugin
   [junit4]   2> 562032 INFO  (TEST-BasicAuthIntegrationTest.testBasicAuth-seed#[C55C200D0B21752C]) [     ] o.a.s.c.CoreContainer Shutting down CoreContainer instance=343619894
   [junit4]   2> 562032 INFO  (TEST-BasicAuthIntegrationTest.testBasicAuth-seed#[C55C200D0B21752C]) [     ] o.a.s.c.ZkController Remove node as live in ZooKeeper:/live_nodes/127.0.0.1:38619_solr
   [junit4]   2> 562040 INFO  (TEST-BasicAuthIntegrationTest.testBasicAuth-seed#[C55C200D0B21752C]) [     ] o.a.s.c.ZkController Publish this node as DOWN...
   [junit4]   2> 562040 INFO  (TEST-BasicAuthIntegrationTest.testBasicAuth-seed#[C55C200D0B21752C]) [     ] o.a.s.c.ZkController Publish node=127.0.0.1:38619_solr as DOWN
   [junit4]   2> 562041 INFO  (coreCloseExecutor-4746-thread-1) [n:127.0.0.1:38619_solr c:authCollection s:shard2 r:core_node5 x:authCollection_shard2_replica_n2 ] o.a.s.c.SolrCore [authCollection_shard2_replica_n2]  CLOSING SolrCore org.apache.solr.core.SolrCore@a1b253c
   [junit4]   2> 562041 INFO  (coreCloseExecutor-4746-thread-1) [n:127.0.0.1:38619_solr c:authCollection s:shard2 r:core_node5 x:authCollection_shard2_replica_n2 ] o.a.s.m.SolrMetricManager Closing metric reporters for registry=solr.core.authCollection.shard2.replica_n2, tag=a1b253c
   [junit4]   2> 562042 INFO  (coreCloseExecutor-4746-thread-1) [n:127.0.0.1:38619_solr c:authCollection s:shard2 r:core_node5 x:authCollection_shard2_replica_n2 ] o.a.s.m.r.SolrJmxReporter Closing reporter [org.apache.solr.metrics.reporters.SolrJmxReporter@4b7dbf95: rootName = solr_38619, domain = solr.core.authCollection.shard2.replica_n2, service url = null, agent id = null] for registry solr.core.authCollection.shard2.replica_n2 / com.codahale.metrics.MetricRegistry@369fad4d
   [junit4]   2> 562048 INFO  (coreCloseExecutor-4746-thread-1) [n:127.0.0.1:38619_solr c:authCollection s:shard2 r:core_node5 x:authCollection_shard2_replica_n2 ] o.a.s.m.SolrMetricManager Closing metric reporters for registry=solr.collection.authCollection.shard2.leader, tag=a1b253c
   [junit4]   2> 562049 INFO  (TEST-BasicAuthIntegrationTest.testBasicAuth-seed#[C55C200D0B21752C]) [     ] o.a.s.m.SolrMetricManager Closing metric reporters for registry=solr.node, tag=null
   [junit4]   2> 562049 INFO  (TEST-BasicAuthIntegrationTest.testBasicAuth-seed#[C55C200D0B21752C]) [     ] o.a.s.m.r.SolrJmxReporter Closing reporter [org.apache.solr.metrics.reporters.SolrJmxReporter@74b7489b: rootName = solr_38619, domain = solr.node, service url = null, agent id = null] for registry solr.node / com.codahale.metrics.MetricRegistry@397b5c3f
   [junit4]   2> 562053 INFO  (TEST-BasicAuthIntegrationTest.testBasicAuth-seed#[C55C200D0B21752C]) [     ] o.a.s.m.SolrMetricManager Closing metric reporters for registry=solr.jvm, tag=null
   [junit4]   2> 562053 INFO  (TEST-BasicAuthIntegrationTest.testBasicAuth-seed#[C55C200D0B21752C]) [     ] o.a.s.m.r.SolrJmxReporter Closing reporter [org.apache.solr.metrics.reporters.SolrJmxReporter@1043c088: rootName = solr_38619, domain = solr.jvm, service url = null, agent id = null] for registry solr.jvm / com.codahale.metrics.MetricRegistry@6c464eb6
   [junit4]   2> 562056 INFO  (TEST-BasicAuthIntegrationTest.testBasicAuth-seed#[C55C200D0B21752C]) [     ] o.a.s.m.SolrMetricManager Closing metric reporters for registry=solr.jetty, tag=null
   [junit4]   2> 562056 INFO  (TEST-BasicAuthIntegrationTest.testBasicAuth-seed#[C55C200D0B21752C]) [     ] o.a.s.m.r.SolrJmxReporter Closing reporter [org.apache.solr.metrics.reporters.SolrJmxReporter@3fb8ca5b: rootName = solr_38619, domain = solr.jetty, service url = null, agent id = null] for registry solr.jetty / com.codahale.metrics.MetricRegistry@3c617607
   [junit4]   2> 562056 INFO  (TEST-BasicAuthIntegrationTest.testBasicAuth-seed#[C55C200D0B21752C]) [     ] o.a.s.m.SolrMetricManager Closing metric reporters for registry=solr.cluster, tag=null
   [junit4]   2> 562057 INFO  (zkCallback-6742-thread-1) [     ] o.a.s.c.c.ZkStateReader Updated live nodes from ZooKeeper... (3) -> (2)
   [junit4]   2> 562057 INFO  (zkCallback-6726-thread-1) [     ] o.a.s.c.c.ZkStateReader Updated live nodes from ZooKeeper... (3) -> (2)
   [junit4]   2> 562057 INFO  (zkCallback-6735-thread-1) [     ] o.a.s.c.c.ZkStateReader Updated live nodes from ZooKeeper... (3) -> (2)
   [junit4]   2> 562057 INFO  (zkCallback-6719-thread-1) [     ] o.a.s.c.c.ZkStateReader Updated live nodes from ZooKeeper... (3) -> (2)
   [junit4]   2> 562057 INFO  (zkCallback-6758-thread-1) [     ] o.a.s.c.c.ZkStateReader Updated live nodes from ZooKeeper... (3) -> (2)
   [junit4]   2> 562142 INFO  (zkCallback-6735-thread-2) [     ] o.a.s.c.c.ZkStateReader A cluster state change: [WatchedEvent state:SyncConnected type:NodeDataChanged path:/collections/authCollection/state.json] for collection [authCollection] has occurred - updating... (live nodes size: [2])
   [junit4]   2> 562142 INFO  (zkCallback-6719-thread-2) [     ] o.a.s.c.c.ZkStateReader A cluster state change: [WatchedEvent state:SyncConnected type:NodeDataChanged path:/collections/authCollection/state.json] for collection [authCollection] has occurred - updating... (live nodes size: [2])
   [junit4]   2> 562142 INFO  (zkCallback-6735-thread-1) [     ] o.a.s.c.c.ZkStateReader A cluster state change: [WatchedEvent state:SyncConnected type:NodeDataChanged path:/collections/authCollection/state.json] for collection [authCollection] has occurred - updating... (live nodes size: [2])
   [junit4]   2> 562142 INFO  (zkCallback-6719-thread-3) [     ] o.a.s.c.c.ZkStateReader A cluster state change: [WatchedEvent state:SyncConnected type:NodeDataChanged path:/collections/authCollection/state.json] for collection [authCollection] has occurred - updating... (live nodes size: [2])
   [junit4]   2> 562142 INFO  (zkCallback-6719-thread-1) [     ] o.a.s.c.c.ZkStateReader A cluster state change: [WatchedEvent state:SyncConnected type:NodeDataChanged path:/collections/authCollection/state.json] for collection [authCollection] has occurred - updating... (live nodes size: [2])
   [junit4]   2> 562259 INFO  (TEST-BasicAuthIntegrationTest.testBasicAuth-seed#[C55C200D0B21752C]) [     ] o.e.j.s.AbstractConnector Stopped ServerConnector@1122af05{ssl,[ssl, alpn, http/1.1, h2]}{127.0.0.1:?}
   [junit4]   2> 562259 INFO  (TEST-BasicAuthIntegrationTest.testBasicAuth-seed#[C55C200D0B21752C]) [     ] o.e.j.s.h.ContextHandler Stopped o.e.j.s.ServletContextHandler@6ac8129a{/solr,null,UNAVAILABLE}
   [junit4]   2> 562259 INFO  (TEST-BasicAuthIntegrationTest.testBasicAuth-seed#[C55C200D0B21752C]) [     ] o.e.j.s.session node0 Stopped scavenging
   [junit4]   2> 562259 INFO  (TEST-BasicAuthIntegrationTest.testBasicAuth-seed#[C55C200D0B21752C]) [     ] o.a.s.c.s.e.JettySolrRunner Start Jetty (original configured port=0)
   [junit4]   2> 562260 WARN  (TEST-BasicAuthIntegrationTest.testBasicAuth-seed#[C55C200D0B21752C]) [     ] o.e.j.s.AbstractConnector Ignoring deprecated socket close linger time
   [junit4]   2> 562260 INFO  (TEST-BasicAuthIntegrationTest.testBasicAuth-seed#[C55C200D0B21752C]) [     ] o.a.s.c.s.e.JettySolrRunner Trying to start Jetty on port 38619 try number 1 ...
   [junit4]   2> 562260 INFO  (TEST-BasicAuthIntegrationTest.testBasicAuth-seed#[C55C200D0B21752C]) [     ] o.e.j.s.Server jetty-9.4.19.v20190610; built: 2019-06-10T16:30:51.723Z; git: afcf563148970e98786327af5e07c261fda175d3; jvm 12.0.1+12
   [junit4]   2> 562261 INFO  (TEST-BasicAuthIntegrationTest.testBasicAuth-seed#[C55C200D0B21752C]) [     ] o.e.j.s.session DefaultSessionIdManager workerName=node0
   [junit4]   2> 562261 INFO  (TEST-BasicAuthIntegrationTest.testBasicAuth-seed#[C55C200D0B21752C]) [     ] o.e.j.s.session No SessionScavenger set, using defaults
   [junit4]   2> 562261 INFO  (TEST-BasicAuthIntegrationTest.testBasicAuth-seed#[C55C200D0B21752C]) [     ] o.e.j.s.session node0 Scavenging every 600000ms
   [junit4]   2> 562261 INFO  (TEST-BasicAuthIntegrationTest.testBasicAuth-seed#[C55C200D0B21752C]) [     ] o.e.j.s.h.ContextHandler Started o.e.j.s.ServletContextHandler@390901a0{/solr,null,AVAILABLE}
   [junit4]   2> 562262 INFO  (TEST-BasicAuthIntegrationTest.testBasicAuth-seed#[C55C200D0B21752C]) [     ] o.e.j.s.AbstractConnector Started ServerConnector@8c58eaa{ssl,[ssl, alpn, http/1.1, h2]}{127.0.0.1:?????}
   [junit4]   2> 562262 INFO  (TEST-BasicAuthIntegrationTest.testBasicAuth-seed#[C55C200D0B21752C]) [     ] o.e.j.s.Server Started @??????ms
   [junit4]   2> 562262 INFO  (TEST-BasicAuthIntegrationTest.testBasicAuth-seed#[C55C200D0B21752C]) [     ] o.a.s.c.s.e.JettySolrRunner Jetty properties: {hostContext=/solr, hostPort=38619}
   [junit4]   2> 562262 ERROR (TEST-BasicAuthIntegrationTest.testBasicAuth-seed#[C55C200D0B21752C]) [     ] o.a.s.u.StartupLoggingUtils Missing Java Option solr.log.dir. Logging may be missing or incomplete.
   [junit4]   2> 562262 INFO  (TEST-BasicAuthIntegrationTest.testBasicAuth-seed#[C55C200D0B21752C]) [     ] o.a.s.s.SolrDispatchFilter Using logger factory org.apache.logging.slf4j.Log4jLoggerFactory
   [junit4]   2> 562262 INFO  (TEST-BasicAuthIntegrationTest.testBasicAuth-seed#[C55C200D0B21752C]) [     ] o.a.s.s.SolrDispatchFilter  ___      _       Welcome to Apache Solr? version 9.0.0
   [junit4]   2> 562262 INFO  (TEST-BasicAuthIntegrationTest.testBasicAuth-seed#[C55C200D0B21752C]) [     ] o.a.s.s.SolrDispatchFilter / __| ___| |_ _   Starting in cloud mode on port null
   [junit4]   2> 562262 INFO  (TEST-BasicAuthIntegrationTest.testBasicAuth-seed#[C55C200D0B21752C]) [     ] o.a.s.s.SolrDispatchFilter \__ \/ _ \ | '_|  Install dir: null
   [junit4]   2> 562262 INFO  (TEST-BasicAuthIntegrationTest.testBasicAuth-seed#[C55C200D0B21752C]) [     ] o.a.s.s.SolrDispatchFilter |___/\___/_|_|    Start time: 2019-07-22T10:17:38.134546Z
   [junit4]   2> 562263 INFO  (TEST-BasicAuthIntegrationTest.testBasicAuth-seed#[C55C200D0B21752C]) [     ] o.a.s.c.c.ConnectionManager Waiting for client to connect to ZooKeeper
   [junit4]   2> 562263 INFO  (zkConnectionManagerCallback-6768-thread-1) [     ] o.a.s.c.c.ConnectionManager zkClient has connected
   [junit4]   2> 562263 INFO  (TEST-BasicAuthIntegrationTest.testBasicAuth-seed#[C55C200D0B21752C]) [     ] o.a.s.c.c.ConnectionManager Client is connected to ZooKeeper
   [junit4]   2> 562264 INFO  (TEST-BasicAuthIntegrationTest.testBasicAuth-seed#[C55C200D0B21752C]) [     ] o.a.s.s.SolrDispatchFilter solr.xml found in ZooKeeper. Loading...
   [junit4]   2> 562360 INFO  (OverseerCollectionConfigSetProcessor-72208617002958856-127.0.0.1:44971_solr-n_0000000000) [n:127.0.0.1:44971_solr     ] o.a.s.c.OverseerTaskQueue Response ZK path: /overseer/collection-queue-work/qnr-0000000000 doesn't exist.  Requestor may have disconnected from ZooKeeper
   [junit4]   2> 562423 INFO  (TEST-BasicAuthIntegrationTest.testBasicAuth-seed#[C55C200D0B21752C]) [     ] o.a.s.h.c.HttpShardHandlerFactory Host whitelist initialized: WhitelistHostChecker [whitelistHosts=null, whitelistHostCheckingEnabled=true]
   [junit4]   2> 562424 WARN  (TEST-BasicAuthIntegrationTest.tes

[...truncated too long message...]

rom ZooKeeper... (3) -> (2)
   [junit4]   2> 21074 INFO  (closeThreadPool-219-thread-1) [     ] o.a.s.c.Overseer Overseer (id=72208804576100363-127.0.0.1:36833_solr-n_0000000000) closing
   [junit4]   2> 21099 INFO  (jetty-closer-208-thread-3) [     ] o.a.s.m.SolrMetricManager Closing metric reporters for registry=solr.node, tag=null
   [junit4]   2> 21103 INFO  (jetty-closer-208-thread-3) [     ] o.a.s.m.r.SolrJmxReporter Closing reporter [org.apache.solr.metrics.reporters.SolrJmxReporter@503ccce3: rootName = solr_34643, domain = solr.node, service url = null, agent id = null] for registry solr.node / com.codahale.metrics.MetricRegistry@3a3e8617
   [junit4]   2> 21108 INFO  (jetty-closer-208-thread-3) [     ] o.a.s.m.SolrMetricManager Closing metric reporters for registry=solr.jvm, tag=null
   [junit4]   2> 21109 INFO  (jetty-closer-208-thread-3) [     ] o.a.s.m.r.SolrJmxReporter Closing reporter [org.apache.solr.metrics.reporters.SolrJmxReporter@5b64b888: rootName = solr_34643, domain = solr.jvm, service url = null, agent id = null] for registry solr.jvm / com.codahale.metrics.MetricRegistry@3fc19e88
   [junit4]   2> 21111 INFO  (jetty-closer-208-thread-3) [     ] o.a.s.m.SolrMetricManager Closing metric reporters for registry=solr.jetty, tag=null
   [junit4]   2> 21111 INFO  (jetty-closer-208-thread-3) [     ] o.a.s.m.r.SolrJmxReporter Closing reporter [org.apache.solr.metrics.reporters.SolrJmxReporter@495b5b93: rootName = solr_34643, domain = solr.jetty, service url = null, agent id = null] for registry solr.jetty / com.codahale.metrics.MetricRegistry@33b2a00d
   [junit4]   2> 21112 INFO  (jetty-closer-208-thread-3) [     ] o.a.s.m.SolrMetricManager Closing metric reporters for registry=solr.cluster, tag=null
   [junit4]   2> 21158 INFO  (zkCallback-204-thread-1) [     ] o.a.s.c.c.ZkStateReader Updated live nodes from ZooKeeper... (3) -> (2)
   [junit4]   2> 21158 INFO  (zkCallback-166-thread-1) [     ] o.a.s.c.c.ZkStateReader Updated live nodes from ZooKeeper... (3) -> (2)
   [junit4]   2> 21159 INFO  (zkCallback-164-thread-1) [     ] o.a.s.c.c.ZkStateReader Updated live nodes from ZooKeeper... (3) -> (2)
   [junit4]   2> 21162 INFO  (zkCallback-204-thread-1) [     ] o.a.s.c.c.ZkStateReader Updated live nodes from ZooKeeper... (2) -> (1)
   [junit4]   2> 21163 INFO  (zkCallback-197-thread-3) [     ] o.a.s.c.c.ZkStateReader Updated live nodes from ZooKeeper... (2) -> (1)
   [junit4]   2> 21262 INFO  (jetty-closer-208-thread-1) [     ] o.a.s.c.Overseer Overseer (id=72208804576100363-127.0.0.1:36833_solr-n_0000000000) closing
   [junit4]   2> 21365 INFO  (jetty-closer-208-thread-1) [     ] o.e.j.s.AbstractConnector Stopped ServerConnector@40049d7c{ssl,[ssl, alpn, http/1.1, h2]}{127.0.0.1:?}
   [junit4]   2> 21365 INFO  (jetty-closer-208-thread-1) [     ] o.e.j.s.h.ContextHandler Stopped o.e.j.s.ServletContextHandler@7010ab1a{/solr,null,UNAVAILABLE}
   [junit4]   2> 21365 INFO  (jetty-closer-208-thread-1) [     ] o.e.j.s.session node0 Stopped scavenging
   [junit4]   2> 21467 INFO  (jetty-closer-208-thread-2) [     ] o.e.j.s.AbstractConnector Stopped ServerConnector@899a6f9{ssl,[ssl, alpn, http/1.1, h2]}{127.0.0.1:?}
   [junit4]   2> 21467 INFO  (jetty-closer-208-thread-2) [     ] o.e.j.s.h.ContextHandler Stopped o.e.j.s.ServletContextHandler@1a775d06{/solr,null,UNAVAILABLE}
   [junit4]   2> 21467 INFO  (jetty-closer-208-thread-2) [     ] o.e.j.s.session node0 Stopped scavenging
   [junit4]   2> 21566 INFO  (jetty-closer-208-thread-3) [     ] o.e.j.s.AbstractConnector Stopped ServerConnector@550272ef{ssl,[ssl, alpn, http/1.1, h2]}{127.0.0.1:?????}
   [junit4]   2> 21566 INFO  (jetty-closer-208-thread-3) [     ] o.e.j.s.h.ContextHandler Stopped o.e.j.s.ServletContextHandler@ad2de1{/solr,null,UNAVAILABLE}
   [junit4]   2> 21567 INFO  (jetty-closer-208-thread-3) [     ] o.e.j.s.session node0 Stopped scavenging
   [junit4]   2> 21567 INFO  (TEST-BasicAuthIntegrationTest.testBasicAuth-seed#[C55C200D0B21752C]) [     ] o.a.s.c.ZkTestServer Shutting down ZkTestServer.
   [junit4]   2> 21770 WARN  (ZkTestServer Run Thread) [     ] o.a.s.c.ZkTestServer Watch limit violations: 
   [junit4]   2> Maximum concurrent create/delete watches above limit:
   [junit4]   2> 
   [junit4]   2> 	9	/solr/aliases.json
   [junit4]   2> 	4	/solr/security.json
   [junit4]   2> 	4	/solr/configs/conf
   [junit4]   2> 	3	/solr/collections/authCollection/terms/shard2
   [junit4]   2> 	2	/solr/collections/authCollection/terms/shard1
   [junit4]   2> 	2	/solr/collections/authCollection/terms/shard3
   [junit4]   2> 
   [junit4]   2> Maximum concurrent data watches above limit:
   [junit4]   2> 
   [junit4]   2> 	51	/solr/collections/authCollection/state.json
   [junit4]   2> 	9	/solr/clusterstate.json
   [junit4]   2> 	9	/solr/clusterprops.json
   [junit4]   2> 	3	/solr/security.json
   [junit4]   2> 	2	/solr/overseer_elect/election/72208804576100362-127.0.0.1:40265_solr-n_0000000001
   [junit4]   2> 
   [junit4]   2> Maximum concurrent children watches above limit:
   [junit4]   2> 
   [junit4]   2> 	37	/solr/live_nodes
   [junit4]   2> 	28	/solr/overseer/queue
   [junit4]   2> 	16	/solr/collections
   [junit4]   2> 	4	/solr/overseer/collection-queue-work
   [junit4]   2> 
   [junit4]   2> 21773 INFO  (TEST-BasicAuthIntegrationTest.testBasicAuth-seed#[C55C200D0B21752C]) [     ] o.a.s.c.ZkTestServer parse host and port list: 127.0.0.1:41607
   [junit4]   2> 21774 INFO  (TEST-BasicAuthIntegrationTest.testBasicAuth-seed#[C55C200D0B21752C]) [     ] o.a.s.c.ZkTestServer connecting to 127.0.0.1 41607
   [junit4]   2> 21774 INFO  (TEST-BasicAuthIntegrationTest.testBasicAuth-seed#[C55C200D0B21752C]) [     ] o.a.s.SolrTestCaseJ4 ###Ending testBasicAuth
   [junit4]   2> NOTE: reproduce with: ant test  -Dtestcase=BasicAuthIntegrationTest -Dtests.method=testBasicAuth -Dtests.seed=C55C200D0B21752C -Dtests.multiplier=3 -Dtests.slow=true -Dtests.badapples=true -Dtests.locale=ar-KW -Dtests.timezone=America/Cayenne -Dtests.asserts=true -Dtests.file.encoding=US-ASCII
   [junit4] FAILURE 6.55s J0 | BasicAuthIntegrationTest.testBasicAuth <<<
   [junit4]    > Throwable #1: java.lang.AssertionError: expected:<401> but was:<400>
   [junit4]    > 	at __randomizedtesting.SeedInfo.seed([C55C200D0B21752C:7932561FAF72F656]:0)
   [junit4]    > 	at org.apache.solr.security.BasicAuthIntegrationTest.testBasicAuth(BasicAuthIntegrationTest.java:151)
   [junit4]    > 	at java.base/jdk.internal.reflect.NativeMethodAccessorImpl.invoke0(Native Method)
   [junit4]    > 	at java.base/jdk.internal.reflect.NativeMethodAccessorImpl.invoke(NativeMethodAccessorImpl.java:62)
   [junit4]    > 	at java.base/jdk.internal.reflect.DelegatingMethodAccessorImpl.invoke(DelegatingMethodAccessorImpl.java:43)
   [junit4]    > 	at java.base/java.lang.reflect.Method.invoke(Method.java:567)
   [junit4]    > 	at java.base/java.lang.Thread.run(Thread.java:835)
   [junit4]   2> NOTE: leaving temporary files on disk at: /home/jenkins/workspace/Lucene-Solr-master-Linux/solr/build/solr-core/test/J0/temp/solr.security.BasicAuthIntegrationTest_C55C200D0B21752C-002
   [junit4]   2> Jul 22, 2019 11:05:24 AM com.carrotsearch.randomizedtesting.ThreadLeakControl checkThreadLeaks
   [junit4]   2> WARNING: Will linger awaiting termination of 1 leaked thread(s).
   [junit4]   2> NOTE: test params are: codec=Asserting(Lucene80): {}, docValues:{}, maxPointsInLeafNode=17, maxMBSortInHeap=7.267295690573695, sim=Asserting(org.apache.lucene.search.similarities.AssertingSimilarity@55d06ac0), locale=ar-KW, timezone=America/Cayenne
   [junit4]   2> NOTE: Linux 4.18.0-24-generic amd64/AdoptOpenJDK 12.0.1 (64-bit)/cpus=8,threads=1,free=378822240,total=495452160
   [junit4]   2> NOTE: All tests run in this JVM: [BasicAuthIntegrationTest, BasicAuthIntegrationTest]
   [junit4] Completed [5/5 (5!)] on J0 in 7.58s, 1 test, 1 failure <<< FAILURES!

[...truncated 15 lines...]
BUILD FAILED
/home/jenkins/workspace/Lucene-Solr-master-Linux/lucene/common-build.xml:1492: The following error occurred while executing this line:
/home/jenkins/workspace/Lucene-Solr-master-Linux/lucene/common-build.xml:1019: There were test failures: 5 suites, 5 tests, 5 failures [seed: C55C200D0B21752C]

Total time: 25 seconds

[repro] Setting last failure code to 256

[repro] Failures:
[repro]   5/5 failed: org.apache.solr.security.BasicAuthIntegrationTest
[repro] Exiting with code 256
+ mv lucene/build lucene/build.repro
+ mv solr/build solr/build.repro
+ mv lucene/build.orig lucene/build
+ mv solr/build.orig solr/build
Archiving artifacts
Setting ANT_1_8_2_HOME=/home/jenkins/tools/hudson.tasks.Ant_AntInstallation/ANT_1.8.2
[WARNINGS] Parsing warnings in console log with parser Java Compiler (javac)
Setting ANT_1_8_2_HOME=/home/jenkins/tools/hudson.tasks.Ant_AntInstallation/ANT_1.8.2
No credentials specified
Setting ANT_1_8_2_HOME=/home/jenkins/tools/hudson.tasks.Ant_AntInstallation/ANT_1.8.2
<Git Blamer> Using GitBlamer to create author and commit information for all warnings.
<Git Blamer> GIT_COMMIT=afa64c892bff68f3b4f41cd371587c55507946e3, workspace=/home/jenkins/workspace/Lucene-Solr-master-Linux
[WARNINGS] Computing warning deltas based on reference build #24430
Recording test results
Setting ANT_1_8_2_HOME=/home/jenkins/tools/hudson.tasks.Ant_AntInstallation/ANT_1.8.2
Build step 'Publish JUnit test result report' changed build result to UNSTABLE
Email was triggered for: Unstable (Test Failures)
Sending email for trigger: Unstable (Test Failures)
Setting ANT_1_8_2_HOME=/home/jenkins/tools/hudson.tasks.Ant_AntInstallation/ANT_1.8.2
Setting ANT_1_8_2_HOME=/home/jenkins/tools/hudson.tasks.Ant_AntInstallation/ANT_1.8.2
Setting ANT_1_8_2_HOME=/home/jenkins/tools/hudson.tasks.Ant_AntInstallation/ANT_1.8.2
Setting ANT_1_8_2_HOME=/home/jenkins/tools/hudson.tasks.Ant_AntInstallation/ANT_1.8.2
Setting ANT_1_8_2_HOME=/home/jenkins/tools/hudson.tasks.Ant_AntInstallation/ANT_1.8.2
Setting ANT_1_8_2_HOME=/home/jenkins/tools/hudson.tasks.Ant_AntInstallation/ANT_1.8.2

Mime
View raw message