lucene-dev mailing list archives

Site index · List index
Message view « Date » · « Thread »
Top « Date » · « Thread »
From Apache Jenkins Server <jenk...@builds.apache.org>
Subject [JENKINS] Lucene-Solr-NightlyTests-8.1 - Build # 54 - Still unstable
Date Sun, 07 Jul 2019 06:14:00 GMT
Build: https://builds.apache.org/job/Lucene-Solr-NightlyTests-8.1/54/

1 tests failed.
FAILED:  org.apache.solr.search.mlt.SimpleMLTQParserTest.doTest

Error Message:
Exception during query

Stack Trace:
java.lang.RuntimeException: Exception during query
	at __randomizedtesting.SeedInfo.seed([99D002DA51CDC36E:3E94BA7E3C76D0D7]:0)
	at org.apache.solr.SolrTestCaseJ4.assertQ(SolrTestCaseJ4.java:939)
	at org.apache.solr.SolrTestCaseJ4.assertQ(SolrTestCaseJ4.java:899)
	at org.apache.solr.search.mlt.SimpleMLTQParserTest.doTest(SimpleMLTQParserTest.java:82)
	at sun.reflect.NativeMethodAccessorImpl.invoke0(Native Method)
	at sun.reflect.NativeMethodAccessorImpl.invoke(NativeMethodAccessorImpl.java:62)
	at sun.reflect.DelegatingMethodAccessorImpl.invoke(DelegatingMethodAccessorImpl.java:43)
	at java.lang.reflect.Method.invoke(Method.java:498)
	at com.carrotsearch.randomizedtesting.RandomizedRunner.invoke(RandomizedRunner.java:1750)
	at com.carrotsearch.randomizedtesting.RandomizedRunner$8.evaluate(RandomizedRunner.java:938)
	at com.carrotsearch.randomizedtesting.RandomizedRunner$9.evaluate(RandomizedRunner.java:974)
	at com.carrotsearch.randomizedtesting.RandomizedRunner$10.evaluate(RandomizedRunner.java:988)
	at com.carrotsearch.randomizedtesting.rules.SystemPropertiesRestoreRule$1.evaluate(SystemPropertiesRestoreRule.java:57)
	at org.apache.lucene.util.TestRuleSetupTeardownChained$1.evaluate(TestRuleSetupTeardownChained.java:49)
	at org.apache.lucene.util.AbstractBeforeAfterRule$1.evaluate(AbstractBeforeAfterRule.java:45)
	at org.apache.lucene.util.TestRuleThreadAndTestName$1.evaluate(TestRuleThreadAndTestName.java:48)
	at org.apache.lucene.util.TestRuleIgnoreAfterMaxFailures$1.evaluate(TestRuleIgnoreAfterMaxFailures.java:64)
	at org.apache.lucene.util.TestRuleMarkFailure$1.evaluate(TestRuleMarkFailure.java:47)
	at com.carrotsearch.randomizedtesting.rules.StatementAdapter.evaluate(StatementAdapter.java:36)
	at com.carrotsearch.randomizedtesting.ThreadLeakControl$StatementRunner.run(ThreadLeakControl.java:368)
	at com.carrotsearch.randomizedtesting.ThreadLeakControl.forkTimeoutingTask(ThreadLeakControl.java:817)
	at com.carrotsearch.randomizedtesting.ThreadLeakControl$3.evaluate(ThreadLeakControl.java:468)
	at com.carrotsearch.randomizedtesting.RandomizedRunner.runSingleTest(RandomizedRunner.java:947)
	at com.carrotsearch.randomizedtesting.RandomizedRunner$5.evaluate(RandomizedRunner.java:832)
	at com.carrotsearch.randomizedtesting.RandomizedRunner$6.evaluate(RandomizedRunner.java:883)
	at com.carrotsearch.randomizedtesting.RandomizedRunner$7.evaluate(RandomizedRunner.java:894)
	at com.carrotsearch.randomizedtesting.rules.StatementAdapter.evaluate(StatementAdapter.java:36)
	at com.carrotsearch.randomizedtesting.rules.SystemPropertiesRestoreRule$1.evaluate(SystemPropertiesRestoreRule.java:57)
	at org.apache.lucene.util.AbstractBeforeAfterRule$1.evaluate(AbstractBeforeAfterRule.java:45)
	at com.carrotsearch.randomizedtesting.rules.StatementAdapter.evaluate(StatementAdapter.java:36)
	at org.apache.lucene.util.TestRuleStoreClassName$1.evaluate(TestRuleStoreClassName.java:41)
	at com.carrotsearch.randomizedtesting.rules.NoShadowingOrOverridesOnMethodsRule$1.evaluate(NoShadowingOrOverridesOnMethodsRule.java:40)
	at com.carrotsearch.randomizedtesting.rules.NoShadowingOrOverridesOnMethodsRule$1.evaluate(NoShadowingOrOverridesOnMethodsRule.java:40)
	at com.carrotsearch.randomizedtesting.rules.StatementAdapter.evaluate(StatementAdapter.java:36)
	at com.carrotsearch.randomizedtesting.rules.StatementAdapter.evaluate(StatementAdapter.java:36)
	at com.carrotsearch.randomizedtesting.rules.StatementAdapter.evaluate(StatementAdapter.java:36)
	at org.apache.lucene.util.TestRuleAssertionsRequired$1.evaluate(TestRuleAssertionsRequired.java:53)
	at org.apache.lucene.util.TestRuleMarkFailure$1.evaluate(TestRuleMarkFailure.java:47)
	at org.apache.lucene.util.TestRuleIgnoreAfterMaxFailures$1.evaluate(TestRuleIgnoreAfterMaxFailures.java:64)
	at org.apache.lucene.util.TestRuleIgnoreTestSuites$1.evaluate(TestRuleIgnoreTestSuites.java:54)
	at com.carrotsearch.randomizedtesting.rules.StatementAdapter.evaluate(StatementAdapter.java:36)
	at com.carrotsearch.randomizedtesting.ThreadLeakControl$StatementRunner.run(ThreadLeakControl.java:368)
	at java.lang.Thread.run(Thread.java:748)
Caused by: java.lang.RuntimeException: REQUEST FAILED: xpath=//result/doc[5]/str[@name='id'][.='18']
	xml response was: <?xml version="1.0" encoding="UTF-8"?>
<response>
<lst name="responseHeader"><int name="status">0</int><int name="QTime">3</int></lst><result name="response" numFound="16" start="0"><doc><str name="id">13</str><arr name="range_facet_l"><long>13</long></arr><int name="id_i1">13</int><arr name="range_facet_l_dv"><long>13</long></arr><arr name="range_facet_i_dv"><int>13</int></arr><arr name="lowerfilt"><str>The quote red fox jumped over the lazy brown dogs.</str></arr><arr name="lowerfilt1and2"><str>The quote red fox jumped over the lazy brown dogs.</str></arr><arr name="multiDefault"><str>muLti-Default</str></arr><int name="intDefault">42</int><date name="timestamp">2019-07-07T05:41:30.582Z</date><long name="_version_">1638377026310111232</long><int name="intDvoDefault">42</int></doc><doc><str name="id">14</str><arr name="range_facet_l"><long>14</long></arr><int name="id_i1">14</int><arr name="range_facet_l_dv"><long>14</long></arr><arr name="range_facet_i_dv"><int>14</int></arr><arr name="lowerfilt"><str>The quote red fox jumped over the lazy brown dogs.</str></arr><arr name="lowerfilt1and2"><str>The quote red fox jumped over the lazy brown dogs.</str></arr><arr name="multiDefault"><str>muLti-Default</str></arr><int name="intDefault">42</int><date name="timestamp">2019-07-07T05:41:30.582Z</date><long name="_version_">1638377026310111233</long><int name="intDvoDefault">42</int></doc><doc><str name="id">15</str><arr name="range_facet_l"><long>15</long></arr><int name="id_i1">15</int><arr name="range_facet_l_dv"><long>15</long></arr><arr name="range_facet_i_dv"><int>15</int></arr><arr name="lowerfilt"><str>The fat red fox jumped over the lazy brown dogs.</str></arr><arr name="lowerfilt1and2"><str>The fat red fox jumped over the lazy brown dogs.</str></arr><arr name="multiDefault"><str>muLti-Default</str></arr><int name="intDefault">42</int><date name="timestamp">2019-07-07T05:41:30.582Z</date><long name="_version_">1638377026310111234</long><int name="intDvoDefault">42</int></doc><doc><str name="id">16</str><arr name="range_facet_l"><long>16</long></arr><int name="id_i1">16</int><arr name="range_facet_l_dv"><long>16</long></arr><arr name="range_facet_i_dv"><int>16</int></arr><arr name="lowerfilt"><str>The slim red fox jumped over the lazy brown dogs.</str></arr><arr name="lowerfilt1and2"><str>The slim red fox jumped over the lazy brown dogs.</str></arr><arr name="multiDefault"><str>muLti-Default</str></arr><int name="intDefault">42</int><date name="timestamp">2019-07-07T05:41:30.583Z</date><long name="_version_">1638377026311159808</long><int name="intDvoDefault">42</int></doc><doc><str name="id">32</str><arr name="range_facet_l"><long>32</long></arr><int name="id_i1">32</int><arr name="range_facet_l_dv"><long>32</long></arr><arr name="range_facet_i_dv"><int>32</int></arr><arr name="lowerfilt"><str>The slim red fox jumped over the lazy brown dogs.</str></arr><arr name="lowerfilt1and2"><str>The slim red fox jumped over the lazy brown dogs.</str><str>yellow white black</str></arr><arr name="lowerfilt1"><str>yellow white black</str></arr><arr name="multiDefault"><str>muLti-Default</str></arr><int name="intDefault">42</int><date name="timestamp">2019-07-07T05:41:30.601Z</date><long name="_version_">1638377026330034176</long><int name="intDvoDefault">42</int></doc><doc><str name="id">18</str><arr name="range_facet_l"><long>18</long></arr><int name="id_i1">18</int><arr name="range_facet_l_dv"><long>18</long></arr><arr name="range_facet_i_dv"><int>18</int></arr><arr name="lowerfilt"><str>The quote red fox jumped over the lazy brown dogs.</str></arr><arr name="lowerfilt1and2"><str>The quote red fox jumped over the lazy brown dogs.</str></arr><arr name="multiDefault"><str>muLti-Default</str></arr><int name="intDefault">42</int><date name="timestamp">2019-07-07T05:41:30.589Z</date><long name="_version_">1638377026317451264</long><int name="intDvoDefault">42</int></doc><doc><str name="id">19</str><arr name="range_facet_l"><long>19</long></arr><int name="id_i1">19</int><arr name="range_facet_l_dv"><long>19</long></arr><arr name="range_facet_i_dv"><int>19</int></arr><arr name="lowerfilt"><str>The hose red fox jumped over the lazy brown dogs.</str></arr><arr name="lowerfilt1and2"><str>The hose red fox jumped over the lazy brown dogs.</str></arr><arr name="multiDefault"><str>muLti-Default</str></arr><int name="intDefault">42</int><date name="timestamp">2019-07-07T05:41:30.589Z</date><long name="_version_">1638377026317451265</long><int name="intDvoDefault">42</int></doc><doc><str name="id">20</str><arr name="range_facet_l"><long>20</long></arr><int name="id_i1">20</int><arr name="range_facet_l_dv"><long>20</long></arr><arr name="range_facet_i_dv"><int>20</int></arr><arr name="lowerfilt"><str>The quote red fox jumped over the lazy brown dogs.</str></arr><arr name="lowerfilt1and2"><str>The quote red fox jumped over the lazy brown dogs.</str></arr><arr name="multiDefault"><str>muLti-Default</str></arr><int name="intDefault">42</int><date name="timestamp">2019-07-07T05:41:30.590Z</date><long name="_version_">1638377026318499840</long><int name="intDvoDefault">42</int></doc><doc><str name="id">21</str><arr name="range_facet_l"><long>21</long></arr><int name="id_i1">21</int><arr name="range_facet_l_dv"><long>21</long></arr><arr name="range_facet_i_dv"><int>21</int></arr><arr name="lowerfilt"><str>The court red fox jumped over the lazy brown dogs.</str></arr><arr name="lowerfilt1and2"><str>The court red fox jumped over the lazy brown dogs.</str></arr><arr name="multiDefault"><str>muLti-Default</str></arr><int name="intDefault">42</int><date name="timestamp">2019-07-07T05:41:30.590Z</date><long name="_version_">1638377026318499841</long><int name="intDvoDefault">42</int></doc><doc><str name="id">22</str><arr name="range_facet_l"><long>22</long></arr><int name="id_i1">22</int><arr name="range_facet_l_dv"><long>22</long></arr><arr name="range_facet_i_dv"><int>22</int></arr><arr name="lowerfilt"><str>The quote red fox jumped over the lazy brown dogs.</str></arr><arr name="lowerfilt1and2"><str>The quote red fox jumped over the lazy brown dogs.</str></arr><arr name="multiDefault"><str>muLti-Default</str></arr><int name="intDefault">42</int><date name="timestamp">2019-07-07T05:41:30.590Z</date><long name="_version_">1638377026318499842</long><int name="intDvoDefault">42</int></doc></result>
</response>

	request was:q={!mlt+qf%3Dlowerfilt}17
	at org.apache.solr.SolrTestCaseJ4.assertQ(SolrTestCaseJ4.java:932)
	... 41 more




Build Log:
[...truncated 15948 lines...]
   [junit4] Suite: org.apache.solr.search.mlt.SimpleMLTQParserTest
   [junit4]   2> 4312024 INFO  (SUITE-SimpleMLTQParserTest-seed#[99D002DA51CDC36E]-worker) [    ] o.a.s.SolrTestCaseJ4 SecureRandom sanity checks: test.solr.allowed.securerandom=null & java.security.egd=file:/dev/./urandom
   [junit4]   2> Creating dataDir: /x1/jenkins/jenkins-slave/workspace/Lucene-Solr-NightlyTests-8.1/checkout/solr/build/solr-core/test/J1/temp/solr.search.mlt.SimpleMLTQParserTest_99D002DA51CDC36E-001/init-core-data-001
   [junit4]   2> 4312034 WARN  (SUITE-SimpleMLTQParserTest-seed#[99D002DA51CDC36E]-worker) [    ] o.a.s.SolrTestCaseJ4 startTrackingSearchers: numOpens=6 numCloses=6
   [junit4]   2> 4312034 INFO  (SUITE-SimpleMLTQParserTest-seed#[99D002DA51CDC36E]-worker) [    ] o.a.s.SolrTestCaseJ4 Using PointFields (NUMERIC_POINTS_SYSPROP=true) w/NUMERIC_DOCVALUES_SYSPROP=true
   [junit4]   2> 4312037 INFO  (SUITE-SimpleMLTQParserTest-seed#[99D002DA51CDC36E]-worker) [    ] o.a.s.SolrTestCaseJ4 Randomized ssl (true) and clientAuth (false) via: @org.apache.solr.util.RandomizeSSL(reason=, ssl=NaN, value=NaN, clientAuth=NaN)
   [junit4]   2> 4312038 INFO  (SUITE-SimpleMLTQParserTest-seed#[99D002DA51CDC36E]-worker) [    ] o.a.s.SolrTestCaseJ4 ####initCore
   [junit4]   2> 4312038 INFO  (SUITE-SimpleMLTQParserTest-seed#[99D002DA51CDC36E]-worker) [    ] o.a.s.c.SolrResourceLoader [null] Added 2 libs to classloader, from paths: [/x1/jenkins/jenkins-slave/workspace/Lucene-Solr-NightlyTests-8.1/checkout/solr/core/src/test-files/solr/collection1/lib, /x1/jenkins/jenkins-slave/workspace/Lucene-Solr-NightlyTests-8.1/checkout/solr/core/src/test-files/solr/collection1/lib/classes]
   [junit4]   2> 4312067 INFO  (SUITE-SimpleMLTQParserTest-seed#[99D002DA51CDC36E]-worker) [    ] o.a.s.c.SolrConfig Using Lucene MatchVersion: 8.1.2
   [junit4]   2> 4312102 INFO  (SUITE-SimpleMLTQParserTest-seed#[99D002DA51CDC36E]-worker) [    ] o.a.s.s.IndexSchema [null] Schema name=test
   [junit4]   2> 4312230 INFO  (SUITE-SimpleMLTQParserTest-seed#[99D002DA51CDC36E]-worker) [    ] o.a.s.s.IndexSchema Loaded schema test/1.0 with uniqueid field id
   [junit4]   2> 4312331 INFO  (SUITE-SimpleMLTQParserTest-seed#[99D002DA51CDC36E]-worker) [    ] o.a.s.h.c.HttpShardHandlerFactory Host whitelist initialized: WhitelistHostChecker [whitelistHosts=null, whitelistHostCheckingEnabled=true]
   [junit4]   2> 4312331 WARN  (SUITE-SimpleMLTQParserTest-seed#[99D002DA51CDC36E]-worker) [    ] o.a.s.c.s.i.Http2SolrClient Create Http2SolrClient with HTTP/1.1 transport since Java 8 or lower versions does not support SSL + HTTP/2
   [junit4]   2> 4312332 WARN  (SUITE-SimpleMLTQParserTest-seed#[99D002DA51CDC36E]-worker) [    ] o.e.j.u.s.S.config No Client EndPointIdentificationAlgorithm configured for SslContextFactory@70737983[provider=null,keyStore=null,trustStore=null]
   [junit4]   2> 4312342 WARN  (SUITE-SimpleMLTQParserTest-seed#[99D002DA51CDC36E]-worker) [    ] o.a.s.c.s.i.Http2SolrClient Create Http2SolrClient with HTTP/1.1 transport since Java 8 or lower versions does not support SSL + HTTP/2
   [junit4]   2> 4312342 WARN  (SUITE-SimpleMLTQParserTest-seed#[99D002DA51CDC36E]-worker) [    ] o.e.j.u.s.S.config No Client EndPointIdentificationAlgorithm configured for SslContextFactory@75031c1a[provider=null,keyStore=null,trustStore=null]
   [junit4]   2> 4312552 INFO  (SUITE-SimpleMLTQParserTest-seed#[99D002DA51CDC36E]-worker) [    ] o.a.s.c.TransientSolrCoreCacheDefault Allocating transient cache for 2147483647 transient cores
   [junit4]   2> 4312552 INFO  (SUITE-SimpleMLTQParserTest-seed#[99D002DA51CDC36E]-worker) [    ] o.a.s.h.a.MetricsHistoryHandler No .system collection, keeping metrics history in memory.
   [junit4]   2> 4312586 INFO  (SUITE-SimpleMLTQParserTest-seed#[99D002DA51CDC36E]-worker) [    ] o.a.s.m.r.SolrJmxReporter JMX monitoring for 'solr.node' (registry 'solr.node') enabled at server: com.sun.jmx.mbeanserver.JmxMBeanServer@113f8c9c
   [junit4]   2> 4312600 INFO  (SUITE-SimpleMLTQParserTest-seed#[99D002DA51CDC36E]-worker) [    ] o.a.s.m.r.SolrJmxReporter JMX monitoring for 'solr.jvm' (registry 'solr.jvm') enabled at server: com.sun.jmx.mbeanserver.JmxMBeanServer@113f8c9c
   [junit4]   2> 4312600 INFO  (SUITE-SimpleMLTQParserTest-seed#[99D002DA51CDC36E]-worker) [    ] o.a.s.m.r.SolrJmxReporter JMX monitoring for 'solr.jetty' (registry 'solr.jetty') enabled at server: com.sun.jmx.mbeanserver.JmxMBeanServer@113f8c9c
   [junit4]   2> 4312604 INFO  (coreLoadExecutor-16531-thread-1) [    x:collection1] o.a.s.c.SolrResourceLoader [null] Added 2 libs to classloader, from paths: [/x1/jenkins/jenkins-slave/workspace/Lucene-Solr-NightlyTests-8.1/checkout/solr/core/src/test-files/solr/collection1/lib, /x1/jenkins/jenkins-slave/workspace/Lucene-Solr-NightlyTests-8.1/checkout/solr/core/src/test-files/solr/collection1/lib/classes]
   [junit4]   2> 4312650 INFO  (coreLoadExecutor-16531-thread-1) [    x:collection1] o.a.s.c.SolrConfig Using Lucene MatchVersion: 8.1.2
   [junit4]   2> 4312698 INFO  (coreLoadExecutor-16531-thread-1) [    x:collection1] o.a.s.s.IndexSchema [collection1] Schema name=test
   [junit4]   2> 4312842 INFO  (coreLoadExecutor-16531-thread-1) [    x:collection1] o.a.s.s.IndexSchema Loaded schema test/1.0 with uniqueid field id
   [junit4]   2> 4312852 INFO  (coreLoadExecutor-16531-thread-1) [    x:collection1] o.a.s.c.CoreContainer Creating SolrCore 'collection1' using configuration from instancedir /x1/jenkins/jenkins-slave/workspace/Lucene-Solr-NightlyTests-8.1/checkout/solr/core/src/test-files/solr/collection1, trusted=true
   [junit4]   2> 4312852 INFO  (coreLoadExecutor-16531-thread-1) [    x:collection1] o.a.s.m.r.SolrJmxReporter JMX monitoring for 'solr.core.collection1' (registry 'solr.core.collection1') enabled at server: com.sun.jmx.mbeanserver.JmxMBeanServer@113f8c9c
   [junit4]   2> 4312852 INFO  (coreLoadExecutor-16531-thread-1) [    x:collection1] o.a.s.c.SolrCore [[collection1] ] Opening new SolrCore at [/x1/jenkins/jenkins-slave/workspace/Lucene-Solr-NightlyTests-8.1/checkout/solr/core/src/test-files/solr/collection1], dataDir=[/x1/jenkins/jenkins-slave/workspace/Lucene-Solr-NightlyTests-8.1/checkout/solr/build/solr-core/test/J1/temp/solr.search.mlt.SimpleMLTQParserTest_99D002DA51CDC36E-001/init-core-data-001/]
   [junit4]   2> 4312854 INFO  (coreLoadExecutor-16531-thread-1) [    x:collection1] o.a.s.u.RandomMergePolicy RandomMergePolicy wrapping class org.apache.lucene.index.LogDocMergePolicy: [LogDocMergePolicy: minMergeSize=1000, mergeFactor=18, maxMergeSize=9223372036854775807, maxMergeSizeForForcedMerge=9223372036854775807, calibrateSizeByDeletes=true, maxMergeDocs=2147483647, maxCFSSegmentSizeMB=8.796093022207999E12, noCFSRatio=1.0]
   [junit4]   2> 4312932 INFO  (coreLoadExecutor-16531-thread-1) [    x:collection1] o.a.s.u.UpdateHandler Using UpdateLog implementation: org.apache.solr.update.UpdateLog
   [junit4]   2> 4312932 INFO  (coreLoadExecutor-16531-thread-1) [    x:collection1] o.a.s.u.UpdateLog Initializing UpdateLog: dataDir= defaultSyncLevel=FLUSH numRecordsToKeep=100 maxNumLogsToKeep=10 numVersionBuckets=65536
   [junit4]   2> 4312933 INFO  (coreLoadExecutor-16531-thread-1) [    x:collection1] o.a.s.u.CommitTracker Hard AutoCommit: disabled
   [junit4]   2> 4312933 INFO  (coreLoadExecutor-16531-thread-1) [    x:collection1] o.a.s.u.CommitTracker Soft AutoCommit: disabled
   [junit4]   2> 4312934 INFO  (coreLoadExecutor-16531-thread-1) [    x:collection1] o.a.s.u.RandomMergePolicy RandomMergePolicy wrapping class org.apache.lucene.index.TieredMergePolicy: [TieredMergePolicy: maxMergeAtOnce=23, maxMergeAtOnceExplicit=25, maxMergedSegmentMB=48.1103515625, floorSegmentMB=1.5810546875, forceMergeDeletesPctAllowed=27.845438351328003, segmentsPerTier=2.0, maxCFSSegmentSizeMB=8.796093022207999E12, noCFSRatio=1.0, deletesPctAllowed=22.927326678195662
   [junit4]   2> 4312935 INFO  (coreLoadExecutor-16531-thread-1) [    x:collection1] o.a.s.s.SolrIndexSearcher Opening [Searcher@4cc30490[collection1] main]
   [junit4]   2> 4312935 INFO  (coreLoadExecutor-16531-thread-1) [    x:collection1] o.a.s.h.c.SpellCheckComponent Initializing spell checkers
   [junit4]   2> 4312960 INFO  (coreLoadExecutor-16531-thread-1) [    x:collection1] o.a.s.s.DirectSolrSpellChecker init: {name=direct,classname=DirectSolrSpellChecker,field=lowerfilt,minQueryLength=3}
   [junit4]   2> 4313056 INFO  (coreLoadExecutor-16531-thread-1) [    x:collection1] o.a.s.h.ReplicationHandler Commits will be reserved for 10000ms.
   [junit4]   2> 4313056 INFO  (coreLoadExecutor-16531-thread-1) [    x:collection1] o.a.s.u.UpdateLog Could not find max version in index or recent updates, using new clock 1638377026272362496
   [junit4]   2> 4313058 INFO  (searcherExecutor-16532-thread-1-processing-x:collection1) [    x:collection1] o.a.s.h.c.SpellCheckComponent Loading spell index for spellchecker: default
   [junit4]   2> 4313058 INFO  (searcherExecutor-16532-thread-1-processing-x:collection1) [    x:collection1] o.a.s.h.c.SpellCheckComponent Loading spell index for spellchecker: direct
   [junit4]   2> 4313058 INFO  (searcherExecutor-16532-thread-1-processing-x:collection1) [    x:collection1] o.a.s.h.c.SpellCheckComponent Loading spell index for spellchecker: wordbreak
   [junit4]   2> 4313058 INFO  (searcherExecutor-16532-thread-1-processing-x:collection1) [    x:collection1] o.a.s.h.c.SpellCheckComponent Loading spell index for spellchecker: multipleFields
   [junit4]   2> 4313061 INFO  (SUITE-SimpleMLTQParserTest-seed#[99D002DA51CDC36E]-worker) [    ] o.a.s.SolrTestCaseJ4 ####initCore end
   [junit4]   2> 4313062 INFO  (searcherExecutor-16532-thread-1-processing-x:collection1) [    x:collection1] o.a.s.h.c.SpellCheckComponent Loading spell index for spellchecker: jarowinkler
   [junit4]   2> 4313062 INFO  (searcherExecutor-16532-thread-1-processing-x:collection1) [    x:collection1] o.a.s.h.c.SpellCheckComponent Loading spell index for spellchecker: external
   [junit4]   2> 4313062 INFO  (searcherExecutor-16532-thread-1-processing-x:collection1) [    x:collection1] o.a.s.h.c.SpellCheckComponent Loading spell index for spellchecker: freq
   [junit4]   2> 4313063 INFO  (searcherExecutor-16532-thread-1-processing-x:collection1) [    x:collection1] o.a.s.h.c.SpellCheckComponent Loading spell index for spellchecker: fqcn
   [junit4]   2> 4313063 INFO  (searcherExecutor-16532-thread-1-processing-x:collection1) [    x:collection1] o.a.s.h.c.SpellCheckComponent Loading spell index for spellchecker: perDict
   [junit4]   2> 4313064 INFO  (searcherExecutor-16532-thread-1-processing-x:collection1) [    x:collection1] o.a.s.c.SolrCore [collection1] Registered new searcher Searcher@4cc30490[collection1] main{ExitableDirectoryReader(UninvertingDirectoryReader())}
   [junit4]   2> 4313071 INFO  (TEST-SimpleMLTQParserTest.doTest-seed#[99D002DA51CDC36E]) [    ] o.a.s.SolrTestCaseJ4 ###Starting doTest
   [junit4]   2> 4313085 INFO  (TEST-SimpleMLTQParserTest.doTest-seed#[99D002DA51CDC36E]) [    ] o.a.s.u.p.LogUpdateProcessorFactory [collection1]  webapp=null path=null params={}{add=[1 (1638377026288091136)]} 0 14
   [junit4]   2> 4313088 INFO  (TEST-SimpleMLTQParserTest.doTest-seed#[99D002DA51CDC36E]) [    ] o.a.s.u.p.LogUpdateProcessorFactory [collection1]  webapp=null path=null params={}{add=[2 (1638377026305916928)]} 0 0
   [junit4]   2> 4313089 INFO  (TEST-SimpleMLTQParserTest.doTest-seed#[99D002DA51CDC36E]) [    ] o.a.s.u.p.LogUpdateProcessorFactory [collection1]  webapp=null path=null params={}{add=[3 (1638377026305916929)]} 0 0
   [junit4]   2> 4313089 INFO  (TEST-SimpleMLTQParserTest.doTest-seed#[99D002DA51CDC36E]) [    ] o.a.s.u.p.LogUpdateProcessorFactory [collection1]  webapp=null path=null params={}{add=[4 (1638377026306965504)]} 0 0
   [junit4]   2> 4313089 INFO  (TEST-SimpleMLTQParserTest.doTest-seed#[99D002DA51CDC36E]) [    ] o.a.s.u.p.LogUpdateProcessorFactory [collection1]  webapp=null path=null params={}{add=[5 (1638377026306965505)]} 0 0
   [junit4]   2> 4313090 INFO  (TEST-SimpleMLTQParserTest.doTest-seed#[99D002DA51CDC36E]) [    ] o.a.s.u.p.LogUpdateProcessorFactory [collection1]  webapp=null path=null params={}{add=[6 (1638377026306965506)]} 0 0
   [junit4]   2> 4313090 INFO  (TEST-SimpleMLTQParserTest.doTest-seed#[99D002DA51CDC36E]) [    ] o.a.s.u.p.LogUpdateProcessorFactory [collection1]  webapp=null path=null params={}{add=[7 (1638377026308014080)]} 0 0
   [junit4]   2> 4313090 INFO  (TEST-SimpleMLTQParserTest.doTest-seed#[99D002DA51CDC36E]) [    ] o.a.s.u.p.LogUpdateProcessorFactory [collection1]  webapp=null path=null params={}{add=[8 (1638377026308014081)]} 0 0
   [junit4]   2> 4313091 INFO  (TEST-SimpleMLTQParserTest.doTest-seed#[99D002DA51CDC36E]) [    ] o.a.s.u.p.LogUpdateProcessorFactory [collection1]  webapp=null path=null params={}{add=[9 (1638377026309062656)]} 0 0
   [junit4]   2> 4313091 INFO  (TEST-SimpleMLTQParserTest.doTest-seed#[99D002DA51CDC36E]) [    ] o.a.s.u.p.LogUpdateProcessorFactory [collection1]  webapp=null path=null params={}{add=[10 (1638377026309062657)]} 0 0
   [junit4]   2> 4313091 INFO  (TEST-SimpleMLTQParserTest.doTest-seed#[99D002DA51CDC36E]) [    ] o.a.s.u.p.LogUpdateProcessorFactory [collection1]  webapp=null path=null params={}{add=[12 (1638377026309062658)]} 0 0
   [junit4]   2> 4313092 INFO  (TEST-SimpleMLTQParserTest.doTest-seed#[99D002DA51CDC36E]) [    ] o.a.s.u.p.LogUpdateProcessorFactory [collection1]  webapp=null path=null params={}{add=[13 (1638377026310111232)]} 0 0
   [junit4]   2> 4313092 INFO  (TEST-SimpleMLTQParserTest.doTest-seed#[99D002DA51CDC36E]) [    ] o.a.s.u.p.LogUpdateProcessorFactory [collection1]  webapp=null path=null params={}{add=[14 (1638377026310111233)]} 0 0
   [junit4]   2> 4313092 INFO  (TEST-SimpleMLTQParserTest.doTest-seed#[99D002DA51CDC36E]) [    ] o.a.s.u.p.LogUpdateProcessorFactory [collection1]  webapp=null path=null params={}{add=[15 (1638377026310111234)]} 0 0
   [junit4]   2> 4313097 INFO  (TEST-SimpleMLTQParserTest.doTest-seed#[99D002DA51CDC36E]) [    ] o.a.s.u.p.LogUpdateProcessorFactory [collection1]  webapp=null path=null params={}{add=[16 (1638377026311159808)]} 0 4
   [junit4]   2> 4313099 INFO  (TEST-SimpleMLTQParserTest.doTest-seed#[99D002DA51CDC36E]) [    ] o.a.s.u.p.LogUpdateProcessorFactory [collection1]  webapp=null path=null params={}{add=[17 (1638377026316402688)]} 0 0
   [junit4]   2> 4313099 INFO  (TEST-SimpleMLTQParserTest.doTest-seed#[99D002DA51CDC36E]) [    ] o.a.s.u.p.LogUpdateProcessorFactory [collection1]  webapp=null path=null params={}{add=[18 (1638377026317451264)]} 0 0
   [junit4]   2> 4313099 INFO  (TEST-SimpleMLTQParserTest.doTest-seed#[99D002DA51CDC36E]) [    ] o.a.s.u.p.LogUpdateProcessorFactory [collection1]  webapp=null path=null params={}{add=[19 (1638377026317451265)]} 0 0
   [junit4]   2> 4313100 INFO  (TEST-SimpleMLTQParserTest.doTest-seed#[99D002DA51CDC36E]) [    ] o.a.s.u.p.LogUpdateProcessorFactory [collection1]  webapp=null path=null params={}{add=[20 (1638377026318499840)]} 0 0
   [junit4]   2> 4313100 INFO  (TEST-SimpleMLTQParserTest.doTest-seed#[99D002DA51CDC36E]) [    ] o.a.s.u.p.LogUpdateProcessorFactory [collection1]  webapp=null path=null params={}{add=[21 (1638377026318499841)]} 0 0
   [junit4]   2> 4313100 INFO  (TEST-SimpleMLTQParserTest.doTest-seed#[99D002DA51CDC36E]) [    ] o.a.s.u.p.LogUpdateProcessorFactory [collection1]  webapp=null path=null params={}{add=[22 (1638377026318499842)]} 0 0
   [junit4]   2> 4313101 INFO  (TEST-SimpleMLTQParserTest.doTest-seed#[99D002DA51CDC36E]) [    ] o.a.s.u.p.LogUpdateProcessorFactory [collection1]  webapp=null path=null params={}{add=[23 (1638377026319548416)]} 0 0
   [junit4]   2> 4313101 INFO  (TEST-SimpleMLTQParserTest.doTest-seed#[99D002DA51CDC36E]) [    ] o.a.s.u.p.LogUpdateProcessorFactory [collection1]  webapp=null path=null params={}{add=[24 (1638377026319548417)]} 0 0
   [junit4]   2> 4313102 INFO  (TEST-SimpleMLTQParserTest.doTest-seed#[99D002DA51CDC36E]) [    ] o.a.s.u.p.LogUpdateProcessorFactory [collection1]  webapp=null path=null params={}{add=[25 (1638377026319548418)]} 0 0
   [junit4]   2> 4313102 INFO  (TEST-SimpleMLTQParserTest.doTest-seed#[99D002DA51CDC36E]) [    ] o.a.s.u.p.LogUpdateProcessorFactory [collection1]  webapp=null path=null params={}{add=[26 (1638377026320596992)]} 0 0
   [junit4]   2> 4313102 INFO  (TEST-SimpleMLTQParserTest.doTest-seed#[99D002DA51CDC36E]) [    ] o.a.s.u.p.LogUpdateProcessorFactory [collection1]  webapp=null path=null params={}{add=[27 (1638377026320596993)]} 0 0
   [junit4]   2> 4313103 INFO  (TEST-SimpleMLTQParserTest.doTest-seed#[99D002DA51CDC36E]) [    ] o.a.s.u.p.LogUpdateProcessorFactory [collection1]  webapp=null path=null params={}{add=[28 (1638377026320596994)]} 0 0
   [junit4]   2> 4313103 INFO  (TEST-SimpleMLTQParserTest.doTest-seed#[99D002DA51CDC36E]) [    ] o.a.s.u.p.LogUpdateProcessorFactory [collection1]  webapp=null path=null params={}{add=[29 (1638377026321645568)]} 0 0
   [junit4]   2> 4313103 INFO  (TEST-SimpleMLTQParserTest.doTest-seed#[99D002DA51CDC36E]) [    ] o.a.s.u.p.LogUpdateProcessorFactory [collection1]  webapp=null path=null params={}{add=[30 (1638377026321645569)]} 0 0
   [junit4]   2> 4313110 INFO  (TEST-SimpleMLTQParserTest.doTest-seed#[99D002DA51CDC36E]) [    ] o.a.s.u.p.LogUpdateProcessorFactory [collection1]  webapp=null path=null params={}{add=[31 (1638377026322694144)]} 0 6
   [junit4]   2> 4313111 INFO  (TEST-SimpleMLTQParserTest.doTest-seed#[99D002DA51CDC36E]) [    ] o.a.s.u.p.LogUpdateProcessorFactory [collection1]  webapp=null path=null params={}{add=[32 (1638377026330034176)]} 0 0
   [junit4]   2> 4313111 INFO  (TEST-SimpleMLTQParserTest.doTest-seed#[99D002DA51CDC36E]) [    ] o.a.s.u.DirectUpdateHandler2 start commit{_version_=1638377026330034177,optimize=false,openSearcher=true,waitSearcher=true,expungeDeletes=false,softCommit=false,prepareCommit=false}
   [junit4]   2> 4313111 INFO  (TEST-SimpleMLTQParserTest.doTest-seed#[99D002DA51CDC36E]) [    ] o.a.s.u.SolrIndexWriter Calling setCommitData with IW:org.apache.solr.update.SolrIndexWriter@7a1355a6 commitCommandVersion:1638377026330034177
   [junit4]   2> 4313140 INFO  (TEST-SimpleMLTQParserTest.doTest-seed#[99D002DA51CDC36E]) [    ] o.a.s.s.SolrIndexSearcher Opening [Searcher@2aec57d[collection1] main]
   [junit4]   2> 4313141 INFO  (TEST-SimpleMLTQParserTest.doTest-seed#[99D002DA51CDC36E]) [    ] o.a.s.u.DirectUpdateHandler2 end_commit_flush
   [junit4]   2> 4313143 INFO  (searcherExecutor-16532-thread-1) [    ] o.a.s.c.SolrCore [collection1] Registered new searcher Searcher@2aec57d[collection1] main{ExitableDirectoryReader(UninvertingDirectoryReader(Uninverting(_3(8.1.2):c16:[diagnostics={os=Linux, java.version=1.8.0_191, os.arch=amd64, java.runtime.version=1.8.0_191-b12, source=merge, os.version=4.4.0-137-generic, java.vendor=Oracle Corporation, java.vm.version=25.191-b12, lucene.version=8.1.2, mergeMaxNumSegments=-1, mergeFactor=2, timestamp=1562478090614}]:[attributes={Lucene50StoredFieldsFormat.mode=BEST_SPEED}]) Uninverting(_1(8.1.2):C15:[diagnostics={os=Linux, java.vendor=Oracle Corporation, java.version=1.8.0_191, java.vm.version=25.191-b12, lucene.version=8.1.2, os.arch=amd64, java.runtime.version=1.8.0_191-b12, source=flush, os.version=4.4.0-137-generic, timestamp=1562478090598}]:[attributes={Lucene50StoredFieldsFormat.mode=BEST_SPEED}])))}
   [junit4]   2> 4313145 INFO  (TEST-SimpleMLTQParserTest.doTest-seed#[99D002DA51CDC36E]) [    ] o.a.s.u.p.LogUpdateProcessorFactory [collection1]  webapp=null path=null params={}{commit=} 0 33
   [junit4]   2> 4313149 INFO  (TEST-SimpleMLTQParserTest.doTest-seed#[99D002DA51CDC36E]) [    ] o.a.s.c.S.Request [collection1]  webapp=null path=null params={q={!mlt+qf%3Dlowerfilt}17} hits=16 status=0 QTime=3
   [junit4]   2> 4313151 ERROR (TEST-SimpleMLTQParserTest.doTest-seed#[99D002DA51CDC36E]) [    ] o.a.s.SolrTestCaseJ4 REQUEST FAILED: xpath=//result/doc[5]/str[@name='id'][.='18']
   [junit4]   2> 	xml response was: <?xml version="1.0" encoding="UTF-8"?>
   [junit4]   2> <response>
   [junit4]   2> <lst name="responseHeader"><int name="status">0</int><int name="QTime">3</int></lst><result name="response" numFound="16" start="0"><doc><str name="id">13</str><arr name="range_facet_l"><long>13</long></arr><int name="id_i1">13</int><arr name="range_facet_l_dv"><long>13</long></arr><arr name="range_facet_i_dv"><int>13</int></arr><arr name="lowerfilt"><str>The quote red fox jumped over the lazy brown dogs.</str></arr><arr name="lowerfilt1and2"><str>The quote red fox jumped over the lazy brown dogs.</str></arr><arr name="multiDefault"><str>muLti-Default</str></arr><int name="intDefault">42</int><date name="timestamp">2019-07-07T05:41:30.582Z</date><long name="_version_">1638377026310111232</long><int name="intDvoDefault">42</int></doc><doc><str name="id">14</str><arr name="range_facet_l"><long>14</long></arr><int name="id_i1">14</int><arr name="range_facet_l_dv"><long>14</long></arr><arr name="range_facet_i_dv"><int>14</int></arr><arr name="lowerfilt"><str>The quote red fox jumped over the lazy brown dogs.</str></arr><arr name="lowerfilt1and2"><str>The quote red fox jumped over the lazy brown dogs.</str></arr><arr name="multiDefault"><str>muLti-Default</str></arr><int name="intDefault">42</int><date name="timestamp">2019-07-07T05:41:30.582Z</date><long name="_version_">1638377026310111233</long><int name="intDvoDefault">42</int></doc><doc><str name="id">15</str><arr name="range_facet_l"><long>15</long></arr><int name="id_i1">15</int><arr name="range_facet_l_dv"><long>15</long></arr><arr name="range_facet_i_dv"><int>15</int></arr><arr name="lowerfilt"><str>The fat red fox jumped over the lazy brown dogs.</str></arr><arr name="lowerfilt1and2"><str>The fat red fox jumped over the lazy brown dogs.</str></arr><arr name="multiDefault"><str>muLti-Default</str></arr><int name="intDefault">42</int><date name="timestamp">2019-07-07T05:41:30.582Z</date><long name="_version_">1638377026310111234</long><int name="intDvoDefault">42</int></doc><doc><str name="id">16</str><arr name="range_facet_l"><long>16</long></arr><int name="id_i1">16</int><arr name="range_facet_l_dv"><long>16</long></arr><arr name="range_facet_i_dv"><int>16</int></arr><arr name="lowerfilt"><str>The slim red fox jumped over the lazy brown dogs.</str></arr><arr name="lowerfilt1and2"><str>The slim red fox jumped over the lazy brown dogs.</str></arr><arr name="multiDefault"><str>muLti-Default</str></arr><int name="intDefault">42</int><date name="timestamp">2019-07-07T05:41:30.583Z</date><long name="_version_">1638377026311159808</long><int name="intDvoDefault">42</int></doc><doc><str name="id">32</str><arr name="range_facet_l"><long>32</long></arr><int name="id_i1">32</int><arr name="range_facet_l_dv"><long>32</long></arr><arr name="range_facet_i_dv"><int>32</int></arr><arr name="lowerfilt"><str>The slim red fox jumped over the lazy brown dogs.</str></arr><arr name="lowerfilt1and2"><str>The slim red fox jumped over the lazy brown dogs.</str><str>yellow white black</str></arr><arr name="lowerfilt1"><str>yellow white black</str></arr><arr name="multiDefault"><str>muLti-Default</str></arr><int name="intDefault">42</int><date name="timestamp">2019-07-07T05:41:30.601Z</date><long name="_version_">1638377026330034176</long><int name="intDvoDefault">42</int></doc><doc><str name="id">18</str><arr name="range_facet_l"><long>18</long></arr><int name="id_i1">18</int><arr name="range_facet_l_dv"><long>18</long></arr><arr name="range_facet_i_dv"><int>18</int></arr><arr name="lowerfilt"><str>The quote red fox jumped over the lazy brown dogs.</str></arr><arr name="lowerfilt1and2"><str>The quote red fox jumped over the lazy brown dogs.</str></arr><arr name="multiDefault"><str>muLti-Default</str></arr><int name="intDefault">42</int><date name="timestamp">2019-07-07T05:41:30.589Z</date><long name="_version_">1638377026317451264</long><int name="intDvoDefault">42</int></doc><doc><str name="id">19</str><arr name="range_facet_l"><long>19</long></arr><int name="id_i1">19</int><arr name="range_facet_l_dv"><long>19</long></arr><arr name="range_facet_i_dv"><int>19</int></arr><arr name="lowerfilt"><str>The hose red fox jumped over the lazy brown dogs.</str></arr><arr name="lowerfilt1and2"><str>The hose red fox jumped over the lazy brown dogs.</str></arr><arr name="multiDefault"><str>muLti-Default</str></arr><int name="intDefault">42</int><date name="timestamp">2019-07-07T05:41:30.589Z</date><long name="_version_">1638377026317451265</long><int name="intDvoDefault">42</int></doc><doc><str name="id">20</str><arr name="range_facet_l"><long>20</long></arr><int name="id_i1">20</int><arr name="range_facet_l_dv"><long>20</long></arr><arr name="range_facet_i_dv"><int>20</int></arr><arr name="lowerfilt"><str>The quote red fox jumped over the lazy brown dogs.</str></arr><arr name="lowerfilt1and2"><str>The quote red fox jumped over the lazy brown dogs.</str></arr><arr name="multiDefault"><str>muLti-Default</str></arr><int name="intDefault">42</int><date name="timestamp">2019-07-07T05:41:30.590Z</date><long name="_version_">1638377026318499840</long><int name="intDvoDefault">42</int></doc><doc><str name="id">21</str><arr name="range_facet_l"><long>21</long></arr><int name="id_i1">21</int><arr name="range_facet_l_dv"><long>21</long></arr><arr name="range_facet_i_dv"><int>21</int></arr><arr name="lowerfilt"><str>The court red fox jumped over the lazy brown dogs.</str></arr><arr name="lowerfilt1and2"><str>The court red fox jumped over the lazy brown dogs.</str></arr><arr name="multiDefault"><str>muLti-Default</str></arr><int name="intDefault">42</int><date name="timestamp">2019-07-07T05:41:30.590Z</date><long name="_version_">1638377026318499841</long><int name="intDvoDefault">42</int></doc><doc><str name="id">22</str><arr name="range_facet_l"><long>22</long></arr><int name="id_i1">22</int><arr name="range_facet_l_dv"><long>22</long></arr><arr name="range_facet_i_dv"><int>22</int></arr><arr name="lowerfilt"><str>The quote red fox jumped over the lazy brown dogs.</str></arr><arr name="lowerfilt1and2"><str>The quote red fox jumped over the lazy brown dogs.</str></arr><arr name="multiDefault"><str>muLti-Default</str></arr><int name="intDefault">42</int><date name="timestamp">2019-07-07T05:41:30.590Z</date><long name="_version_">1638377026318499842</long><int name="intDvoDefault">42</int></doc></result>
   [junit4]   2> </response>
   [junit4]   2> 
   [junit4]   2> 	request was:q={!mlt+qf%3Dlowerfilt}17
   [junit4]   2> 4313152 ERROR (TEST-SimpleMLTQParserTest.doTest-seed#[99D002DA51CDC36E]) [    ] o.a.s.SolrTestCaseJ4 REQUEST FAILED: q={!mlt+qf%3Dlowerfilt}17:java.lang.RuntimeException: REQUEST FAILED: xpath=//result/doc[5]/str[@name='id'][.='18']
   [junit4]   2> 	xml response was: <?xml version="1.0" encoding="UTF-8"?>
   [junit4]   2> <response>
   [junit4]   2> <lst name="responseHeader"><int name="status">0</int><int name="QTime">3</int></lst><result name="response" numFound="16" start="0"><doc><str name="id">13</str><arr name="range_facet_l"><long>13</long></arr><int name="id_i1">13</int><arr name="range_facet_l_dv"><long>13</long></arr><arr name="range_facet_i_dv"><int>13</int></arr><arr name="lowerfilt"><str>The quote red fox jumped over the lazy brown dogs.</str></arr><arr name="lowerfilt1and2"><str>The quote red fox jumped over the lazy brown dogs.</str></arr><arr name="multiDefault"><str>muLti-Default</str></arr><int name="intDefault">42</int><date name="timestamp">2019-07-07T05:41:30.582Z</date><long name="_version_">1638377026310111232</long><int name="intDvoDefault">42</int></doc><doc><str name="id">14</str><arr name="range_facet_l"><long>14</long></arr><int name="id_i1">14</int><arr name="range_facet_l_dv"><long>14</long></arr><arr name="range_facet_i_dv"><int>14</int></arr><arr name="lowerfilt"><str>The quote red fox jumped over the lazy brown dogs.</str></arr><arr name="lowerfilt1and2"><str>The quote red fox jumped over the lazy brown dogs.</str></arr><arr name="multiDefault"><str>muLti-Default</str></arr><int name="intDefault">42</int><date name="timestamp">2019-07-07T05:41:30.582Z</date><long name="_version_">1638377026310111233</long><int name="intDvoDefault">42</int></doc><doc><str name="id">15</str><arr name="range_facet_l"><long>15</long></arr><int name="id_i1">15</int><arr name="range_facet_l_dv"><long>15</long></arr><arr name="range_facet_i_dv"><int>15</int></arr><arr name="lowerfilt"><str>The fat red fox jumped over the lazy brown dogs.</str></arr><arr name="lowerfilt1and2"><str>The fat red fox jumped over the lazy brown dogs.</str></arr><arr name="multiDefault"><str>muLti-Default</str></arr><int name="intDefault">42</int><date name="timestamp">2019-07-07T05:41:30.582Z</date><long name="_version_">1638377026310111234</long><int name="intDvoDefault">42</int></doc><doc><str name="id">16</str><arr name="range_facet_l"><long>16</long></arr><int name="id_i1">16</int><arr name="range_facet_l_dv"><long>16</long></arr><arr name="range_facet_i_dv"><int>16</int></arr><arr name="lowerfilt"><str>The slim red fox jumped over the lazy brown dogs.</str></arr><arr name="lowerfilt1and2"><str>The slim red fox jumped over the lazy brown dogs.</str></arr><arr name="multiDefault"><str>muLti-Default</str></arr><int name="intDefault">42</int><date name="timestamp">2019-07-07T05:41:30.583Z</date><long name="_version_">1638377026311159808</long><int name="intDvoDefault">42</int></doc><doc><str name="id">32</str><arr name="range_facet_l"><long>32</long></arr><int name="id_i1">32</int><arr name="range_facet_l_dv"><long>32</long></arr><arr name="range_facet_i_dv"><int>32</int></arr><arr name="lowerfilt"><str>The slim red fox jumped over the lazy brown dogs.</str></arr><arr name="lowerfilt1and2"><str>The slim red fox jumped over the lazy brown dogs.</str><str>yellow white black</str></arr><arr name="lowerfilt1"><str>yellow white black</str></arr><arr name="multiDefault"><str>muLti-Default</str></arr><int name="intDefault">42</int><date name="timestamp">2019-07-07T05:41:30.601Z</date><long name="_version_">1638377026330034176</long><int name="intDvoDefault">42</int></doc><doc><str name="id">18</str><arr name="range_facet_l"><long>18</long></arr><int name="id_i1">18</int><arr name="range_facet_l_dv"><long>18</long></arr><arr name="range_facet_i_dv"><int>18</int></arr><arr name="lowerfilt"><str>The quote red fox jumped over the lazy brown dogs.</str></arr><arr name="lowerfilt1and2"><str>The quote red fox jumped over the lazy brown dogs.</str></arr><arr name="multiDefault"><str>muLti-Default</str></arr><int name="intDefault">42</int><date name="timestamp">2019-07-07T05:41:30.589Z</date><long name="_version_">1638377026317451264</long><int name="intDvoDefault">42</int></doc><doc><str name="id">19</str><arr name="range_facet_l"><long>19</long></arr><int name="id_i1">19</int><arr name="range_facet_l_dv"><long>19</long></arr><arr name="range_facet_i_dv"><int>19</int></arr><arr name="lowerfilt"><str>The hose red fox jumped over the lazy brown dogs.</str></arr><arr name="lowerfilt1and2"><str>The hose red fox jumped over the lazy brown dogs.</str></arr><arr name="multiDefault"><str>muLti-Default</str></arr><int name="intDefault">42</int><date name="timestamp">2019-07-07T05:41:30.589Z</date><long name="_version_">1638377026317451265</long><int name="intDvoDefault">42</int></doc><doc><str name="id">20</str><arr name="range_facet_l"><long>20</long></arr><int name="id_i1">20</int><arr name="range_facet_l_dv"><long>20</long></arr><arr name="range_facet_i_dv"><int>20</int></arr><arr name="lowerfilt"><str>The quote red fox jumped over the lazy brown dogs.</str></arr><arr name="lowerfilt1and2"><str>The quote red fox jumped over the lazy brown dogs.</str></arr><arr name="multiDefault"><str>muLti-Default</str></arr><int name="intDefault">42</int><date name="timestamp">2019-07-07T05:41:30.590Z</date><long name="_version_">1638377026318499840</long><int name="intDvoDefault">42</int></doc><doc><str name="id">21</str><arr name="range_facet_l"><long>21</long></arr><int name="id_i1">21</int><arr name="range_facet_l_dv"><long>21</long></arr><arr name="range_facet_i_dv"><int>21</int></arr><arr name="lowerfilt"><str>The court red fox jumped over the lazy brown dogs.</str></arr><arr name="lowerfilt1and2"><str>The court red fox jumped over the lazy brown dogs.</str></arr><arr name="multiDefault"><str>muLti-Default</str></arr><int name="intDefault">42</int><date name="timestamp">2019-07-07T05:41:30.590Z</date><long name="_version_">1638377026318499841</long><int name="intDvoDefault">42</int></doc><doc><str name="id">22</str><arr name="range_facet_l"><long>22</long></arr><int name="id_i1">22</int><arr name="range_facet_l_dv"><long>22</long></arr><arr name="range_facet_i_dv"><int>22</int></arr><arr name="lowerfilt"><str>The quote red fox jumped over the lazy brown dogs.</str></arr><arr name="lowerfilt1and2"><str>The quote red fox jumped over the lazy brown dogs.</str></arr><arr name="multiDefault"><str>muLti-Default</str></arr><int name="intDefault">42</int><date name="timestamp">2019-07-07T05:41:30.590Z</date><long name="_version_">1638377026318499842</long><int name="intDvoDefault">42</int></doc></result>
   [junit4]   2> </response>
   [junit4]   2> 
   [junit4]   2> 	request was:q={!mlt+qf%3Dlowerfilt}17
   [junit4]   2> 	at org.apache.solr.SolrTestCaseJ4.assertQ(SolrTestCaseJ4.java:932)
   [junit4]   2> 	at org.apache.solr.SolrTestCaseJ4.assertQ(SolrTestCaseJ4.java:899)
   [junit4]   2> 	at org.apache.solr.search.mlt.SimpleMLTQParserTest.doTest(SimpleMLTQParserTest.java:82)
   [junit4]   2> 	at sun.reflect.NativeMethodAccessorImpl.invoke0(Native Method)
   [junit4]   2> 	at sun.reflect.NativeMethodAccessorImpl.invoke(NativeMethodAccessorImpl.java:62)
   [junit4]   2> 	at sun.reflect.DelegatingMethodAccessorImpl.invoke(DelegatingMethodAccessorImpl.java:43)
   [junit4]   2> 	at java.lang.reflect.Method.invoke(Method.java:498)
   [junit4]   2> 	at com.carrotsearch.randomizedtesting.RandomizedRunner.invoke(RandomizedRunner.java:1750)
   [junit4]   2> 	at com.carrotsearch.randomizedtesting.RandomizedRunner$8.evaluate(RandomizedRunner.java:938)
   [junit4]   2> 	at com.carrotsearch.randomizedtesting.RandomizedRunner$9.evaluate(RandomizedRunner.java:974)
   [junit4]   2> 	at com.carrotsearch.randomizedtesting.RandomizedRunner$10.evaluate(RandomizedRunner.java:988)
   [junit4]   2> 	at com.carrotsearch.randomizedtesting.rules.SystemPropertiesRestoreRule$1.evaluate(SystemPropertiesRestoreRule.java:57)
   [junit4]   2> 	at org.apache.lucene.util.TestRuleSetupTeardownChained$1.evaluate(TestRuleSetupTeardownChained.java:49)
   [junit4]   2> 	at org.apache.lucene.util.AbstractBeforeAfterRule$1.evaluate(AbstractBeforeAfterRule.java:45)
   [junit4]   2> 	at org.apache.lucene.util.TestRuleThreadAndTestName$1.evaluate(TestRuleThreadAndTestName.java:48)
   [junit4]   2> 	at org.apache.lucene.util.TestRuleIgnoreAfterMaxFailures$1.evaluate(TestRuleIgnoreAfterMaxFailures.java:64)
   [junit4]   2> 	at org.apache.lucene.util.TestRuleMarkFailure$1.evaluate(TestRuleMarkFailure.java:47)
   [junit4]   2> 	at com.carrotsearch.randomizedtesting.rules.StatementAdapter.evaluate(StatementAdapter.java:36)
   [junit4]   2> 	at com.carrotsearch.randomizedtesting.ThreadLeakControl$StatementRunner.run(ThreadLeakControl.java:368)
   [junit4]   2> 	at com.carrotsearch.randomizedtesting.ThreadLeakControl.forkTimeoutingTask(ThreadLeakControl.java:817)
   [junit4]   2> 	at com.carrotsearch.randomizedtesting.ThreadLeakControl$3.evaluate(ThreadLeakControl.java:468)
   [junit4]   2> 	at com.carrotsearch.randomizedtesting.RandomizedRunner.runSingleTest(RandomizedRunner.java:947)
   [junit4]   2> 	at com.carrotsearch.randomizedtesting.RandomizedRunner$5.evaluate(RandomizedRunner.java:832)
   [junit4]   2> 	at com.carrotsearch.randomizedtesting.RandomizedRunner$6.evaluate(RandomizedRunner.java:883)
   [junit4]   2> 	at com.carrotsearch.randomizedtesting.RandomizedRunner$7.evaluate(RandomizedRunner.java:894)
   [junit4]   2> 	at com.carrotsearch.randomizedtesting.rules.StatementAdapter.evaluate(StatementAdapter.java:36)
   [junit4]   2> 	at com.carrotsearch.randomizedtesting.rules.SystemPropertiesRestoreRule$1.evaluate(SystemPropertiesRestoreRule.java:57)
   [junit4]   2> 	at org.apache.lucene.util.AbstractBeforeAfterRule$1.evaluate(AbstractBeforeAfterRule.java:45)
   [junit4]   2> 	at com.carrotsearch.randomizedtesting.rules.StatementAdapter.evaluate(StatementAdapter.java:36)
   [junit4]   2> 	at org.apache.lucene.util.TestRuleStoreClassName$1.evaluate(TestRuleStoreClassName.java:41)
   [junit4]   2> 	at com.carrotsearch.randomizedtesting.rules.NoShadowingOrOverridesOnMethodsRule$1.evaluate(NoShadowingOrOverridesOnMethodsRule.java:40)
   [junit4]   2> 	at com.carrotsearch.randomizedtesting.rules.NoShadowingOrOverridesOnMethodsRule$1.evaluate(NoShadowingOrOverridesOnMethodsRule.java:40)
   [junit4]   2> 	at com.carrotsearch.randomizedtesting.rules.StatementAdapter.evaluate(StatementAdapter.java:36)
   [junit4]   2> 	at com.carrotsearch.randomizedtesting.rules.StatementAdapter.evaluate(StatementAdapter.java:36)
   [junit4]   2> 	at com.carrotsearch.randomizedtesting.rules.StatementAdapter.evaluate(StatementAdapter.java:36)
   [junit4]   2> 	at org.apache.lucene.util.TestRuleAssertionsRequired$1.evaluate(TestRuleAssertionsRequired.java:53)
   [junit4]   2> 	at org.apache.lucene.util.TestRuleMarkFailure$1.evaluate(TestRuleMarkFailure.java:47)
   [junit4]   2> 	at org.apache.l...
   [junit4]   2> 4313152 INFO  (TEST-SimpleMLTQParserTest.doTest-seed#[99D002DA51CDC36E]) [    ] o.a.s.SolrTestCaseJ4 ###Ending doTest
   [junit4]   2> NOTE: download the large Jenkins line-docs file by running 'ant get-jenkins-line-docs' in the lucene directory.
   [junit4]   2> NOTE: reproduce with: ant test  -Dtestcase=SimpleMLTQParserTest -Dtests.method=doTest -Dtests.seed=99D002DA51CDC36E -Dtests.multiplier=2 -Dtests.nightly=true -Dtests.slow=true -Dtests.linedocsfile=/home/jenkins/jenkins-slave/workspace/Lucene-Solr-NightlyTests-8.1/test-data/enwiki.random.lines.txt -Dtests.locale=en-MT -Dtests.timezone=SystemV/CST6CDT -Dtests.asserts=true -Dtests.file.encoding=UTF-8
   [junit4] ERROR   0.10s J1 | SimpleMLTQParserTest.doTest <<<
   [junit4]    > Throwable #1: java.lang.RuntimeException: Exception during query
   [junit4]    > 	at __randomizedtesting.SeedInfo.seed([99D002DA51CDC36E:3E94BA7E3C76D0D7]:0)
   [junit4]    > 	at org.apache.solr.SolrTestCaseJ4.assertQ(SolrTestCaseJ4.java:939)
   [junit4]    > 	at org.apache.solr.SolrTestCaseJ4.assertQ(SolrTestCaseJ4.java:899)
   [junit4]    > 	at org.apache.solr.search.mlt.SimpleMLTQParserTest.doTest(SimpleMLTQParserTest.java:82)
   [junit4]    > 	at java.lang.Thread.run(Thread.java:748)
   [junit4]    > Caused by: java.lang.RuntimeException: REQUEST FAILED: xpath=//result/doc[5]/str[@name='id'][.='18']
   [junit4]    > 	xml response was: <?xml version="1.0" encoding="UTF-8"?>
   [junit4]    > <response>
   [junit4]    > <lst name="responseHeader"><int name="status">0</int><int name="QTime">3</int></lst><result name="response" numFound="16" start="0"><doc><str name="id">13</str><arr name="range_facet_l"><long>13</long></arr><int name="id_i1">13</int><arr name="range_facet_l_dv"><long>13</long></arr><arr name="range_facet_i_dv"><int>13</int></arr><arr name="lowerfilt"><str>The quote red fox jumped over the lazy brown dogs.</str></arr><arr name="lowerfilt1and2"><str>The quote red fox jumped over the lazy brown dogs.</str></arr><arr name="multiDefault"><str>muLti-Default</str></arr><int name="intDefault">42</int><date name="timestamp">2019-07-07T05:41:30.582Z</date><long name="_version_">1638377026310111232</long><int name="intDvoDefault">42</int></doc><doc><str name="id">14</str><arr name="range_facet_l"><long>14</long></arr><int name="id_i1">14</int><arr name="range_facet_l_dv"><long>14</long></arr><arr name="range_facet_i_dv"><int>14</int></arr><arr name="lowerfilt"><str>The quote red fox jumped over the lazy brown dogs.</str></arr><arr name="lowerfilt1and2"><str>The quote red fox jumped over the lazy brown dogs.</str></arr><arr name="multiDefault"><str>muLti-Default</str></arr><int name="intDefault">42</int><date name="timestamp">2019-07-07T05:41:30.582Z</date><long name="_version_">1638377026310111233</long><int name="intDvoDefault">42</int></doc><doc><str name="id">15</str><arr name="range_facet_l"><long>15</long></arr><int name="id_i1">15</int><arr name="range_facet_l_dv"><long>15</long></arr><arr name="range_facet_i_dv"><int>15</int></arr><arr name="lowerfilt"><str>The fat red fox jumped over the lazy brown dogs.</str></arr><arr name="lowerfilt1and2"><str>The fat red fox jumped over the lazy brown dogs.</str></arr><arr name="multiDefault"><str>muLti-Default</str></arr><int name="intDefault">42</int><date name="timestamp">2019-07-07T05:41:30.582Z</date><long name="_version_">1638377026310111234</long><int name="intDvoDefault">42</int></doc><doc><str name="id">16</str><arr name="range_facet_l"><long>16</long></arr><int name="id_i1">16</int><arr name="range_facet_l_dv"><long>16</long></arr><arr name="range_facet_i_dv"><int>16</int></arr><arr name="lowerfilt"><str>The slim red fox jumped over the lazy brown dogs.</str></arr><arr name="lowerfilt1and2"><str>The slim red fox jumped over the lazy brown dogs.</str></arr><arr name="multiDefault"><str>muLti-Default</str></arr><int name="intDefault">42</int><date name="timestamp">2019-07-07T05:41:30.583Z</date><long name="_version_">1638377026311159808</long><int name="intDvoDefault">42</int></doc><doc><str name="id">32</str><arr name="range_facet_l"><long>32</long></arr><int name="id_i1">32</int><arr name="range_facet_l_dv"><long>32</long></arr><arr name="range_facet_i_dv"><int>32</int></arr><arr name="lowerfilt"><str>The slim red fox jumped over the lazy brown dogs.</str></arr><arr name="lowerfilt1and2"><str>The slim red fox jumped over the lazy brown dogs.</str><str>yellow white black</str></arr><arr name="lowerfilt1"><str>yellow white black</str></arr><arr name="multiDefault"><str>muLti-Default</str></arr><int name="intDefault">42</int><date name="timestamp">2019-07-07T05:41:30.601Z</date><long name="_version_">1638377026330034176</long><int name="intDvoDefault">42</int></doc><doc><str name="id">18</str><arr name="range_facet_l"><long>18</long></arr><int name="id_i1">18</int><arr name="range_facet_l_dv"><long>18</long></arr><arr name="range_facet_i_dv"><int>18</int></arr><arr name="lowerfilt"><str>The quote red fox jumped over the lazy brown dogs.</str></arr><arr name="lowerfilt1and2"><str>The quote red fox jumped over the lazy brown dogs.</str></arr><arr name="multiDefault"><str>muLti-Default</str></arr><int name="intDefault">42</int><date name="timestamp">2019-07-07T05:41:30.589Z</date><long name="_version_">1638377026317451264</long><int name="intDvoDefault">42</int></doc><doc><str name="id">19</str><arr name="range_facet_l"><long>19</long></arr><int name="id_i1">19</int><arr name="range_facet_l_dv"><long>19</long></arr><arr name="range_facet_i_dv"><int>19</int></arr><arr name="lowerfilt"><str>The hose red fox jumped over the lazy brown dogs.</str></arr><arr name="lowerfilt1and2"><str>The hose red fox jumped over the lazy brown dogs.</str></arr><arr name="multiDefault"><str>muLti-Default</str></arr><int name="intDefault">42</int><date name="timestamp">2019-07-07T05:41:30.589Z</date><long name="_version_">1638377026317451265</long><int name="intDvoDefault">42</int></doc><doc><str name="id">20</str><arr name="range_facet_l"><long>20</long></arr><int name="id_i1">20</int><arr name="range_facet_l_dv"><long>20</long></arr><arr name="range_facet_i_dv"><int>20</int></arr><arr name="lowerfilt"><str>The quote red fox jumped over the lazy brown dogs.</str></arr><arr name="lowerfilt1and2"><str>The quote red fox jumped over the lazy brown dogs.</str></arr><arr name="multiDefault"><str>muLti-Default</str></arr><int name="intDefault">42</int><date name="timestamp">2019-07-07T05:41:30.590Z</date><long name="_version_">1638377026318499840</long><int name="intDvoDefault">42</int></doc><doc><str name="id">21</str><arr name="range_facet_l"><long>21</long></arr><int name="id_i1">21</int><arr name="range_facet_l_dv"><long>21</long></arr><arr name="range_facet_i_dv"><int>21</int></arr><arr name="lowerfilt"><str>The court red fox jumped over the lazy brown dogs.</str></arr><arr name="lowerfilt1and2"><str>The court red fox jumped over the lazy brown dogs.</str></arr><arr name="multiDefault"><str>muLti-Default</str></arr><int name="intDefault">42</int><date name="timestamp">2019-07-07T05:41:30.590Z</date><long name="_version_">1638377026318499841</long><int name="intDvoDefault">42</int></doc><doc><str name="id">22</str><arr name="range_facet_l"><long>22</long></arr><int name="id_i1">22</int><arr name="range_facet_l_dv"><long>22</long></arr><arr name="range_facet_i_dv"><int>22</int></arr><arr name="lowerfilt"><str>The quote red fox jumped over the lazy brown dogs.</str></arr><arr name="lowerfilt1and2"><str>The quote red fox jumped over the lazy brown dogs.</str></arr><arr name="multiDefault"><str>muLti-Default</str></arr><int name="intDefault">42</int><date name="timestamp">2019-07-07T05:41:30.590Z</date><long name="_version_">1638377026318499842</long><int name="intDvoDefault">42</int></doc></result>
   [junit4]    > </response>
   [junit4]    > 	request was:q={!mlt+qf%3Dlowerfilt}17
   [junit4]    > 	at org.apache.solr.SolrTestCaseJ4.assertQ(SolrTestCaseJ4.java:932)
   [junit4]    > 	... 41 more
   [junit4]   2> 4313157 INFO  (SUITE-SimpleMLTQParserTest-seed#[99D002DA51CDC36E]-worker) [    ] o.a.s.SolrTestCaseJ4 ###deleteCore
   [junit4]   2> 4313157 INFO  (SUITE-SimpleMLTQParserTest-seed#[99D002DA51CDC36E]-worker) [    ] o.a.s.c.CoreContainer Shutting down CoreContainer instance=114001776
   [junit4]   2> 4313157 INFO  (coreCloseExecutor-16537-thread-1) [    x:collection1] o.a.s.c.SolrCore [collection1]  CLOSING SolrCore org.apache.solr.core.SolrCore@2ab4e202
   [junit4]   2> 4313157 INFO  (coreCloseExecutor-16537-thread-1) [    x:collection1] o.a.s.m.SolrMetricManager Closing metric reporters for registry=solr.core.collection1, tag=2ab4e202
   [junit4]   2> 4313157 INFO  (coreCloseExecutor-16537-thread-1) [    x:collection1] o.a.s.m.r.SolrJmxReporter Closing reporter [org.apache.solr.metrics.reporters.SolrJmxReporter@6a240bcf: rootName = null, domain = solr.core.collection1, service url = null, agent id = null] for registry solr.core.collection1 / com.codahale.metrics.MetricRegistry@43f001f2
   [junit4]   2> 4313179 INFO  (SUITE-SimpleMLTQParserTest-seed#[99D002DA51CDC36E]-worker) [    ] o.a.s.m.SolrMetricManager Closing metric reporters for registry=solr.node, tag=null
   [junit4]   2> 4313179 INFO  (SUITE-SimpleMLTQParserTest-seed#[99D002DA51CDC36E]-worker) [    ] o.a.s.m.r.SolrJmxReporter Closing reporter [org.apache.solr.metrics.reporters.SolrJmxReporter@6a9949b2: rootName = null, domain = solr.node, service url = null, agent id = null] for registry solr.node / com.codahale.metrics.MetricRegistry@4ce700cc
   [junit4]   2> 4313185 INFO  (SUITE-SimpleMLTQParserTest-seed#[99D002DA51CDC36E]-worker) [    ] o.a.s.m.SolrMetricManager Closing metric reporters for registry=solr.jvm, tag=null
   [junit4]   2> 4313185 INFO  (SUITE-SimpleMLTQParserTest-seed#[99D002DA51CDC36E]-worker) [    ] o.a.s.m.r.SolrJmxReporter Closing reporter [org.apache.solr.metrics.reporters.SolrJmxReporter@2c01422e: rootName = null, domain = solr.jvm, service url = null, agent id = null] for registry solr.jvm / com.codahale.metrics.MetricRegistry@53bd4592
   [junit4]   2> 4313188 INFO  (SUITE-SimpleMLTQParserTest-seed#[99D002DA51CDC36E]-worker) [    ] o.a.s.m.SolrMetricManager Closing metric reporters for registry=solr.jetty, tag=null
   [junit4]   2> 4313189 INFO  (SUITE-SimpleMLTQParserTest-seed#[99D002DA51CDC36E]-worker) [    ] o.a.s.m.r.SolrJmxReporter Closing reporter [org.apache.solr.metrics.reporters.SolrJmxReporter@5b783915: rootName = null, domain = solr.jetty, service url = null, agent id = null] for registry solr.jetty / com.codahale.metrics.MetricRegistry@62aff326
   [junit4]   2> NOTE: leaving temporary files on disk at: /x1/jenkins/jenkins-slave/workspace/Lucene-Solr-NightlyTests-8.1/checkout/solr/build/solr-core/test/J1/temp/solr.search.mlt.SimpleMLTQParserTest_99D002DA51CDC36E-001
   [junit4]   2> NOTE: test params are: codec=Asserting(Lucene80): {lowerfilt1=FSTOrd50, lowerfilt1and2=PostingsFormat(name=MockRandom), multiDefault=PostingsFormat(name=MockRandom), _root_=PostingsFormat(name=LuceneVarGapFixedInterval), lowerfilt=PostingsFormat(name=MockRandom), id=PostingsFormat(name=LuceneFixedGap)}, docValues:{range_facet_l_dv=DocValuesFormat(name=Lucene80), lowerfilt1=DocValuesFormat(name=Lucene80), multiDefault=DocValuesFormat(name=Asserting), _root_=DocValuesFormat(name=Direct), intDefault=DocValuesFormat(name=Direct), range_facet_l=DocValuesFormat(name=Asserting), _version_=DocValuesFormat(name=Direct), lowerfilt1and2=DocValuesFormat(name=Asserting), id_i1=DocValuesFormat(name=Direct), lowerfilt=DocValuesFormat(name=Asserting), range_facet_i_dv=DocValuesFormat(name=Asserting), id=DocValuesFormat(name=Lucene80), intDvoDefault=DocValuesFormat(name=Lucene80), timestamp=DocValuesFormat(name=Asserting)}, maxPointsInLeafNode=1103, maxMBSortInHeap=5.695597540337221, sim=Asserting(org.apache.lucene.search.similarities.AssertingSimilarity@1997f988), locale=en-MT, timezone=SystemV/CST6CDT
   [junit4]   2> NOTE: Linux 4.4.0-137-generic amd64/Oracle Corporation 1.8.0_191 (64-bit)/cpus=4,threads=1,free=247877184,total=533200896
   [junit4]   2> NOTE: All tests run in this JVM: [TestAddFieldRealTimeGet, UtilsToolTest, UpdateParamsTest, TestCollectionAPIs, NoCacheHeaderTest, RemoteQueryErrorTest, TestBulkSchemaConcurrent, DistributedUpdateProcessorTest, TestCursorMarkWithoutUniqueKey, CollectionStateFormat2Test, TestRandomCollapseQParserPlugin, MaxSizeAutoCommitTest, ConjunctionSolrSpellCheckerTest, CustomTermsComponentTest, MetricsConfigTest, TestRemoteStreaming, TestOrdValues, AliasIntegrationTest, SuggesterTest, AuditLoggerIntegrationTest, TestMultiWordSynonyms, TestSubQueryTransformerDistrib, TestDynamicFieldCollectionResource, QueryResultKeyTest, BasicFunctionalityTest, DistributedSuggestComponentTest, ExplicitHLLTest, TestCoreContainer, CreateRoutedAliasTest, TestDistributedSearch, TestImpersonationWithHadoopAuth, TestExactSharedStatsCache, TestSimPolicyCloud, MoreLikeThisHandlerTest, TestBM25SimilarityFactory, TestComplexPhraseQParserPlugin, DataDrivenBlockJoinTest, TestReload, BasicDistributedZkTest, BasicAuthOnSingleNodeTest, MinimalSchemaTest, TestXIncludeConfig, TestSolrFieldCacheBean, StatsReloadRaceTest, TestLegacyFieldReuse, InfixSuggestersTest, NodeAddedTriggerIntegrationTest, ChaosMonkeyNothingIsSafeWithPullReplicasTest, MetricsHandlerTest, TriLevelCompositeIdRoutingTest, TestLuceneMatchVersion, ShardRoutingTest, DocValuesNotIndexedTest, TestInitParams, TestFastLRUCache, RulesTest, TestSort, CdcrBidirectionalTest, ConfigSetsAPITest, TestStressVersions, ChangedSchemaMergeTest, TestFieldCacheReopen, ParsingFieldUpdateProcessorsTest, HighlighterMaxOffsetTest, SolrInfoBeanTest, MigrateRouteKeyTest, TestOmitPositions, TriggerIntegrationTest, TestRuleBasedAuthorizationPlugin, TestSimExecutePlanAction, ShardSplitTest, TestWithCollection, TestJsonRequest, MoveReplicaHDFSTest, AnalyticsQueryTest, TestCloudPseudoReturnFields, UUIDUpdateProcessorFallbackTest, QueryParsingTest, TestMiniSolrCloudClusterSSL, DistributedFacetPivotLongTailTest, TermVectorComponentDistributedTest, TestSolrCoreSnapshots, AtomicUpdateProcessorFactoryTest, TestMergePolicyConfig, LeaderFailureAfterFreshStartTest, TestStressInPlaceUpdates, ZkCLITest, SignificantTermsQParserPluginTest, TestReplicationHandlerDiskOverFlow, TestAtomicUpdateErrorCases, NodeLostTriggerTest, TestSolrConfigHandlerConcurrent, TestSchemalessBufferedUpdates, ExecutePlanActionTest, TestFiltering, TestDFRSimilarityFactory, SortByFunctionTest, JSONWriterTest, ExternalFileFieldSortTest, TestMultiValuedNumericRangeQuery, TestRandomFaceting, TestLFUCache, CdcrReplicationHandlerTest, TestEmbeddedSolrServerConstructors, SolrLogAuditLoggerPluginTest, TestDocTermOrds, TestSimComputePlanAction, StatsComponentTest, Tagger2Test, TestDocBasedVersionConstraints, SearchRateTriggerIntegrationTest, DeleteNodeTest, ZkStateWriterTest, AuthToolTest, TestDistributedStatsComponentCardinality, TestFieldCacheVsDocValues, RegexBytesRefFilterTest, HttpPartitionTest, SchemaApiFailureTest, DisMaxRequestHandlerTest, TestPhraseSuggestions, ManagedSchemaRoundRobinCloudTest, CoreMergeIndexesAdminHandlerTest, TestSearcherReuse, CoreAdminHandlerTest, TestManagedSchema, TestPushWriter, JWTAuthPluginTest, TestNumericTerms32, TestTolerantUpdateProcessorCloud, RootFieldTest, ExitableDirectoryReaderTest, LegacyCloudClusterPropTest, XmlInterpolationTest, AssignTest, TestInPlaceUpdateWithRouteField, CollectionTooManyReplicasTest, TimeRoutedAliasUpdateProcessorTest, LargeFieldTest, ReplicationFactorTest, RestartWhileUpdatingTest, TestAuthenticationFramework, TestCloudConsistency, TestCloudDeleteByQuery, TestCloudPivotFacet, TestClusterProperties, TestConfigSetsAPIExclusivity, TestConfigSetsAPIZkFailure, TestDeleteCollectionOnDownNodes, TestDistribDocBasedVersion, TestDownShardTolerantSearch, TestHashPartitioner, TestLeaderElectionZkExpiry, TestPullReplica, TestPullReplicaErrorHandling, TestRandomRequestDistribution, TestRebalanceLeaders, TestSSLRandomization, TestSegmentSorting, TestShortCircuitedRequests, TestSizeLimitedDistributedMap, TlogReplayBufferedWhileIndexingTest, CustomCollectionTest, TestCollectionsAPIViaSolrCloudCluster, TestHdfsCloudBackupRestore, TestLocalFSCloudBackupRestore, TestReplicaProperties, AutoScalingHandlerTest, IndexSizeTriggerTest, MetricTriggerIntegrationTest, ScheduledTriggerIntegrationTest, TriggerCooldownIntegrationTest, TestSimDistributedQueue, TestSimNodeAddedTrigger, BaseCdcrDistributedZkTest, CdcrWithNodesRestartsTest, HdfsUnloadDistributedZkTest, StressHdfsTest, TestClusterStateMutator, ZkStateReaderTest, RuleEngineTest, BlobRepositoryCloudTest, ByteBuffersDirectoryFactoryTest, ConfigureRecoveryStrategyTest, CoreSorterTest, DirectoryFactoryTest, PluginInfoTest, ResourceLoaderTest, SOLR749Test, SolrCoreCheckLockOnStartupTest, SolrCoreTest, TestBackupRepositoryFactory, TestBadConfig, TestCodecSupport, TestConfig, TestConfigOverlay, TestConfigSetImmutable, TestConfigSetProperties, TestConfigSets, TestCorePropertiesReload, TestCustomStream, TestDirectoryFactory, TestDynamicURP, TestQuerySenderNoQuery, TestSimpleTextCodec, TestSolrConfigHandler, DocumentAnalysisRequestHandlerTest, FieldAnalysisRequestHandlerTest, JsonLoaderTest, RequestLoggingTest, ResponseBuilderTest, SearchHandlerTest, TestCSVLoader, TestConfigReload, TestReplicationHandler, TestRawTransformer, TestChildDocTransformer, TestSubQueryTransformer, TestRestManager, TestBulkSchemaAPI, TestManagedSynonymFilterFactory, DateFieldTest, DateRangeFieldTest, DocValuesTest, SynonymTokenizerTest, TestBinaryField, TestCollationField, TestCollationFieldDocValues, TestManagedSchemaThreadSafety, TestSchemaManager, TestUseDocValuesAsStored2, TestComplexPhraseLeadingWildcard, TestDocSet, TestExtendedDismaxParser, TestIndexSearcher, TestPayloadScoreQParserPlugin, TestQueryTypes, TestReRankQParserPlugin, TestRecovery, TestCloudJSONFacetSKG, TestScoreJoinQPScore, SimpleMLTQParserTest]
   [junit4] Completed [763/856 (1!)] on J1 in 1.29s, 1 test, 1 error <<< FAILURES!

[...truncated 50157 lines...]
[asciidoctor:convert] asciidoctor: ERROR: about-this-guide.adoc: line 1: invalid part, must have at least one section (e.g., chapter, appendix, etc.)
[asciidoctor:convert] asciidoctor: ERROR: solr-glossary.adoc: line 1: invalid part, must have at least one section (e.g., chapter, appendix, etc.)
     [java] Processed 2570 links (2103 relative) to 3374 anchors in 253 files
     [echo] Validated Links & Anchors via: /x1/jenkins/jenkins-slave/workspace/Lucene-Solr-NightlyTests-8.1/checkout/solr/build/solr-ref-guide/bare-bones-html/

-documentation-lint:
    [jtidy] Checking for broken html (such as invalid tags)...
   [delete] Deleting directory /x1/jenkins/jenkins-slave/workspace/Lucene-Solr-NightlyTests-8.1/checkout/lucene/build/jtidy_tmp
     [echo] Checking for broken links...
     [exec] 
     [exec] Crawl/parse...
     [exec] 
     [exec] Verify...
     [echo] Checking for malformed docs...

jar-checksums:

resolve:

ivy-availability-check:
[loadresource] Do not set property disallowed.ivy.jars.list as its length is 0.

-ivy-fail-disallowed-ivy-version:

ivy-fail:

ivy-configure:
[ivy:configure] :: loading settings :: file = /x1/jenkins/jenkins-slave/workspace/Lucene-Solr-NightlyTests-8.1/checkout/lucene/top-level-ivy-settings.xml

resolve:

ivy-availability-check:
[loadresource] Do not set property disallowed.ivy.jars.list as its length is 0.

-ivy-fail-disallowed-ivy-version:

ivy-fail:

ivy-configure:
[ivy:configure] :: loading settings :: file = /x1/jenkins/jenkins-slave/workspace/Lucene-Solr-NightlyTests-8.1/checkout/lucene/top-level-ivy-settings.xml

resolve:

resolve:

ivy-availability-check:
[loadresource] Do not set property disallowed.ivy.jars.list as its length is 0.

-ivy-fail-disallowed-ivy-version:

ivy-fail:

ivy-configure:
[ivy:configure] :: loading settings :: file = /x1/jenkins/jenkins-slave/workspace/Lucene-Solr-NightlyTests-8.1/checkout/lucene/top-level-ivy-settings.xml

resolve:

ivy-availability-check:
[loadresource] Do not set property disallowed.ivy.jars.list as its length is 0.

-ivy-fail-disallowed-ivy-version:

ivy-fail:

ivy-configure:
[ivy:configure] :: loading settings :: file = /x1/jenkins/jenkins-slave/workspace/Lucene-Solr-NightlyTests-8.1/checkout/lucene/top-level-ivy-settings.xml

resolve:

ivy-availability-check:
[loadresource] Do not set property disallowed.ivy.jars.list as its length is 0.

-ivy-fail-disallowed-ivy-version:

ivy-fail:

ivy-configure:
[ivy:configure] :: loading settings :: file = /x1/jenkins/jenkins-slave/workspace/Lucene-Solr-NightlyTests-8.1/checkout/lucene/top-level-ivy-settings.xml

resolve:

ivy-availability-check:
[loadresource] Do not set property disallowed.ivy.jars.list as its length is 0.

-ivy-fail-disallowed-ivy-version:

ivy-fail:

ivy-configure:
[ivy:configure] :: loading settings :: file = /x1/jenkins/jenkins-slave/workspace/Lucene-Solr-NightlyTests-8.1/checkout/lucene/top-level-ivy-settings.xml

resolve:

ivy-availability-check:
[loadresource] Do not set property disallowed.ivy.jars.list as its length is 0.

-ivy-fail-disallowed-ivy-version:

ivy-fail:

ivy-configure:
[ivy:configure] :: loading settings :: file = /x1/jenkins/jenkins-slave/workspace/Lucene-Solr-NightlyTests-8.1/checkout/lucene/top-level-ivy-settings.xml

resolve:

ivy-availability-check:
[loadresource] Do not set property disallowed.ivy.jars.list as its length is 0.

-ivy-fail-disallowed-ivy-version:

ivy-fail:

ivy-configure:
[ivy:configure] :: loading settings :: file = /x1/jenkins/jenkins-slave/workspace/Lucene-Solr-NightlyTests-8.1/checkout/lucene/top-level-ivy-settings.xml

resolve:

ivy-availability-check:
[loadresource] Do not set property disallowed.ivy.jars.list as its length is 0.

-ivy-fail-disallowed-ivy-version:

ivy-fail:

ivy-configure:
[ivy:configure] :: loading settings :: file = /x1/jenkins/jenkins-slave/workspace/Lucene-Solr-NightlyTests-8.1/checkout/lucene/top-level-ivy-settings.xml

resolve:

ivy-availability-check:
[loadresource] Do not set property disallowed.ivy.jars.list as its length is 0.

-ivy-fail-disallowed-ivy-version:

ivy-fail:

ivy-configure:
[ivy:configure] :: loading settings :: file = /x1/jenkins/jenkins-slave/workspace/Lucene-Solr-NightlyTests-8.1/checkout/lucene/top-level-ivy-settings.xml

resolve:

ivy-availability-check:
[loadresource] Do not set property disallowed.ivy.jars.list as its length is 0.

-ivy-fail-disallowed-ivy-version:

ivy-fail:

ivy-configure:
[ivy:configure] :: loading settings :: file = /x1/jenkins/jenkins-slave/workspace/Lucene-Solr-NightlyTests-8.1/checkout/lucene/top-level-ivy-settings.xml

resolve:

ivy-availability-check:
[loadresource] Do not set property disallowed.ivy.jars.list as its length is 0.

-ivy-fail-disallowed-ivy-version:

ivy-fail:

ivy-configure:
[ivy:configure] :: loading settings :: file = /x1/jenkins/jenkins-slave/workspace/Lucene-Solr-NightlyTests-8.1/checkout/lucene/top-level-ivy-settings.xml

resolve:

ivy-availability-check:
[loadresource] Do not set property disallowed.ivy.jars.list as its length is 0.

-ivy-fail-disallowed-ivy-version:

ivy-fail:

ivy-configure:
[ivy:configure] :: loading settings :: file = /x1/jenkins/jenkins-slave/workspace/Lucene-Solr-NightlyTests-8.1/checkout/lucene/top-level-ivy-settings.xml

resolve:

ivy-availability-check:
[loadresource] Do not set property disallowed.ivy.jars.list as its length is 0.

-ivy-fail-disallowed-ivy-version:

ivy-fail:

ivy-configure:
[ivy:configure] :: loading settings :: file = /x1/jenkins/jenkins-slave/workspace/Lucene-Solr-NightlyTests-8.1/checkout/lucene/top-level-ivy-settings.xml

resolve:

ivy-availability-check:
[loadresource] Do not set property disallowed.ivy.jars.list as its length is 0.

-ivy-fail-disallowed-ivy-version:

ivy-fail:

ivy-configure:
[ivy:configure] :: loading settings :: file = /x1/jenkins/jenkins-slave/workspace/Lucene-Solr-NightlyTests-8.1/checkout/lucene/top-level-ivy-settings.xml

resolve:

ivy-availability-check:
[loadresource] Do not set property disallowed.ivy.jars.list as its length is 0.

-ivy-fail-disallowed-ivy-version:

ivy-fail:

ivy-configure:
[ivy:configure] :: loading settings :: file = /x1/jenkins/jenkins-slave/workspace/Lucene-Solr-NightlyTests-8.1/checkout/lucene/top-level-ivy-settings.xml

resolve:

ivy-availability-check:
[loadresource] Do not set property disallowed.ivy.jars.list as its length is 0.

-ivy-fail-disallowed-ivy-version:

ivy-fail:

ivy-configure:
[ivy:configure] :: loading settings :: file = /x1/jenkins/jenkins-slave/workspace/Lucene-Solr-NightlyTests-8.1/checkout/lucene/top-level-ivy-settings.xml

resolve:

ivy-availability-check:
[loadresource] Do not set property disallowed.ivy.jars.list as its length is 0.

-ivy-fail-disallowed-ivy-version:

ivy-fail:

ivy-configure:
[ivy:configure] :: loading settings :: file = /x1/jenkins/jenkins-slave/workspace/Lucene-Solr-NightlyTests-8.1/checkout/lucene/top-level-ivy-settings.xml

resolve:

ivy-availability-check:
[loadresource] Do not set property disallowed.ivy.jars.list as its length is 0.

-ivy-fail-disallowed-ivy-version:

ivy-fail:

ivy-configure:
[ivy:configure] :: loading settings :: file = /x1/jenkins/jenkins-slave/workspace/Lucene-Solr-NightlyTests-8.1/checkout/lucene/top-level-ivy-settings.xml

resolve:

ivy-availability-check:
[loadresource] Do not set property disallowed.ivy.jars.list as its length is 0.

-ivy-fail-disallowed-ivy-version:

ivy-fail:

ivy-configure:
[ivy:configure] :: loading settings :: file = /x1/jenkins/jenkins-slave/workspace/Lucene-Solr-NightlyTests-8.1/checkout/lucene/top-level-ivy-settings.xml

resolve:

ivy-availability-check:
[loadresource] Do not set property disallowed.ivy.jars.list as its length is 0.

-ivy-fail-disallowed-ivy-version:

ivy-fail:

ivy-configure:
[ivy:configure] :: loading settings :: file = /x1/jenkins/jenkins-slave/workspace/Lucene-Solr-NightlyTests-8.1/checkout/lucene/top-level-ivy-settings.xml

resolve:

ivy-availability-check:
[loadresource] Do not set property disallowed.ivy.jars.list as its length is 0.

-ivy-fail-disallowed-ivy-version:

ivy-fail:

ivy-configure:
[ivy:configure] :: loading settings :: file = /x1/jenkins/jenkins-slave/workspace/Lucene-Solr-NightlyTests-8.1/checkout/lucene/top-level-ivy-settings.xml

resolve:

ivy-availability-check:
[loadresource] Do not set property disallowed.ivy.jars.list as its length is 0.

-ivy-fail-disallowed-ivy-version:

ivy-fail:

ivy-configure:
[ivy:configure] :: loading settings :: file = /x1/jenkins/jenkins-slave/workspace/Lucene-Solr-NightlyTests-8.1/checkout/lucene/top-level-ivy-settings.xml

resolve:

ivy-availability-check:
[loadresource] Do not set property disallowed.ivy.jars.list as its length is 0.

-ivy-fail-disallowed-ivy-version:

ivy-fail:

ivy-configure:
[ivy:configure] :: loading settings :: file = /x1/jenkins/jenkins-slave/workspace/Lucene-Solr-NightlyTests-8.1/checkout/lucene/top-level-ivy-settings.xml

resolve:

ivy-availability-check:
[loadresource] Do not set property disallowed.ivy.jars.list as its length is 0.

-ivy-fail-disallowed-ivy-version:

ivy-fail:

ivy-configure:
[ivy:configure] :: loading settings :: file = /x1/jenkins/jenkins-slave/workspace/Lucene-Solr-NightlyTests-8.1/checkout/lucene/top-level-ivy-settings.xml

resolve:

ivy-availability-check:
[loadresource] Do not set property disallowed.ivy.jars.list as its length is 0.

-ivy-fail-disallowed-ivy-version:

ivy-fail:

ivy-configure:
[ivy:configure] :: loading settings :: file = /x1/jenkins/jenkins-slave/workspace/Lucene-Solr-NightlyTests-8.1/checkout/lucene/top-level-ivy-settings.xml

resolve:

ivy-availability-check:
[loadresource] Do not set property disallowed.ivy.jars.list as its length is 0.

-ivy-fail-disallowed-ivy-version:

ivy-fail:

ivy-configure:
[ivy:configure] :: loading settings :: file = /x1/jenkins/jenkins-slave/workspace/Lucene-Solr-NightlyTests-8.1/checkout/lucene/top-level-ivy-settings.xml

common.resolve:

resolve:

ivy-availability-check:
[loadresource] Do not set property disallowed.ivy.jars.list as its length is 0.

-ivy-fail-disallowed-ivy-version:

ivy-fail:

ivy-configure:
[ivy:configure] :: loading settings :: file = /x1/jenkins/jenkins-slave/workspace/Lucene-Solr-NightlyTests-8.1/checkout/lucene/top-level-ivy-settings.xml

resolve:

ivy-availability-check:
[loadresource] Do not set property disallowed.ivy.jars.list as its length is 0.

-ivy-fail-disallowed-ivy-version:

ivy-fail:

ivy-configure:
[ivy:configure] :: loading settings :: file = /x1/jenkins/jenkins-slave/workspace/Lucene-Solr-NightlyTests-8.1/checkout/lucene/top-level-ivy-settings.xml

resolve:

ivy-availability-check:
[loadresource] Do not set property disallowed.ivy.jars.list as its length is 0.

-ivy-fail-disallowed-ivy-version:

ivy-fail:

ivy-configure:
[ivy:configure] :: loading settings :: file = /x1/jenkins/jenkins-slave/workspace/Lucene-Solr-NightlyTests-8.1/checkout/lucene/top-level-ivy-settings.xml

resolve:

ivy-availability-check:
[loadresource] Do not set property disallowed.ivy.jars.list as its length is 0.

-ivy-fail-disallowed-ivy-version:

ivy-fail:

ivy-configure:
[ivy:configure] :: loading settings :: file = /x1/jenkins/jenkins-slave/workspace/Lucene-Solr-NightlyTests-8.1/checkout/lucene/top-level-ivy-settings.xml

resolve:

ivy-availability-check:
[loadresource] Do not set property disallowed.ivy.jars.list as its length is 0.

-ivy-fail-disallowed-ivy-version:

ivy-fail:

ivy-configure:
[ivy:configure] :: loading settings :: file = /x1/jenkins/jenkins-slave/workspace/Lucene-Solr-NightlyTests-8.1/checkout/lucene/top-level-ivy-settings.xml

resolve:

jar-checksums:
    [mkdir] Created dir: /x1/jenkins/jenkins-slave/workspace/Lucene-Solr-NightlyTests-8.1/checkout/lucene/null1381314905
     [copy] Copying 38 files to /x1/jenkins/jenkins-slave/workspace/Lucene-Solr-NightlyTests-8.1/checkout/lucene/null1381314905
   [delete] Deleting directory /x1/jenkins/jenkins-slave/workspace/Lucene-Solr-NightlyTests-8.1/checkout/lucene/null1381314905

resolve-example:

ivy-availability-check:
[loadresource] Do not set property disallowed.ivy.jars.list as its length is 0.

-ivy-fail-disallowed-ivy-version:

ivy-fail:

ivy-configure:
[ivy:configure] :: loading settings :: file = /x1/jenkins/jenkins-slave/workspace/Lucene-Solr-NightlyTests-8.1/checkout/lucene/top-level-ivy-settings.xml

resolve:

resolve-server:

ivy-availability-check:
[loadresource] Do not set property disallowed.ivy.jars.list as its length is 0.

-ivy-fail-disallowed-ivy-version:

ivy-fail:

ivy-fail:

ivy-configure:
[ivy:configure] :: loading settings :: file = /x1/jenkins/jenkins-slave/workspace/Lucene-Solr-NightlyTests-8.1/checkout/lucene/top-level-ivy-settings.xml

resolve:

resolve:

ivy-availability-check:
[loadresource] Do not set property disallowed.ivy.jars.list as its length is 0.

-ivy-fail-disallowed-ivy-version:

ivy-fail:

ivy-fail:

ivy-configure:
[ivy:configure] :: loading settings :: file = /x1/jenkins/jenkins-slave/workspace/Lucene-Solr-NightlyTests-8.1/checkout/lucene/top-level-ivy-settings.xml

resolve:

ivy-availability-check:
[loadresource] Do not set property disallowed.ivy.jars.list as its length is 0.

-ivy-fail-disallowed-ivy-version:

ivy-fail:

ivy-fail:

ivy-configure:
[ivy:configure] :: loading settings :: file = /x1/jenkins/jenkins-slave/workspace/Lucene-Solr-NightlyTests-8.1/checkout/lucene/top-level-ivy-settings.xml

resolve:

ivy-availability-check:
[loadresource] Do not set property disallowed.ivy.jars.list as its length is 0.

-ivy-fail-disallowed-ivy-version:

ivy-fail:

ivy-configure:
[ivy:configure] :: loading settings :: file = /x1/jenkins/jenkins-slave/workspace/Lucene-Solr-NightlyTests-8.1/checkout/lucene/top-level-ivy-settings.xml

resolve:

ivy-availability-check:
[loadresource] Do not set property disallowed.ivy.jars.list as its length is 0.

-ivy-fail-disallowed-ivy-version:

ivy-fail:

ivy-fail:

ivy-configure:
[ivy:configure] :: loading settings :: file = /x1/jenkins/jenkins-slave/workspace/Lucene-Solr-NightlyTests-8.1/checkout/lucene/top-level-ivy-settings.xml

resolve:

ivy-availability-check:
[loadresource] Do not set property disallowed.ivy.jars.list as its length is 0.

-ivy-fail-disallowed-ivy-version:

ivy-fail:

ivy-configure:
[ivy:configure] :: loading settings :: file = /x1/jenkins/jenkins-slave/workspace/Lucene-Solr-NightlyTests-8.1/checkout/lucene/top-level-ivy-settings.xml

resolve:

ivy-availability-check:
[loadresource] Do not set property disallowed.ivy.jars.list as its length is 0.

-ivy-fail-disallowed-ivy-version:

ivy-fail:

ivy-fail:

ivy-configure:
[ivy:configure] :: loading settings :: file = /x1/jenkins/jenkins-slave/workspace/Lucene-Solr-NightlyTests-8.1/checkout/lucene/top-level-ivy-settings.xml

resolve:

ivy-availability-check:
[loadresource] Do not set property disallowed.ivy.jars.list as its length is 0.

-ivy-fail-disallowed-ivy-version:

ivy-fail:

ivy-fail:

ivy-configure:
[ivy:configure] :: loading settings :: file = /x1/jenkins/jenkins-slave/workspace/Lucene-Solr-NightlyTests-8.1/checkout/lucene/top-level-ivy-settings.xml

resolve:

ivy-availability-check:
[loadresource] Do not set property disallowed.ivy.jars.list as its length is 0.

-ivy-fail-disallowed-ivy-version:

ivy-fail:

ivy-fail:

ivy-configure:
[ivy:configure] :: loading settings :: file = /x1/jenkins/jenkins-slave/workspace/Lucene-Solr-NightlyTests-8.1/checkout/lucene/top-level-ivy-settings.xml

resolve:

ivy-availability-check:
[loadresource] Do not set property disallowed.ivy.jars.list as its length is 0.

-ivy-fail-disallowed-ivy-version:

ivy-fail:

ivy-fail:

ivy-configure:
[ivy:configure] :: loading settings :: file = /x1/jenkins/jenkins-slave/workspace/Lucene-Solr-NightlyTests-8.1/checkout/lucene/top-level-ivy-settings.xml

resolve:

ivy-availability-check:
[loadresource] Do not set property disallowed.ivy.jars.list as its length is 0.

-ivy-fail-disallowed-ivy-version:

ivy-fail:

ivy-fail:

ivy-configure:
[ivy:configure] :: loading settings :: file = /x1/jenkins/jenkins-slave/workspace/Lucene-Solr-NightlyTests-8.1/checkout/lucene/top-level-ivy-settings.xml

resolve:

ivy-availability-check:
[loadresource] Do not set property disallowed.ivy.jars.list as its length is 0.

-ivy-fail-disallowed-ivy-version:

ivy-fail:

ivy-fail:

ivy-configure:
[ivy:configure] :: loading settings :: file = /x1/jenkins/jenkins-slave/workspace/Lucene-Solr-NightlyTests-8.1/checkout/lucene/top-level-ivy-settings.xml

resolve:

ivy-availability-check:
[loadresource] Do not set property disallowed.ivy.jars.list as its length is 0.

-ivy-fail-disallowed-ivy-version:

ivy-fail:

ivy-fail:

ivy-configure:
[ivy:configure] :: loading settings :: file = /x1/jenkins/jenkins-slave/workspace/Lucene-Solr-NightlyTests-8.1/checkout/lucene/top-level-ivy-settings.xml

resolve:

ivy-availability-check:
[loadresource] Do not set property disallowed.ivy.jars.list as its length is 0.

-ivy-fail-disallowed-ivy-version:

ivy-fail:

ivy-fail:

ivy-configure:
[ivy:configure] :: loading settings :: file = /x1/jenkins/jenkins-slave/workspace/Lucene-Solr-NightlyTests-8.1/checkout/lucene/top-level-ivy-settings.xml

resolve:

ivy-availability-check:
[loadresource] Do not set property disallowed.ivy.jars.list as its length is 0.

-ivy-fail-disallowed-ivy-version:

ivy-fail:

ivy-fail:

ivy-configure:
[ivy:configure] :: loading settings :: file = /x1/jenkins/jenkins-slave/workspace/Lucene-Solr-NightlyTests-8.1/checkout/lucene/top-level-ivy-settings.xml

resolve:

ivy-availability-check:
[loadresource] Do not set property disallowed.ivy.jars.list as its length is 0.

-ivy-fail-disallowed-ivy-version:

ivy-fail:

ivy-fail:

ivy-configure:
[ivy:configure] :: loading settings :: file = /x1/jenkins/jenkins-slave/workspace/Lucene-Solr-NightlyTests-8.1/checkout/lucene/top-level-ivy-settings.xml

resolve:

jar-checksums:
    [mkdir] Created dir: /x1/jenkins/jenkins-slave/workspace/Lucene-Solr-NightlyTests-8.1/checkout/solr/null1358024885
     [copy] Copying 239 files to /x1/jenkins/jenkins-slave/workspace/Lucene-Solr-NightlyTests-8.1/checkout/solr/null1358024885
   [delete] Deleting directory /x1/jenkins/jenkins-slave/workspace/Lucene-Solr-NightlyTests-8.1/checkout/solr/null1358024885

check-working-copy:
[ivy:cachepath] :: resolving dependencies :: #;working@lucene1-us-west
[ivy:cachepath] 	confs: [default]
[ivy:cachepath] 	found org.eclipse.jgit#org.eclipse.jgit;5.3.0.201903130848-r in public
[ivy:cachepath] 	found com.jcraft#jsch;0.1.54 in public
[ivy:cachepath] 	found com.jcraft#jzlib;1.1.1 in public
[ivy:cachepath] 	found com.googlecode.javaewah#JavaEWAH;1.1.6 in public
[ivy:cachepath] 	found org.slf4j#slf4j-api;1.7.2 in public
[ivy:cachepath] 	found org.bouncycastle#bcpg-jdk15on;1.60 in public
[ivy:cachepath] 	found org.bouncycastle#bcprov-jdk15on;1.60 in public
[ivy:cachepath] 	found org.bouncycastle#bcpkix-jdk15on;1.60 in public
[ivy:cachepath] 	found org.slf4j#slf4j-nop;1.7.2 in public
[ivy:cachepath] :: resolution report :: resolve 414ms :: artifacts dl 38ms
	---------------------------------------------------------------------
	|                  |            modules            ||   artifacts   |
	|       conf       | number| search|dwnlded|evicted|| number|dwnlded|
	---------------------------------------------------------------------
	|      default     |   9   |   0   |   0   |   0   ||   9   |   0   |
	---------------------------------------------------------------------
[wc-checker] Initializing working copy...
[wc-checker] Checking working copy status...

-jenkins-base:

BUILD SUCCESSFUL
Total time: 310 minutes 42 seconds
Archiving artifacts
java.lang.InterruptedException: no matches found within 10000
	at hudson.FilePath$ValidateAntFileMask.hasMatch(FilePath.java:2847)
	at hudson.FilePath$ValidateAntFileMask.invoke(FilePath.java:2726)
	at hudson.FilePath$ValidateAntFileMask.invoke(FilePath.java:2707)
	at hudson.FilePath$FileCallableWrapper.call(FilePath.java:3086)
Also:   hudson.remoting.Channel$CallSiteStackTrace: Remote call to lucene
		at hudson.remoting.Channel.attachCallSiteStackTrace(Channel.java:1741)
		at hudson.remoting.UserRequest$ExceptionResponse.retrieve(UserRequest.java:357)
		at hudson.remoting.Channel.call(Channel.java:955)
		at hudson.FilePath.act(FilePath.java:1072)
		at hudson.FilePath.act(FilePath.java:1061)
		at hudson.FilePath.validateAntFileMask(FilePath.java:2705)
		at hudson.tasks.ArtifactArchiver.perform(ArtifactArchiver.java:243)
		at hudson.tasks.BuildStepCompatibilityLayer.perform(BuildStepCompatibilityLayer.java:81)
		at hudson.tasks.BuildStepMonitor$1.perform(BuildStepMonitor.java:20)
		at hudson.model.AbstractBuild$AbstractBuildExecution.perform(AbstractBuild.java:744)
		at hudson.model.AbstractBuild$AbstractBuildExecution.performAllBuildSteps(AbstractBuild.java:690)
		at hudson.model.Build$BuildExecution.post2(Build.java:186)
		at hudson.model.AbstractBuild$AbstractBuildExecution.post(AbstractBuild.java:635)
		at hudson.model.Run.execute(Run.java:1835)
		at hudson.model.FreeStyleBuild.run(FreeStyleBuild.java:43)
		at hudson.model.ResourceController.execute(ResourceController.java:97)
		at hudson.model.Executor.run(Executor.java:429)
Caused: hudson.FilePath$TunneledInterruptedException
	at hudson.FilePath$FileCallableWrapper.call(FilePath.java:3088)
	at hudson.remoting.UserRequest.perform(UserRequest.java:212)
	at hudson.remoting.UserRequest.perform(UserRequest.java:54)
	at hudson.remoting.Request$2.run(Request.java:369)
	at hudson.remoting.InterceptingExecutorService$1.call(InterceptingExecutorService.java:72)
	at java.util.concurrent.FutureTask.run(FutureTask.java:266)
	at java.util.concurrent.ThreadPoolExecutor.runWorker(ThreadPoolExecutor.java:1142)
	at java.util.concurrent.ThreadPoolExecutor$Worker.run(ThreadPoolExecutor.java:617)
	at java.lang.Thread.run(Thread.java:748)
Caused: java.lang.InterruptedException: java.lang.InterruptedException: no matches found within 10000
	at hudson.FilePath.act(FilePath.java:1074)
	at hudson.FilePath.act(FilePath.java:1061)
	at hudson.FilePath.validateAntFileMask(FilePath.java:2705)
	at hudson.tasks.ArtifactArchiver.perform(ArtifactArchiver.java:243)
	at hudson.tasks.BuildStepCompatibilityLayer.perform(BuildStepCompatibilityLayer.java:81)
	at hudson.tasks.BuildStepMonitor$1.perform(BuildStepMonitor.java:20)
	at hudson.model.AbstractBuild$AbstractBuildExecution.perform(AbstractBuild.java:744)
	at hudson.model.AbstractBuild$AbstractBuildExecution.performAllBuildSteps(AbstractBuild.java:690)
	at hudson.model.Build$BuildExecution.post2(Build.java:186)
	at hudson.model.AbstractBuild$AbstractBuildExecution.post(AbstractBuild.java:635)
	at hudson.model.Run.execute(Run.java:1835)
	at hudson.model.FreeStyleBuild.run(FreeStyleBuild.java:43)
	at hudson.model.ResourceController.execute(ResourceController.java:97)
	at hudson.model.Executor.run(Executor.java:429)
No artifacts found that match the file pattern "**/*.events,heapdumps/**,**/hs_err_pid*". Configuration error?
Recording test results
Build step 'Publish JUnit test result report' changed build result to UNSTABLE
Email was triggered for: Unstable (Test Failures)
Sending email for trigger: Unstable (Test Failures)

Mime
View raw message