lucene-dev mailing list archives

Site index · List index
Message view « Date » · « Thread »
Top « Date » · « Thread »
From Policeman Jenkins Server <jenk...@thetaphi.de>
Subject [JENKINS] Lucene-Solr-8.x-Windows (64bit/jdk-12.0.1) - Build # 378 - Unstable!
Date Sun, 21 Jul 2019 18:54:26 GMT
Build: https://jenkins.thetaphi.de/job/Lucene-Solr-8.x-Windows/378/
Java: 64bit/jdk-12.0.1 -XX:-UseCompressedOops -XX:+UseConcMarkSweepGC

1 tests failed.
FAILED:  org.apache.solr.cloud.autoscaling.AutoAddReplicasIntegrationTest.testSimple

Error Message:
IOException occurred when talking to server at: https://127.0.0.1:59785/solr

Stack Trace:
org.apache.solr.client.solrj.SolrServerException: IOException occurred when talking to server at: https://127.0.0.1:59785/solr
	at __randomizedtesting.SeedInfo.seed([C7F558FFEEF2E52F:FF467C01C90131FE]:0)
	at org.apache.solr.client.solrj.impl.HttpSolrClient.executeMethod(HttpSolrClient.java:670)
	at org.apache.solr.client.solrj.impl.HttpSolrClient.request(HttpSolrClient.java:262)
	at org.apache.solr.client.solrj.impl.HttpSolrClient.request(HttpSolrClient.java:245)
	at org.apache.solr.client.solrj.impl.LBSolrClient.doRequest(LBSolrClient.java:368)
	at org.apache.solr.client.solrj.impl.LBSolrClient.request(LBSolrClient.java:296)
	at org.apache.solr.client.solrj.impl.BaseCloudSolrClient.sendRequest(BaseCloudSolrClient.java:1128)
	at org.apache.solr.client.solrj.impl.BaseCloudSolrClient.requestWithRetryOnStaleState(BaseCloudSolrClient.java:897)
	at org.apache.solr.client.solrj.impl.BaseCloudSolrClient.request(BaseCloudSolrClient.java:829)
	at org.apache.solr.client.solrj.SolrClient.request(SolrClient.java:1274)
	at org.apache.solr.cloud.autoscaling.AutoAddReplicasIntegrationTest.enableAutoAddReplicasInCluster(AutoAddReplicasIntegrationTest.java:191)
	at org.apache.solr.cloud.autoscaling.AutoAddReplicasIntegrationTest.testSimple(AutoAddReplicasIntegrationTest.java:146)
	at java.base/jdk.internal.reflect.NativeMethodAccessorImpl.invoke0(Native Method)
	at java.base/jdk.internal.reflect.NativeMethodAccessorImpl.invoke(NativeMethodAccessorImpl.java:62)
	at java.base/jdk.internal.reflect.DelegatingMethodAccessorImpl.invoke(DelegatingMethodAccessorImpl.java:43)
	at java.base/java.lang.reflect.Method.invoke(Method.java:567)
	at com.carrotsearch.randomizedtesting.RandomizedRunner.invoke(RandomizedRunner.java:1750)
	at com.carrotsearch.randomizedtesting.RandomizedRunner$8.evaluate(RandomizedRunner.java:938)
	at com.carrotsearch.randomizedtesting.RandomizedRunner$9.evaluate(RandomizedRunner.java:974)
	at com.carrotsearch.randomizedtesting.RandomizedRunner$10.evaluate(RandomizedRunner.java:988)
	at com.carrotsearch.randomizedtesting.rules.SystemPropertiesRestoreRule$1.evaluate(SystemPropertiesRestoreRule.java:57)
	at org.apache.lucene.util.TestRuleSetupTeardownChained$1.evaluate(TestRuleSetupTeardownChained.java:49)
	at org.apache.lucene.util.AbstractBeforeAfterRule$1.evaluate(AbstractBeforeAfterRule.java:45)
	at org.apache.lucene.util.TestRuleThreadAndTestName$1.evaluate(TestRuleThreadAndTestName.java:48)
	at org.apache.lucene.util.TestRuleIgnoreAfterMaxFailures$1.evaluate(TestRuleIgnoreAfterMaxFailures.java:64)
	at org.apache.lucene.util.TestRuleMarkFailure$1.evaluate(TestRuleMarkFailure.java:47)
	at com.carrotsearch.randomizedtesting.rules.StatementAdapter.evaluate(StatementAdapter.java:36)
	at com.carrotsearch.randomizedtesting.ThreadLeakControl$StatementRunner.run(ThreadLeakControl.java:368)
	at com.carrotsearch.randomizedtesting.ThreadLeakControl.forkTimeoutingTask(ThreadLeakControl.java:817)
	at com.carrotsearch.randomizedtesting.ThreadLeakControl$3.evaluate(ThreadLeakControl.java:468)
	at com.carrotsearch.randomizedtesting.RandomizedRunner.runSingleTest(RandomizedRunner.java:947)
	at com.carrotsearch.randomizedtesting.RandomizedRunner$5.evaluate(RandomizedRunner.java:832)
	at com.carrotsearch.randomizedtesting.RandomizedRunner$6.evaluate(RandomizedRunner.java:883)
	at com.carrotsearch.randomizedtesting.RandomizedRunner$7.evaluate(RandomizedRunner.java:894)
	at com.carrotsearch.randomizedtesting.rules.StatementAdapter.evaluate(StatementAdapter.java:36)
	at com.carrotsearch.randomizedtesting.rules.SystemPropertiesRestoreRule$1.evaluate(SystemPropertiesRestoreRule.java:57)
	at org.apache.lucene.util.AbstractBeforeAfterRule$1.evaluate(AbstractBeforeAfterRule.java:45)
	at com.carrotsearch.randomizedtesting.rules.StatementAdapter.evaluate(StatementAdapter.java:36)
	at org.apache.lucene.util.TestRuleStoreClassName$1.evaluate(TestRuleStoreClassName.java:41)
	at com.carrotsearch.randomizedtesting.rules.NoShadowingOrOverridesOnMethodsRule$1.evaluate(NoShadowingOrOverridesOnMethodsRule.java:40)
	at com.carrotsearch.randomizedtesting.rules.NoShadowingOrOverridesOnMethodsRule$1.evaluate(NoShadowingOrOverridesOnMethodsRule.java:40)
	at com.carrotsearch.randomizedtesting.rules.StatementAdapter.evaluate(StatementAdapter.java:36)
	at com.carrotsearch.randomizedtesting.rules.StatementAdapter.evaluate(StatementAdapter.java:36)
	at org.apache.lucene.util.TestRuleAssertionsRequired$1.evaluate(TestRuleAssertionsRequired.java:53)
	at org.apache.lucene.util.TestRuleMarkFailure$1.evaluate(TestRuleMarkFailure.java:47)
	at org.apache.lucene.util.TestRuleIgnoreAfterMaxFailures$1.evaluate(TestRuleIgnoreAfterMaxFailures.java:64)
	at org.apache.lucene.util.TestRuleIgnoreTestSuites$1.evaluate(TestRuleIgnoreTestSuites.java:54)
	at com.carrotsearch.randomizedtesting.rules.StatementAdapter.evaluate(StatementAdapter.java:36)
	at com.carrotsearch.randomizedtesting.ThreadLeakControl$StatementRunner.run(ThreadLeakControl.java:368)
	at java.base/java.lang.Thread.run(Thread.java:835)
Caused by: javax.net.ssl.SSLException: Software caused connection abort: recv failed
	at java.base/sun.security.ssl.Alert.createSSLException(Alert.java:127)
	at java.base/sun.security.ssl.TransportContext.fatal(TransportContext.java:320)
	at java.base/sun.security.ssl.TransportContext.fatal(TransportContext.java:263)
	at java.base/sun.security.ssl.TransportContext.fatal(TransportContext.java:258)
	at java.base/sun.security.ssl.SSLSocketImpl.handleException(SSLSocketImpl.java:1342)
	at java.base/sun.security.ssl.SSLSocketImpl$AppInputStream.read(SSLSocketImpl.java:844)
	at org.apache.http.impl.io.SessionInputBufferImpl.streamRead(SessionInputBufferImpl.java:137)
	at org.apache.http.impl.io.SessionInputBufferImpl.fillBuffer(SessionInputBufferImpl.java:153)
	at org.apache.http.impl.io.SessionInputBufferImpl.readLine(SessionInputBufferImpl.java:282)
	at org.apache.http.impl.conn.DefaultHttpResponseParser.parseHead(DefaultHttpResponseParser.java:138)
	at org.apache.http.impl.conn.DefaultHttpResponseParser.parseHead(DefaultHttpResponseParser.java:56)
	at org.apache.http.impl.io.AbstractMessageParser.parse(AbstractMessageParser.java:259)
	at org.apache.http.impl.DefaultBHttpClientConnection.receiveResponseHeader(DefaultBHttpClientConnection.java:163)
	at org.apache.http.impl.conn.CPoolProxy.receiveResponseHeader(CPoolProxy.java:165)
	at org.apache.http.protocol.HttpRequestExecutor.doReceiveResponse(HttpRequestExecutor.java:273)
	at org.apache.http.protocol.HttpRequestExecutor.execute(HttpRequestExecutor.java:125)
	at org.apache.http.impl.execchain.MainClientExec.execute(MainClientExec.java:272)
	at org.apache.http.impl.execchain.ProtocolExec.execute(ProtocolExec.java:185)
	at org.apache.http.impl.execchain.RetryExec.execute(RetryExec.java:89)
	at org.apache.http.impl.execchain.RedirectExec.execute(RedirectExec.java:110)
	at org.apache.http.impl.client.InternalHttpClient.doExecute(InternalHttpClient.java:185)
	at org.apache.http.impl.client.CloseableHttpClient.execute(CloseableHttpClient.java:83)
	at org.apache.http.impl.client.CloseableHttpClient.execute(CloseableHttpClient.java:56)
	at org.apache.solr.client.solrj.impl.HttpSolrClient.executeMethod(HttpSolrClient.java:555)
	... 48 more
	Suppressed: java.net.SocketException: Software caused connection abort: socket write error
		at java.base/java.net.SocketOutputStream.socketWrite0(Native Method)
		at java.base/java.net.SocketOutputStream.socketWrite(SocketOutputStream.java:110)
		at java.base/java.net.SocketOutputStream.write(SocketOutputStream.java:150)
		at java.base/sun.security.ssl.SSLSocketOutputRecord.encodeAlert(SSLSocketOutputRecord.java:81)
		at java.base/sun.security.ssl.TransportContext.fatal(TransportContext.java:351)
		... 70 more
Caused by: java.net.SocketException: Software caused connection abort: recv failed
	at java.base/java.net.SocketInputStream.socketRead0(Native Method)
	at java.base/java.net.SocketInputStream.socketRead(SocketInputStream.java:115)
	at java.base/java.net.SocketInputStream.read(SocketInputStream.java:168)
	at java.base/java.net.SocketInputStream.read(SocketInputStream.java:140)
	at java.base/sun.security.ssl.SSLSocketInputRecord.read(SSLSocketInputRecord.java:448)
	at java.base/sun.security.ssl.SSLSocketInputRecord.bytesInCompletePacket(SSLSocketInputRecord.java:68)
	at java.base/sun.security.ssl.SSLSocketImpl.readApplicationRecord(SSLSocketImpl.java:1132)
	at java.base/sun.security.ssl.SSLSocketImpl$AppInputStream.read(SSLSocketImpl.java:828)
	... 66 more




Build Log:
[...truncated 2129 lines...]
   [junit4] JVM J0: stderr was not empty, see: C:\Users\jenkins\workspace\Lucene-Solr-8.x-Windows\lucene\build\core\test\temp\junit4-J0-20190721_162850_46516156544177974604789.syserr
   [junit4] >>> JVM J0 emitted unexpected output (verbatim) ----
   [junit4] OpenJDK 64-Bit Server VM warning: Option UseConcMarkSweepGC was deprecated in version 9.0 and will likely be removed in a future release.
   [junit4] <<< JVM J0: EOF ----

   [junit4] JVM J1: stderr was not empty, see: C:\Users\jenkins\workspace\Lucene-Solr-8.x-Windows\lucene\build\core\test\temp\junit4-J1-20190721_162850_4645841248370070401279.syserr
   [junit4] >>> JVM J1 emitted unexpected output (verbatim) ----
   [junit4] OpenJDK 64-Bit Server VM warning: Option UseConcMarkSweepGC was deprecated in version 9.0 and will likely be removed in a future release.
   [junit4] <<< JVM J1: EOF ----

[...truncated 319 lines...]
   [junit4] JVM J0: stderr was not empty, see: C:\Users\jenkins\workspace\Lucene-Solr-8.x-Windows\lucene\build\test-framework\test\temp\junit4-J0-20190721_163800_8869751138337873635400.syserr
   [junit4] >>> JVM J0 emitted unexpected output (verbatim) ----
   [junit4] OpenJDK 64-Bit Server VM warning: Option UseConcMarkSweepGC was deprecated in version 9.0 and will likely be removed in a future release.
   [junit4] <<< JVM J0: EOF ----

[...truncated 3 lines...]
   [junit4] JVM J1: stderr was not empty, see: C:\Users\jenkins\workspace\Lucene-Solr-8.x-Windows\lucene\build\test-framework\test\temp\junit4-J1-20190721_163800_88615814967554082976020.syserr
   [junit4] >>> JVM J1 emitted unexpected output (verbatim) ----
   [junit4] OpenJDK 64-Bit Server VM warning: Option UseConcMarkSweepGC was deprecated in version 9.0 and will likely be removed in a future release.
   [junit4] <<< JVM J1: EOF ----

[...truncated 1091 lines...]
   [junit4] JVM J0: stderr was not empty, see: C:\Users\jenkins\workspace\Lucene-Solr-8.x-Windows\lucene\build\analysis\common\test\temp\junit4-J0-20190721_163953_63811696318361180503154.syserr
   [junit4] >>> JVM J0 emitted unexpected output (verbatim) ----
   [junit4] OpenJDK 64-Bit Server VM warning: Option UseConcMarkSweepGC was deprecated in version 9.0 and will likely be removed in a future release.
   [junit4] <<< JVM J0: EOF ----

   [junit4] JVM J1: stderr was not empty, see: C:\Users\jenkins\workspace\Lucene-Solr-8.x-Windows\lucene\build\analysis\common\test\temp\junit4-J1-20190721_163953_6383817454768927534863.syserr
   [junit4] >>> JVM J1 emitted unexpected output (verbatim) ----
   [junit4] OpenJDK 64-Bit Server VM warning: Option UseConcMarkSweepGC was deprecated in version 9.0 and will likely be removed in a future release.
   [junit4] <<< JVM J1: EOF ----

[...truncated 257 lines...]
   [junit4] JVM J1: stderr was not empty, see: C:\Users\jenkins\workspace\Lucene-Solr-8.x-Windows\lucene\build\analysis\icu\test\temp\junit4-J1-20190721_164226_904309301875503829691.syserr
   [junit4] >>> JVM J1 emitted unexpected output (verbatim) ----
   [junit4] OpenJDK 64-Bit Server VM warning: Option UseConcMarkSweepGC was deprecated in version 9.0 and will likely be removed in a future release.
   [junit4] <<< JVM J1: EOF ----

[...truncated 3 lines...]
   [junit4] JVM J0: stderr was not empty, see: C:\Users\jenkins\workspace\Lucene-Solr-8.x-Windows\lucene\build\analysis\icu\test\temp\junit4-J0-20190721_164226_90411068469135132633101.syserr
   [junit4] >>> JVM J0 emitted unexpected output (verbatim) ----
   [junit4] OpenJDK 64-Bit Server VM warning: Option UseConcMarkSweepGC was deprecated in version 9.0 and will likely be removed in a future release.
   [junit4] <<< JVM J0: EOF ----

[...truncated 226 lines...]
   [junit4] JVM J1: stderr was not empty, see: C:\Users\jenkins\workspace\Lucene-Solr-8.x-Windows\lucene\build\analysis\kuromoji\test\temp\junit4-J1-20190721_164240_8802727742991721529593.syserr
   [junit4] >>> JVM J1 emitted unexpected output (verbatim) ----
   [junit4] OpenJDK 64-Bit Server VM warning: Option UseConcMarkSweepGC was deprecated in version 9.0 and will likely be removed in a future release.
   [junit4] <<< JVM J1: EOF ----

[...truncated 3 lines...]
   [junit4] JVM J0: stderr was not empty, see: C:\Users\jenkins\workspace\Lucene-Solr-8.x-Windows\lucene\build\analysis\kuromoji\test\temp\junit4-J0-20190721_164240_8802292001135306742444.syserr
   [junit4] >>> JVM J0 emitted unexpected output (verbatim) ----
   [junit4] OpenJDK 64-Bit Server VM warning: Option UseConcMarkSweepGC was deprecated in version 9.0 and will likely be removed in a future release.
   [junit4] <<< JVM J0: EOF ----

[...truncated 163 lines...]
   [junit4] JVM J1: stderr was not empty, see: C:\Users\jenkins\workspace\Lucene-Solr-8.x-Windows\lucene\build\analysis\morfologik\test\temp\junit4-J1-20190721_164316_24115572541635826808460.syserr
   [junit4] >>> JVM J1 emitted unexpected output (verbatim) ----
   [junit4] OpenJDK 64-Bit Server VM warning: Option UseConcMarkSweepGC was deprecated in version 9.0 and will likely be removed in a future release.
   [junit4] <<< JVM J1: EOF ----

[...truncated 3 lines...]
   [junit4] JVM J0: stderr was not empty, see: C:\Users\jenkins\workspace\Lucene-Solr-8.x-Windows\lucene\build\analysis\morfologik\test\temp\junit4-J0-20190721_164316_2419430088364124517416.syserr
   [junit4] >>> JVM J0 emitted unexpected output (verbatim) ----
   [junit4] OpenJDK 64-Bit Server VM warning: Option UseConcMarkSweepGC was deprecated in version 9.0 and will likely be removed in a future release.
   [junit4] <<< JVM J0: EOF ----

[...truncated 220 lines...]
   [junit4] JVM J1: stderr was not empty, see: C:\Users\jenkins\workspace\Lucene-Solr-8.x-Windows\lucene\build\analysis\nori\test\temp\junit4-J1-20190721_164324_74611738796696181943362.syserr
   [junit4] >>> JVM J1 emitted unexpected output (verbatim) ----
   [junit4] OpenJDK 64-Bit Server VM warning: Option UseConcMarkSweepGC was deprecated in version 9.0 and will likely be removed in a future release.
   [junit4] <<< JVM J1: EOF ----

   [junit4] JVM J0: stderr was not empty, see: C:\Users\jenkins\workspace\Lucene-Solr-8.x-Windows\lucene\build\analysis\nori\test\temp\junit4-J0-20190721_164324_74612189177845661241244.syserr
   [junit4] >>> JVM J0 emitted unexpected output (verbatim) ----
   [junit4] OpenJDK 64-Bit Server VM warning: Option UseConcMarkSweepGC was deprecated in version 9.0 and will likely be removed in a future release.
   [junit4] <<< JVM J0: EOF ----

[...truncated 172 lines...]
   [junit4] JVM J1: stderr was not empty, see: C:\Users\jenkins\workspace\Lucene-Solr-8.x-Windows\lucene\build\analysis\opennlp\test\temp\junit4-J1-20190721_164339_701442198627586579631.syserr
   [junit4] >>> JVM J1 emitted unexpected output (verbatim) ----
   [junit4] OpenJDK 64-Bit Server VM warning: Option UseConcMarkSweepGC was deprecated in version 9.0 and will likely be removed in a future release.
   [junit4] <<< JVM J1: EOF ----

   [junit4] JVM J0: stderr was not empty, see: C:\Users\jenkins\workspace\Lucene-Solr-8.x-Windows\lucene\build\analysis\opennlp\test\temp\junit4-J0-20190721_164339_70112134128013744600729.syserr
   [junit4] >>> JVM J0 emitted unexpected output (verbatim) ----
   [junit4] OpenJDK 64-Bit Server VM warning: Option UseConcMarkSweepGC was deprecated in version 9.0 and will likely be removed in a future release.
   [junit4] <<< JVM J0: EOF ----

[...truncated 180 lines...]
   [junit4] JVM J0: stderr was not empty, see: C:\Users\jenkins\workspace\Lucene-Solr-8.x-Windows\lucene\build\analysis\phonetic\test\temp\junit4-J0-20190721_164344_2887311178575678132540.syserr
   [junit4] >>> JVM J0 emitted unexpected output (verbatim) ----
   [junit4] OpenJDK 64-Bit Server VM warning: Option UseConcMarkSweepGC was deprecated in version 9.0 and will likely be removed in a future release.
   [junit4] <<< JVM J0: EOF ----

   [junit4] JVM J1: stderr was not empty, see: C:\Users\jenkins\workspace\Lucene-Solr-8.x-Windows\lucene\build\analysis\phonetic\test\temp\junit4-J1-20190721_164344_28814909045958575081930.syserr
   [junit4] >>> JVM J1 emitted unexpected output (verbatim) ----
   [junit4] OpenJDK 64-Bit Server VM warning: Option UseConcMarkSweepGC was deprecated in version 9.0 and will likely be removed in a future release.
   [junit4] <<< JVM J1: EOF ----

[...truncated 160 lines...]
   [junit4] JVM J0: stderr was not empty, see: C:\Users\jenkins\workspace\Lucene-Solr-8.x-Windows\lucene\build\analysis\smartcn\test\temp\junit4-J0-20190721_164354_2741471445837026717009.syserr
   [junit4] >>> JVM J0 emitted unexpected output (verbatim) ----
   [junit4] OpenJDK 64-Bit Server VM warning: Option UseConcMarkSweepGC was deprecated in version 9.0 and will likely be removed in a future release.
   [junit4] <<< JVM J0: EOF ----

[...truncated 3 lines...]
   [junit4] JVM J1: stderr was not empty, see: C:\Users\jenkins\workspace\Lucene-Solr-8.x-Windows\lucene\build\analysis\smartcn\test\temp\junit4-J1-20190721_164354_2732900060400854605681.syserr
   [junit4] >>> JVM J1 emitted unexpected output (verbatim) ----
   [junit4] OpenJDK 64-Bit Server VM warning: Option UseConcMarkSweepGC was deprecated in version 9.0 and will likely be removed in a future release.
   [junit4] <<< JVM J1: EOF ----

[...truncated 165 lines...]
   [junit4] JVM J0: stderr was not empty, see: C:\Users\jenkins\workspace\Lucene-Solr-8.x-Windows\lucene\build\analysis\stempel\test\temp\junit4-J0-20190721_164401_76612821155395344924357.syserr
   [junit4] >>> JVM J0 emitted unexpected output (verbatim) ----
   [junit4] OpenJDK 64-Bit Server VM warning: Option UseConcMarkSweepGC was deprecated in version 9.0 and will likely be removed in a future release.
   [junit4] <<< JVM J0: EOF ----

[...truncated 3 lines...]
   [junit4] JVM J1: stderr was not empty, see: C:\Users\jenkins\workspace\Lucene-Solr-8.x-Windows\lucene\build\analysis\stempel\test\temp\junit4-J1-20190721_164401_7665024663427841807082.syserr
   [junit4] >>> JVM J1 emitted unexpected output (verbatim) ----
   [junit4] OpenJDK 64-Bit Server VM warning: Option UseConcMarkSweepGC was deprecated in version 9.0 and will likely be removed in a future release.
   [junit4] <<< JVM J1: EOF ----

[...truncated 194 lines...]
   [junit4] JVM J0: stderr was not empty, see: C:\Users\jenkins\workspace\Lucene-Solr-8.x-Windows\lucene\build\backward-codecs\test\temp\junit4-J0-20190721_164408_08413872782784602044128.syserr
   [junit4] >>> JVM J0 emitted unexpected output (verbatim) ----
   [junit4] OpenJDK 64-Bit Server VM warning: Option UseConcMarkSweepGC was deprecated in version 9.0 and will likely be removed in a future release.
   [junit4] <<< JVM J0: EOF ----

[...truncated 9 lines...]
   [junit4] JVM J1: stderr was not empty, see: C:\Users\jenkins\workspace\Lucene-Solr-8.x-Windows\lucene\build\backward-codecs\test\temp\junit4-J1-20190721_164408_08411483522347438971833.syserr
   [junit4] >>> JVM J1 emitted unexpected output (verbatim) ----
   [junit4] OpenJDK 64-Bit Server VM warning: Option UseConcMarkSweepGC was deprecated in version 9.0 and will likely be removed in a future release.
   [junit4] <<< JVM J1: EOF ----

[...truncated 1557 lines...]
   [junit4] JVM J0: stderr was not empty, see: C:\Users\jenkins\workspace\Lucene-Solr-8.x-Windows\lucene\build\benchmark\test\temp\junit4-J0-20190721_164650_5721264480796649758382.syserr
   [junit4] >>> JVM J0 emitted unexpected output (verbatim) ----
   [junit4] OpenJDK 64-Bit Server VM warning: Option UseConcMarkSweepGC was deprecated in version 9.0 and will likely be removed in a future release.
   [junit4] <<< JVM J0: EOF ----

[...truncated 3 lines...]
   [junit4] JVM J1: stderr was not empty, see: C:\Users\jenkins\workspace\Lucene-Solr-8.x-Windows\lucene\build\benchmark\test\temp\junit4-J1-20190721_164650_57217874753225556917582.syserr
   [junit4] >>> JVM J1 emitted unexpected output (verbatim) ----
   [junit4] OpenJDK 64-Bit Server VM warning: Option UseConcMarkSweepGC was deprecated in version 9.0 and will likely be removed in a future release.
   [junit4] <<< JVM J1: EOF ----

[...truncated 252 lines...]
   [junit4] JVM J0: stderr was not empty, see: C:\Users\jenkins\workspace\Lucene-Solr-8.x-Windows\lucene\build\classification\test\temp\junit4-J0-20190721_164706_79912806045805295717704.syserr
   [junit4] >>> JVM J0 emitted unexpected output (verbatim) ----
   [junit4] OpenJDK 64-Bit Server VM warning: Option UseConcMarkSweepGC was deprecated in version 9.0 and will likely be removed in a future release.
   [junit4] <<< JVM J0: EOF ----

[...truncated 3 lines...]
   [junit4] JVM J1: stderr was not empty, see: C:\Users\jenkins\workspace\Lucene-Solr-8.x-Windows\lucene\build\classification\test\temp\junit4-J1-20190721_164706_7997606818930245617370.syserr
   [junit4] >>> JVM J1 emitted unexpected output (verbatim) ----
   [junit4] OpenJDK 64-Bit Server VM warning: Option UseConcMarkSweepGC was deprecated in version 9.0 and will likely be removed in a future release.
   [junit4] <<< JVM J1: EOF ----

[...truncated 262 lines...]
   [junit4] JVM J1: stderr was not empty, see: C:\Users\jenkins\workspace\Lucene-Solr-8.x-Windows\lucene\build\codecs\test\temp\junit4-J1-20190721_164725_8941032000756024329633.syserr
   [junit4] >>> JVM J1 emitted unexpected output (verbatim) ----
   [junit4] OpenJDK 64-Bit Server VM warning: Option UseConcMarkSweepGC was deprecated in version 9.0 and will likely be removed in a future release.
   [junit4] <<< JVM J1: EOF ----

[...truncated 3 lines...]
   [junit4] JVM J0: stderr was not empty, see: C:\Users\jenkins\workspace\Lucene-Solr-8.x-Windows\lucene\build\codecs\test\temp\junit4-J0-20190721_164725_8943817740161991536279.syserr
   [junit4] >>> JVM J0 emitted unexpected output (verbatim) ----
   [junit4] OpenJDK 64-Bit Server VM warning: Option UseConcMarkSweepGC was deprecated in version 9.0 and will likely be removed in a future release.
   [junit4] <<< JVM J0: EOF ----

[...truncated 232 lines...]
   [junit4] JVM J0: stderr was not empty, see: C:\Users\jenkins\workspace\Lucene-Solr-8.x-Windows\lucene\build\demo\test\temp\junit4-J0-20190721_164927_86611066213452490650353.syserr
   [junit4] >>> JVM J0 emitted unexpected output (verbatim) ----
   [junit4] OpenJDK 64-Bit Server VM warning: Option UseConcMarkSweepGC was deprecated in version 9.0 and will likely be removed in a future release.
   [junit4] <<< JVM J0: EOF ----

[...truncated 3 lines...]
   [junit4] JVM J1: stderr was not empty, see: C:\Users\jenkins\workspace\Lucene-Solr-8.x-Windows\lucene\build\demo\test\temp\junit4-J1-20190721_164927_86617967547734118366920.syserr
   [junit4] >>> JVM J1 emitted unexpected output (verbatim) ----
   [junit4] OpenJDK 64-Bit Server VM warning: Option UseConcMarkSweepGC was deprecated in version 9.0 and will likely be removed in a future release.
   [junit4] <<< JVM J1: EOF ----

[...truncated 174 lines...]
   [junit4] JVM J1: stderr was not empty, see: C:\Users\jenkins\workspace\Lucene-Solr-8.x-Windows\lucene\build\expressions\test\temp\junit4-J1-20190721_164932_154822083946498251457.syserr
   [junit4] >>> JVM J1 emitted unexpected output (verbatim) ----
   [junit4] OpenJDK 64-Bit Server VM warning: Option UseConcMarkSweepGC was deprecated in version 9.0 and will likely be removed in a future release.
   [junit4] <<< JVM J1: EOF ----

[...truncated 3 lines...]
   [junit4] JVM J0: stderr was not empty, see: C:\Users\jenkins\workspace\Lucene-Solr-8.x-Windows\lucene\build\expressions\test\temp\junit4-J0-20190721_164932_1543831600573926906884.syserr
   [junit4] >>> JVM J0 emitted unexpected output (verbatim) ----
   [junit4] OpenJDK 64-Bit Server VM warning: Option UseConcMarkSweepGC was deprecated in version 9.0 and will likely be removed in a future release.
   [junit4] <<< JVM J0: EOF ----

[...truncated 235 lines...]
   [junit4] JVM J0: stderr was not empty, see: C:\Users\jenkins\workspace\Lucene-Solr-8.x-Windows\lucene\build\facet\test\temp\junit4-J0-20190721_164938_8966353995333732614877.syserr
   [junit4] >>> JVM J0 emitted unexpected output (verbatim) ----
   [junit4] OpenJDK 64-Bit Server VM warning: Option UseConcMarkSweepGC was deprecated in version 9.0 and will likely be removed in a future release.
   [junit4] <<< JVM J0: EOF ----

[...truncated 3 lines...]
   [junit4] JVM J1: stderr was not empty, see: C:\Users\jenkins\workspace\Lucene-Solr-8.x-Windows\lucene\build\facet\test\temp\junit4-J1-20190721_164938_89611824471666979688652.syserr
   [junit4] >>> JVM J1 emitted unexpected output (verbatim) ----
   [junit4] OpenJDK 64-Bit Server VM warning: Option UseConcMarkSweepGC was deprecated in version 9.0 and will likely be removed in a future release.
   [junit4] <<< JVM J1: EOF ----

[...truncated 183 lines...]
   [junit4] JVM J1: stderr was not empty, see: C:\Users\jenkins\workspace\Lucene-Solr-8.x-Windows\lucene\build\grouping\test\temp\junit4-J1-20190721_165011_77518428896551924090039.syserr
   [junit4] >>> JVM J1 emitted unexpected output (verbatim) ----
   [junit4] OpenJDK 64-Bit Server VM warning: Option UseConcMarkSweepGC was deprecated in version 9.0 and will likely be removed in a future release.
   [junit4] <<< JVM J1: EOF ----

[...truncated 3 lines...]
   [junit4] JVM J0: stderr was not empty, see: C:\Users\jenkins\workspace\Lucene-Solr-8.x-Windows\lucene\build\grouping\test\temp\junit4-J0-20190721_165011_7746306988516373797843.syserr
   [junit4] >>> JVM J0 emitted unexpected output (verbatim) ----
   [junit4] OpenJDK 64-Bit Server VM warning: Option UseConcMarkSweepGC was deprecated in version 9.0 and will likely be removed in a future release.
   [junit4] <<< JVM J0: EOF ----

[...truncated 259 lines...]
   [junit4] JVM J1: stderr was not empty, see: C:\Users\jenkins\workspace\Lucene-Solr-8.x-Windows\lucene\build\highlighter\test\temp\junit4-J1-20190721_165023_2555682809726377746073.syserr
   [junit4] >>> JVM J1 emitted unexpected output (verbatim) ----
   [junit4] OpenJDK 64-Bit Server VM warning: Option UseConcMarkSweepGC was deprecated in version 9.0 and will likely be removed in a future release.
   [junit4] <<< JVM J1: EOF ----

   [junit4] JVM J0: stderr was not empty, see: C:\Users\jenkins\workspace\Lucene-Solr-8.x-Windows\lucene\build\highlighter\test\temp\junit4-J0-20190721_165023_25510370957175598937133.syserr
   [junit4] >>> JVM J0 emitted unexpected output (verbatim) ----
   [junit4] OpenJDK 64-Bit Server VM warning: Option UseConcMarkSweepGC was deprecated in version 9.0 and will likely be removed in a future release.
   [junit4] <<< JVM J0: EOF ----

[...truncated 170 lines...]
   [junit4] JVM J0: stderr was not empty, see: C:\Users\jenkins\workspace\Lucene-Solr-8.x-Windows\lucene\build\join\test\temp\junit4-J0-20190721_165047_9677434639622775658967.syserr
   [junit4] >>> JVM J0 emitted unexpected output (verbatim) ----
   [junit4] OpenJDK 64-Bit Server VM warning: Option UseConcMarkSweepGC was deprecated in version 9.0 and will likely be removed in a future release.
   [junit4] <<< JVM J0: EOF ----

[...truncated 3 lines...]
   [junit4] JVM J1: stderr was not empty, see: C:\Users\jenkins\workspace\Lucene-Solr-8.x-Windows\lucene\build\join\test\temp\junit4-J1-20190721_165047_96714951799746290827898.syserr
   [junit4] >>> JVM J1 emitted unexpected output (verbatim) ----
   [junit4] OpenJDK 64-Bit Server VM warning: Option UseConcMarkSweepGC was deprecated in version 9.0 and will likely be removed in a future release.
   [junit4] <<< JVM J1: EOF ----

[...truncated 303 lines...]
   [junit4] JVM J1: stderr was not empty, see: C:\Users\jenkins\workspace\Lucene-Solr-8.x-Windows\lucene\build\luke\test\temp\junit4-J1-20190721_165113_63317899511644276552713.syserr
   [junit4] >>> JVM J1 emitted unexpected output (verbatim) ----
   [junit4] OpenJDK 64-Bit Server VM warning: Option UseConcMarkSweepGC was deprecated in version 9.0 and will likely be removed in a future release.
   [junit4] <<< JVM J1: EOF ----

[...truncated 3 lines...]
   [junit4] JVM J0: stderr was not empty, see: C:\Users\jenkins\workspace\Lucene-Solr-8.x-Windows\lucene\build\luke\test\temp\junit4-J0-20190721_165113_63310894639040820125386.syserr
   [junit4] >>> JVM J0 emitted unexpected output (verbatim) ----
   [junit4] OpenJDK 64-Bit Server VM warning: Option UseConcMarkSweepGC was deprecated in version 9.0 and will likely be removed in a future release.
   [junit4] <<< JVM J0: EOF ----

[...truncated 156 lines...]
   [junit4] JVM J0: stderr was not empty, see: C:\Users\jenkins\workspace\Lucene-Solr-8.x-Windows\lucene\build\memory\test\temp\junit4-J0-20190721_165128_29317979038260387287380.syserr
   [junit4] >>> JVM J0 emitted unexpected output (verbatim) ----
   [junit4] OpenJDK 64-Bit Server VM warning: Option UseConcMarkSweepGC was deprecated in version 9.0 and will likely be removed in a future release.
   [junit4] <<< JVM J0: EOF ----

[...truncated 3 lines...]
   [junit4] JVM J1: stderr was not empty, see: C:\Users\jenkins\workspace\Lucene-Solr-8.x-Windows\lucene\build\memory\test\temp\junit4-J1-20190721_165128_29217794946113237257654.syserr
   [junit4] >>> JVM J1 emitted unexpected output (verbatim) ----
   [junit4] OpenJDK 64-Bit Server VM warning: Option UseConcMarkSweepGC was deprecated in version 9.0 and will likely be removed in a future release.
   [junit4] <<< JVM J1: EOF ----

[...truncated 198 lines...]
   [junit4] JVM J1: stderr was not empty, see: C:\Users\jenkins\workspace\Lucene-Solr-8.x-Windows\lucene\build\misc\test\temp\junit4-J1-20190721_165137_8272142732486215769407.syserr
   [junit4] >>> JVM J1 emitted unexpected output (verbatim) ----
   [junit4] OpenJDK 64-Bit Server VM warning: Option UseConcMarkSweepGC was deprecated in version 9.0 and will likely be removed in a future release.
   [junit4] <<< JVM J1: EOF ----

[...truncated 3 lines...]
   [junit4] JVM J0: stderr was not empty, see: C:\Users\jenkins\workspace\Lucene-Solr-8.x-Windows\lucene\build\misc\test\temp\junit4-J0-20190721_165137_82712716292419653643380.syserr
   [junit4] >>> JVM J0 emitted unexpected output (verbatim) ----
   [junit4] OpenJDK 64-Bit Server VM warning: Option UseConcMarkSweepGC was deprecated in version 9.0 and will likely be removed in a future release.
   [junit4] <<< JVM J0: EOF ----

[...truncated 262 lines...]
   [junit4] JVM J0: stderr was not empty, see: C:\Users\jenkins\workspace\Lucene-Solr-8.x-Windows\lucene\build\monitor\test\temp\junit4-J0-20190721_165204_95314631273140201502208.syserr
   [junit4] >>> JVM J0 emitted unexpected output (verbatim) ----
   [junit4] OpenJDK 64-Bit Server VM warning: Option UseConcMarkSweepGC was deprecated in version 9.0 and will likely be removed in a future release.
   [junit4] <<< JVM J0: EOF ----

   [junit4] JVM J1: stderr was not empty, see: C:\Users\jenkins\workspace\Lucene-Solr-8.x-Windows\lucene\build\monitor\test\temp\junit4-J1-20190721_165204_9548769306171309663201.syserr
   [junit4] >>> JVM J1 emitted unexpected output (verbatim) ----
   [junit4] OpenJDK 64-Bit Server VM warning: Option UseConcMarkSweepGC was deprecated in version 9.0 and will likely be removed in a future release.
   [junit4] <<< JVM J1: EOF ----

[...truncated 322 lines...]
   [junit4] JVM J0: stderr was not empty, see: C:\Users\jenkins\workspace\Lucene-Solr-8.x-Windows\lucene\build\queries\test\temp\junit4-J0-20190721_165220_25217718657837102364676.syserr
   [junit4] >>> JVM J0 emitted unexpected output (verbatim) ----
   [junit4] OpenJDK 64-Bit Server VM warning: Option UseConcMarkSweepGC was deprecated in version 9.0 and will likely be removed in a future release.
   [junit4] <<< JVM J0: EOF ----

[...truncated 3 lines...]
   [junit4] JVM J1: stderr was not empty, see: C:\Users\jenkins\workspace\Lucene-Solr-8.x-Windows\lucene\build\queries\test\temp\junit4-J1-20190721_165220_2523951287133004017155.syserr
   [junit4] >>> JVM J1 emitted unexpected output (verbatim) ----
   [junit4] OpenJDK 64-Bit Server VM warning: Option UseConcMarkSweepGC was deprecated in version 9.0 and will likely be removed in a future release.
   [junit4] <<< JVM J1: EOF ----

[...truncated 235 lines...]
   [junit4] JVM J0: stderr was not empty, see: C:\Users\jenkins\workspace\Lucene-Solr-8.x-Windows\lucene\build\queryparser\test\temp\junit4-J0-20190721_165232_2883437946740326702055.syserr
   [junit4] >>> JVM J0 emitted unexpected output (verbatim) ----
   [junit4] OpenJDK 64-Bit Server VM warning: Option UseConcMarkSweepGC was deprecated in version 9.0 and will likely be removed in a future release.
   [junit4] <<< JVM J0: EOF ----

   [junit4] JVM J1: stderr was not empty, see: C:\Users\jenkins\workspace\Lucene-Solr-8.x-Windows\lucene\build\queryparser\test\temp\junit4-J1-20190721_165232_288580652360957000421.syserr
   [junit4] >>> JVM J1 emitted unexpected output (verbatim) ----
   [junit4] OpenJDK 64-Bit Server VM warning: Option UseConcMarkSweepGC was deprecated in version 9.0 and will likely be removed in a future release.
   [junit4] <<< JVM J1: EOF ----

[...truncated 212 lines...]
   [junit4] JVM J1: stderr was not empty, see: C:\Users\jenkins\workspace\Lucene-Solr-8.x-Windows\lucene\build\replicator\test\temp\junit4-J1-20190721_165247_7252704474225425628195.syserr
   [junit4] >>> JVM J1 emitted unexpected output (verbatim) ----
   [junit4] OpenJDK 64-Bit Server VM warning: Option UseConcMarkSweepGC was deprecated in version 9.0 and will likely be removed in a future release.
   [junit4] <<< JVM J1: EOF ----

[...truncated 8 lines...]
   [junit4] JVM J0: stderr was not empty, see: C:\Users\jenkins\workspace\Lucene-Solr-8.x-Windows\lucene\build\replicator\test\temp\junit4-J0-20190721_165247_72513032909172107834898.syserr
   [junit4] >>> JVM J0 emitted unexpected output (verbatim) ----
   [junit4] OpenJDK 64-Bit Server VM warning: Option UseConcMarkSweepGC was deprecated in version 9.0 and will likely be removed in a future release.
   [junit4] <<< JVM J0: EOF ----

[...truncated 276 lines...]
   [junit4] JVM J0: stderr was not empty, see: C:\Users\jenkins\workspace\Lucene-Solr-8.x-Windows\lucene\build\sandbox\test\temp\junit4-J0-20190721_165304_05315827624777141137385.syserr
   [junit4] >>> JVM J0 emitted unexpected output (verbatim) ----
   [junit4] OpenJDK 64-Bit Server VM warning: Option UseConcMarkSweepGC was deprecated in version 9.0 and will likely be removed in a future release.
   [junit4] <<< JVM J0: EOF ----

[...truncated 5 lines...]
   [junit4] JVM J1: stderr was not empty, see: C:\Users\jenkins\workspace\Lucene-Solr-8.x-Windows\lucene\build\sandbox\test\temp\junit4-J1-20190721_165304_05413744525328775082769.syserr
   [junit4] >>> JVM J1 emitted unexpected output (verbatim) ----
   [junit4] OpenJDK 64-Bit Server VM warning: Option UseConcMarkSweepGC was deprecated in version 9.0 and will likely be removed in a future release.
   [junit4] <<< JVM J1: EOF ----

[...truncated 300 lines...]
   [junit4] JVM J0: stderr was not empty, see: C:\Users\jenkins\workspace\Lucene-Solr-8.x-Windows\lucene\build\spatial-extras\test\temp\junit4-J0-20190721_165407_958615159869667244301.syserr
   [junit4] >>> JVM J0 emitted unexpected output (verbatim) ----
   [junit4] OpenJDK 64-Bit Server VM warning: Option UseConcMarkSweepGC was deprecated in version 9.0 and will likely be removed in a future release.
   [junit4] <<< JVM J0: EOF ----

[...truncated 3 lines...]
   [junit4] JVM J1: stderr was not empty, see: C:\Users\jenkins\workspace\Lucene-Solr-8.x-Windows\lucene\build\spatial-extras\test\temp\junit4-J1-20190721_165407_9581540840745140571216.syserr
   [junit4] >>> JVM J1 emitted unexpected output (verbatim) ----
   [junit4] OpenJDK 64-Bit Server VM warning: Option UseConcMarkSweepGC was deprecated in version 9.0 and will likely be removed in a future release.
   [junit4] <<< JVM J1: EOF ----

[...truncated 195 lines...]
   [junit4] JVM J0: stderr was not empty, see: C:\Users\jenkins\workspace\Lucene-Solr-8.x-Windows\lucene\build\spatial3d\test\temp\junit4-J0-20190721_165446_43415588143935133115041.syserr
   [junit4] >>> JVM J0 emitted unexpected output (verbatim) ----
   [junit4] OpenJDK 64-Bit Server VM warning: Option UseConcMarkSweepGC was deprecated in version 9.0 and will likely be removed in a future release.
   [junit4] <<< JVM J0: EOF ----

[...truncated 3 lines...]
   [junit4] JVM J1: stderr was not empty, see: C:\Users\jenkins\workspace\Lucene-Solr-8.x-Windows\lucene\build\spatial3d\test\temp\junit4-J1-20190721_165446_4361557923075151153640.syserr
   [junit4] >>> JVM J1 emitted unexpected output (verbatim) ----
   [junit4] OpenJDK 64-Bit Server VM warning: Option UseConcMarkSweepGC was deprecated in version 9.0 and will likely be removed in a future release.
   [junit4] <<< JVM J1: EOF ----

[...truncated 152 lines...]
   [junit4] JVM J0: stderr was not empty, see: C:\Users\jenkins\workspace\Lucene-Solr-8.x-Windows\lucene\build\spatial\test\temp\junit4-J0-20190721_165515_9889057607542880972858.syserr
   [junit4] >>> JVM J0 emitted unexpected output (verbatim) ----
   [junit4] OpenJDK 64-Bit Server VM warning: Option UseConcMarkSweepGC was deprecated in version 9.0 and will likely be removed in a future release.
   [junit4] <<< JVM J0: EOF ----

[...truncated 256 lines...]
   [junit4] JVM J1: stderr was not empty, see: C:\Users\jenkins\workspace\Lucene-Solr-8.x-Windows\lucene\build\suggest\test\temp\junit4-J1-20190721_165521_6891570872506483314720.syserr
   [junit4] >>> JVM J1 emitted unexpected output (verbatim) ----
   [junit4] OpenJDK 64-Bit Server VM warning: Option UseConcMarkSweepGC was deprecated in version 9.0 and will likely be removed in a future release.
   [junit4] <<< JVM J1: EOF ----

[...truncated 3 lines...]
   [junit4] JVM J0: stderr was not empty, see: C:\Users\jenkins\workspace\Lucene-Solr-8.x-Windows\lucene\build\suggest\test\temp\junit4-J0-20190721_165521_6893572821749194499067.syserr
   [junit4] >>> JVM J0 emitted unexpected output (verbatim) ----
   [junit4] OpenJDK 64-Bit Server VM warning: Option UseConcMarkSweepGC was deprecated in version 9.0 and will likely be removed in a future release.
   [junit4] <<< JVM J0: EOF ----

[...truncated 1776 lines...]
   [junit4] Suite: org.apache.solr.cloud.autoscaling.AutoAddReplicasIntegrationTest
   [junit4]   2> Creating dataDir: C:\Users\jenkins\workspace\Lucene-Solr-8.x-Windows\solr\build\solr-core\test\J1\temp\solr.cloud.autoscaling.AutoAddReplicasIntegrationTest_C7F558FFEEF2E52F-001\init-core-data-001
   [junit4]   2> 31141 INFO  (SUITE-AutoAddReplicasIntegrationTest-seed#[C7F558FFEEF2E52F]-worker) [     ] o.a.s.SolrTestCaseJ4 SecureRandom sanity checks: test.solr.allowed.securerandom=null & java.security.egd=file:/dev/./urandom
   [junit4]   2> 31142 WARN  (SUITE-AutoAddReplicasIntegrationTest-seed#[C7F558FFEEF2E52F]-worker) [     ] o.a.s.SolrTestCaseJ4 startTrackingSearchers: numOpens=29 numCloses=29
   [junit4]   2> 31142 INFO  (SUITE-AutoAddReplicasIntegrationTest-seed#[C7F558FFEEF2E52F]-worker) [     ] o.a.s.SolrTestCaseJ4 Using PointFields (NUMERIC_POINTS_SYSPROP=true) w/NUMERIC_DOCVALUES_SYSPROP=false
   [junit4]   2> 31143 INFO  (SUITE-AutoAddReplicasIntegrationTest-seed#[C7F558FFEEF2E52F]-worker) [     ] o.a.s.SolrTestCaseJ4 Randomized ssl (true) and clientAuth (false) via: @org.apache.solr.util.RandomizeSSL(reason="", value=0.0/0.0, ssl=0.0/0.0, clientAuth=0.0/0.0)
   [junit4]   2> 31172 INFO  (TEST-AutoAddReplicasIntegrationTest.testSimple-seed#[C7F558FFEEF2E52F]) [     ] o.a.s.SolrTestCaseJ4 ###Starting testSimple
   [junit4]   2> 31187 INFO  (TEST-AutoAddReplicasIntegrationTest.testSimple-seed#[C7F558FFEEF2E52F]) [     ] o.a.s.c.MiniSolrCloudCluster Starting cluster of 3 servers in C:\Users\jenkins\workspace\Lucene-Solr-8.x-Windows\solr\build\solr-core\test\J1\temp\solr.cloud.autoscaling.AutoAddReplicasIntegrationTest_C7F558FFEEF2E52F-001\tempDir-001
   [junit4]   2> 31201 INFO  (TEST-AutoAddReplicasIntegrationTest.testSimple-seed#[C7F558FFEEF2E52F]) [     ] o.a.s.c.ZkTestServer STARTING ZK TEST SERVER
   [junit4]   2> 31215 INFO  (ZkTestServer Run Thread) [     ] o.a.s.c.ZkTestServer client port:0.0.0.0/0.0.0.0:0
   [junit4]   2> 31215 INFO  (ZkTestServer Run Thread) [     ] o.a.s.c.ZkTestServer Starting server
   [junit4]   2> 31334 INFO  (TEST-AutoAddReplicasIntegrationTest.testSimple-seed#[C7F558FFEEF2E52F]) [     ] o.a.s.c.ZkTestServer start zk server on port:59772
   [junit4]   2> 31339 INFO  (TEST-AutoAddReplicasIntegrationTest.testSimple-seed#[C7F558FFEEF2E52F]) [     ] o.a.s.c.ZkTestServer parse host and port list: 127.0.0.1:59772
   [junit4]   2> 31339 INFO  (TEST-AutoAddReplicasIntegrationTest.testSimple-seed#[C7F558FFEEF2E52F]) [     ] o.a.s.c.ZkTestServer connecting to 127.0.0.1 59772
   [junit4]   2> 31549 INFO  (TEST-AutoAddReplicasIntegrationTest.testSimple-seed#[C7F558FFEEF2E52F]) [     ] o.a.s.c.c.ConnectionManager Waiting for client to connect to ZooKeeper
   [junit4]   2> 31639 INFO  (zkConnectionManagerCallback-20-thread-1) [     ] o.a.s.c.c.ConnectionManager zkClient has connected
   [junit4]   2> 31639 INFO  (TEST-AutoAddReplicasIntegrationTest.testSimple-seed#[C7F558FFEEF2E52F]) [     ] o.a.s.c.c.ConnectionManager Client is connected to ZooKeeper
   [junit4]   2> 31724 INFO  (TEST-AutoAddReplicasIntegrationTest.testSimple-seed#[C7F558FFEEF2E52F]) [     ] o.a.s.c.c.ConnectionManager Waiting for client to connect to ZooKeeper
   [junit4]   2> 31757 INFO  (zkConnectionManagerCallback-22-thread-1) [     ] o.a.s.c.c.ConnectionManager zkClient has connected
   [junit4]   2> 31757 INFO  (TEST-AutoAddReplicasIntegrationTest.testSimple-seed#[C7F558FFEEF2E52F]) [     ] o.a.s.c.c.ConnectionManager Client is connected to ZooKeeper
   [junit4]   2> 31760 INFO  (TEST-AutoAddReplicasIntegrationTest.testSimple-seed#[C7F558FFEEF2E52F]) [     ] o.a.s.c.c.ConnectionManager Waiting for client to connect to ZooKeeper
   [junit4]   2> 31780 INFO  (zkConnectionManagerCallback-24-thread-1) [     ] o.a.s.c.c.ConnectionManager zkClient has connected
   [junit4]   2> 31780 INFO  (TEST-AutoAddReplicasIntegrationTest.testSimple-seed#[C7F558FFEEF2E52F]) [     ] o.a.s.c.c.ConnectionManager Client is connected to ZooKeeper
   [junit4]   2> 32203 WARN  (jetty-launcher-25-thread-1) [     ] o.e.j.s.AbstractConnector Ignoring deprecated socket close linger time
   [junit4]   2> 32203 WARN  (jetty-launcher-25-thread-3) [     ] o.e.j.s.AbstractConnector Ignoring deprecated socket close linger time
   [junit4]   2> 32203 WARN  (jetty-launcher-25-thread-2) [     ] o.e.j.s.AbstractConnector Ignoring deprecated socket close linger time
   [junit4]   2> 32376 INFO  (jetty-launcher-25-thread-3) [     ] o.a.s.c.s.e.JettySolrRunner Start Jetty (original configured port=0)
   [junit4]   2> 32376 INFO  (jetty-launcher-25-thread-2) [     ] o.a.s.c.s.e.JettySolrRunner Start Jetty (original configured port=0)
   [junit4]   2> 32376 INFO  (jetty-launcher-25-thread-1) [     ] o.a.s.c.s.e.JettySolrRunner Start Jetty (original configured port=0)
   [junit4]   2> 32376 INFO  (jetty-launcher-25-thread-3) [     ] o.a.s.c.s.e.JettySolrRunner Trying to start Jetty on port 0 try number 1 ...
   [junit4]   2> 32376 INFO  (jetty-launcher-25-thread-1) [     ] o.a.s.c.s.e.JettySolrRunner Trying to start Jetty on port 0 try number 1 ...
   [junit4]   2> 32378 INFO  (jetty-launcher-25-thread-2) [     ] o.a.s.c.s.e.JettySolrRunner Trying to start Jetty on port 0 try number 1 ...
   [junit4]   2> 32384 INFO  (jetty-launcher-25-thread-3) [     ] o.e.j.s.Server jetty-9.4.19.v20190610; built: 2019-06-10T16:30:51.723Z; git: afcf563148970e98786327af5e07c261fda175d3; jvm 12.0.1+12
   [junit4]   2> 32389 INFO  (jetty-launcher-25-thread-1) [     ] o.e.j.s.Server jetty-9.4.19.v20190610; built: 2019-06-10T16:30:51.723Z; git: afcf563148970e98786327af5e07c261fda175d3; jvm 12.0.1+12
   [junit4]   2> 32389 INFO  (jetty-launcher-25-thread-2) [     ] o.e.j.s.Server jetty-9.4.19.v20190610; built: 2019-06-10T16:30:51.723Z; git: afcf563148970e98786327af5e07c261fda175d3; jvm 12.0.1+12
   [junit4]   2> 32403 INFO  (jetty-launcher-25-thread-2) [     ] o.e.j.s.session DefaultSessionIdManager workerName=node0
   [junit4]   2> 32403 INFO  (jetty-launcher-25-thread-3) [     ] o.e.j.s.session DefaultSessionIdManager workerName=node0
   [junit4]   2> 32403 INFO  (jetty-launcher-25-thread-2) [     ] o.e.j.s.session No SessionScavenger set, using defaults
   [junit4]   2> 32403 INFO  (jetty-launcher-25-thread-3) [     ] o.e.j.s.session No SessionScavenger set, using defaults
   [junit4]   2> 32403 INFO  (jetty-launcher-25-thread-1) [     ] o.e.j.s.session DefaultSessionIdManager workerName=node0
   [junit4]   2> 32403 INFO  (jetty-launcher-25-thread-1) [     ] o.e.j.s.session No SessionScavenger set, using defaults
   [junit4]   2> 32408 INFO  (jetty-launcher-25-thread-2) [     ] o.e.j.s.session node0 Scavenging every 660000ms
   [junit4]   2> 32409 INFO  (jetty-launcher-25-thread-1) [     ] o.e.j.s.session node0 Scavenging every 660000ms
   [junit4]   2> 32410 INFO  (jetty-launcher-25-thread-3) [     ] o.e.j.s.session node0 Scavenging every 660000ms
   [junit4]   2> 32431 INFO  (jetty-launcher-25-thread-2) [     ] o.e.j.s.h.ContextHandler Started o.e.j.s.ServletContextHandler@c5391aa{/solr,null,AVAILABLE}
   [junit4]   2> 32434 INFO  (jetty-launcher-25-thread-1) [     ] o.e.j.s.h.ContextHandler Started o.e.j.s.ServletContextHandler@ba08e58{/solr,null,AVAILABLE}
   [junit4]   2> 32436 INFO  (jetty-launcher-25-thread-3) [     ] o.e.j.s.h.ContextHandler Started o.e.j.s.ServletContextHandler@59d903eb{/solr,null,AVAILABLE}
   [junit4]   2> 32441 INFO  (jetty-launcher-25-thread-2) [     ] o.e.j.s.AbstractConnector Started ServerConnector@2a2a35a0{ssl,[ssl, alpn, http/1.1, h2]}{127.0.0.1:59785}
   [junit4]   2> 32441 INFO  (jetty-launcher-25-thread-2) [     ] o.e.j.s.Server Started @28158ms
   [junit4]   2> 32441 INFO  (jetty-launcher-25-thread-2) [     ] o.a.s.c.s.e.JettySolrRunner Jetty properties: {hostContext=/solr, hostPort=59785}
   [junit4]   2> 32459 INFO  (jetty-launcher-25-thread-1) [     ] o.e.j.s.AbstractConnector Started ServerConnector@29cb8f84{ssl,[ssl, alpn, http/1.1, h2]}{127.0.0.1:59788}
   [junit4]   2> 32459 INFO  (jetty-launcher-25-thread-1) [     ] o.e.j.s.Server Started @28173ms
   [junit4]   2> 32459 INFO  (jetty-launcher-25-thread-1) [     ] o.a.s.c.s.e.JettySolrRunner Jetty properties: {hostContext=/solr, hostPort=59788}
   [junit4]   2> 32497 ERROR (jetty-launcher-25-thread-2) [     ] o.a.s.u.StartupLoggingUtils Missing Java Option solr.log.dir. Logging may be missing or incomplete.
   [junit4]   2> 32512 INFO  (jetty-launcher-25-thread-2) [     ] o.a.s.s.SolrDispatchFilter Using logger factory org.apache.logging.slf4j.Log4jLoggerFactory
   [junit4]   2> 32515 INFO  (jetty-launcher-25-thread-2) [     ] o.a.s.s.SolrDispatchFilter  ___      _       Welcome to Apache Solr™ version 8.3.0
   [junit4]   2> 32515 INFO  (jetty-launcher-25-thread-2) [     ] o.a.s.s.SolrDispatchFilter / __| ___| |_ _   Starting in cloud mode on port null
   [junit4]   2> 32515 ERROR (jetty-launcher-25-thread-1) [     ] o.a.s.u.StartupLoggingUtils Missing Java Option solr.log.dir. Logging may be missing or incomplete.
   [junit4]   2> 32515 INFO  (jetty-launcher-25-thread-1) [     ] o.a.s.s.SolrDispatchFilter Using logger factory org.apache.logging.slf4j.Log4jLoggerFactory
   [junit4]   2> 32515 INFO  (jetty-launcher-25-thread-2) [     ] o.a.s.s.SolrDispatchFilter \__ \/ _ \ | '_|  Install dir: null
   [junit4]   2> 32515 INFO  (jetty-launcher-25-thread-1) [     ] o.a.s.s.SolrDispatchFilter  ___      _       Welcome to Apache Solr™ version 8.3.0
   [junit4]   2> 32515 INFO  (jetty-launcher-25-thread-1) [     ] o.a.s.s.SolrDispatchFilter / __| ___| |_ _   Starting in cloud mode on port null
   [junit4]   2> 32515 INFO  (jetty-launcher-25-thread-1) [     ] o.a.s.s.SolrDispatchFilter \__ \/ _ \ | '_|  Install dir: null
   [junit4]   2> 32515 INFO  (jetty-launcher-25-thread-2) [     ] o.a.s.s.SolrDispatchFilter |___/\___/_|_|    Start time: 2019-07-21T16:57:58.854801Z
   [junit4]   2> 32515 INFO  (jetty-launcher-25-thread-1) [     ] o.a.s.s.SolrDispatchFilter |___/\___/_|_|    Start time: 2019-07-21T16:57:58.854801Z
   [junit4]   2> 32515 INFO  (jetty-launcher-25-thread-2) [     ] o.a.s.c.SolrResourceLoader solr home defaulted to 'solr/' (could not find system property or JNDI)
   [junit4]   2> 32517 INFO  (jetty-launcher-25-thread-2) [     ] o.a.s.c.c.ConnectionManager Waiting for client to connect to ZooKeeper
   [junit4]   2> 32517 INFO  (jetty-launcher-25-thread-1) [     ] o.a.s.c.c.ConnectionManager Waiting for client to connect to ZooKeeper
   [junit4]   2> 32529 INFO  (jetty-launcher-25-thread-3) [     ] o.e.j.s.AbstractConnector Started ServerConnector@5cae0f29{ssl,[ssl, alpn, http/1.1, h2]}{127.0.0.1:59791}
   [junit4]   2> 32529 INFO  (jetty-launcher-25-thread-3) [     ] o.e.j.s.Server Started @28227ms
   [junit4]   2> 32529 INFO  (jetty-launcher-25-thread-3) [     ] o.a.s.c.s.e.JettySolrRunner Jetty properties: {hostContext=/solr, hostPort=59791}
   [junit4]   2> 32529 ERROR (jetty-launcher-25-thread-3) [     ] o.a.s.u.StartupLoggingUtils Missing Java Option solr.log.dir. Logging may be missing or incomplete.
   [junit4]   2> 32529 INFO  (jetty-launcher-25-thread-3) [     ] o.a.s.s.SolrDispatchFilter Using logger factory org.apache.logging.slf4j.Log4jLoggerFactory
   [junit4]   2> 32530 INFO  (jetty-launcher-25-thread-3) [     ] o.a.s.s.SolrDispatchFilter  ___      _       Welcome to Apache Solr™ version 8.3.0
   [junit4]   2> 32530 INFO  (jetty-launcher-25-thread-3) [     ] o.a.s.s.SolrDispatchFilter / __| ___| |_ _   Starting in cloud mode on port null
   [junit4]   2> 32530 INFO  (jetty-launcher-25-thread-3) [     ] o.a.s.s.SolrDispatchFilter \__ \/ _ \ | '_|  Install dir: null
   [junit4]   2> 32530 INFO  (jetty-launcher-25-thread-3) [     ] o.a.s.s.SolrDispatchFilter |___/\___/_|_|    Start time: 2019-07-21T16:57:58.869371500Z
   [junit4]   2> 32532 INFO  (jetty-launcher-25-thread-3) [     ] o.a.s.c.c.ConnectionManager Waiting for client to connect to ZooKeeper
   [junit4]   2> 32549 INFO  (zkConnectionManagerCallback-27-thread-1) [     ] o.a.s.c.c.ConnectionManager zkClient has connected
   [junit4]   2> 32549 INFO  (jetty-launcher-25-thread-2) [     ] o.a.s.c.c.ConnectionManager Client is connected to ZooKeeper
   [junit4]   2> 32550 INFO  (zkConnectionManagerCallback-29-thread-1) [     ] o.a.s.c.c.ConnectionManager zkClient has connected
   [junit4]   2> 32551 INFO  (zkConnectionManagerCallback-31-thread-1) [     ] o.a.s.c.c.ConnectionManager zkClient has connected
   [junit4]   2> 32551 INFO  (jetty-launcher-25-thread-1) [     ] o.a.s.c.c.ConnectionManager Client is connected to ZooKeeper
   [junit4]   2> 32551 INFO  (jetty-launcher-25-thread-3) [     ] o.a.s.c.c.ConnectionManager Client is connected to ZooKeeper
   [junit4]   2> 32555 INFO  (jetty-launcher-25-thread-2) [     ] o.a.s.s.SolrDispatchFilter solr.xml found in ZooKeeper. Loading...
   [junit4]   2> 32555 INFO  (jetty-launcher-25-thread-1) [     ] o.a.s.s.SolrDispatchFilter solr.xml found in ZooKeeper. Loading...
   [junit4]   2> 32555 INFO  (jetty-launcher-25-thread-3) [     ] o.a.s.s.SolrDispatchFilter solr.xml found in ZooKeeper. Loading...
   [junit4]   2> 32573 INFO  (jetty-launcher-25-thread-3) [     ] o.a.s.c.SolrXmlConfig Configuration parameter autoReplicaFailoverWorkLoopDelay is ignored
   [junit4]   2> 32573 INFO  (jetty-launcher-25-thread-3) [     ] o.a.s.c.SolrXmlConfig Configuration parameter autoReplicaFailoverBadNodeExpiration is ignored
   [junit4]   2> 32588 INFO  (jetty-launcher-25-thread-1) [     ] o.a.s.c.SolrXmlConfig Configuration parameter autoReplicaFailoverWorkLoopDelay is ignored
   [junit4]   2> 32588 INFO  (jetty-launcher-25-thread-1) [     ] o.a.s.c.SolrXmlConfig Configuration parameter autoReplicaFailoverBadNodeExpiration is ignored
   [junit4]   2> 32591 INFO  (jetty-launcher-25-thread-2) [     ] o.a.s.c.SolrXmlConfig Configuration parameter autoReplicaFailoverWorkLoopDelay is ignored
   [junit4]   2> 32591 INFO  (jetty-launcher-25-thread-2) [     ] o.a.s.c.SolrXmlConfig Configuration parameter autoReplicaFailoverBadNodeExpiration is ignored
   [junit4]   2> 32605 INFO  (jetty-launcher-25-thread-3) [     ] o.a.s.c.SolrXmlConfig MBean server found: com.sun.jmx.mbeanserver.JmxMBeanServer@210bdb7e, but no JMX reporters were configured - adding default JMX reporter.
   [junit4]   2> 32605 INFO  (jetty-launcher-25-thread-1) [     ] o.a.s.c.SolrXmlConfig MBean server found: com.sun.jmx.mbeanserver.JmxMBeanServer@210bdb7e, but no JMX reporters were configured - adding default JMX reporter.
   [junit4]   2> 32606 INFO  (jetty-launcher-25-thread-2) [     ] o.a.s.c.SolrXmlConfig MBean server found: com.sun.jmx.mbeanserver.JmxMBeanServer@210bdb7e, but no JMX reporters were configured - adding default JMX reporter.
   [junit4]   2> 33004 INFO  (jetty-launcher-25-thread-2) [     ] o.a.s.h.c.HttpShardHandlerFactory Host whitelist initialized: WhitelistHostChecker [whitelistHosts=null, whitelistHostCheckingEnabled=true]
   [junit4]   2> 33160 INFO  (jetty-launcher-25-thread-3) [     ] o.a.s.h.c.HttpShardHandlerFactory Host whitelist initialized: WhitelistHostChecker [whitelistHosts=null, whitelistHostCheckingEnabled=true]
   [junit4]   2> 33164 WARN  (jetty-launcher-25-thread-2) [     ] o.e.j.u.s.S.config Trusting all certificates configured for Client@50df09e1[provider=null,keyStore=null,trustStore=null]
   [junit4]   2> 33164 WARN  (jetty-launcher-25-thread-2) [     ] o.e.j.u.s.S.config No Client EndPointIdentificationAlgorithm configured for Client@50df09e1[provider=null,keyStore=null,trustStore=null]
   [junit4]   2> 33279 INFO  (jetty-launcher-25-thread-1) [     ] o.a.s.h.c.HttpShardHandlerFactory Host whitelist initialized: WhitelistHostChecker [whitelistHosts=null, whitelistHostCheckingEnabled=true]
   [junit4]   2> 33308 WARN  (jetty-launcher-25-thread-2) [     ] o.e.j.u.s.S.config Trusting all certificates configured for Client@127c8b3d[provider=null,keyStore=null,trustStore=null]
   [junit4]   2> 33308 WARN  (jetty-launcher-25-thread-2) [     ] o.e.j.u.s.S.config No Client EndPointIdentificationAlgorithm configured for Client@127c8b3d[provider=null,keyStore=null,trustStore=null]
   [junit4]   2> 33321 INFO  (jetty-launcher-25-thread-2) [     ] o.a.s.c.ZkContainer Zookeeper client=127.0.0.1:59772/solr
   [junit4]   2> 33339 INFO  (jetty-launcher-25-thread-2) [     ] o.a.s.c.c.ConnectionManager Waiting for client to connect to ZooKeeper
   [junit4]   2> 33341 WARN  (jetty-launcher-25-thread-3) [     ] o.e.j.u.s.S.config Trusting all certificates configured for Client@316556cb[provider=null,keyStore=null,trustStore=null]
   [junit4]   2> 33341 WARN  (jetty-launcher-25-thread-3) [     ] o.e.j.u.s.S.config No Client EndPointIdentificationAlgorithm configured for Client@316556cb[provider=null,keyStore=null,trustStore=null]
   [junit4]   2> 33348 WARN  (jetty-launcher-25-thread-1) [     ] o.e.j.u.s.S.config Trusting all certificates configured for Client@1ea9c913[provider=null,keyStore=null,trustStore=null]
   [junit4]   2> 33348 WARN  (jetty-launcher-25-thread-1) [     ] o.e.j.u.s.S.config No Client EndPointIdentificationAlgorithm configured for Client@1ea9c913[provider=null,keyStore=null,trustStore=null]
   [junit4]   2> 33373 WARN  (jetty-launcher-25-thread-1) [     ] o.e.j.u.s.S.config Trusting all certificates configured for Client@34179931[provider=null,keyStore=null,trustStore=null]
   [junit4]   2> 33373 WARN  (jetty-launcher-25-thread-1) [     ] o.e.j.u.s.S.config No Client EndPointIdentificationAlgorithm configured for Client@34179931[provider=null,keyStore=null,trustStore=null]
   [junit4]   2> 33373 INFO  (jetty-launcher-25-thread-1) [     ] o.a.s.c.ZkContainer Zookeeper client=127.0.0.1:59772/solr
   [junit4]   2> 33377 INFO  (jetty-launcher-25-thread-1) [     ] o.a.s.c.c.ConnectionManager Waiting for client to connect to ZooKeeper
   [junit4]   2> 33382 WARN  (jetty-launcher-25-thread-3) [     ] o.e.j.u.s.S.config Trusting all certificates configured for Client@3b7cb5a7[provider=null,keyStore=null,trustStore=null]
   [junit4]   2> 33383 WARN  (jetty-launcher-25-thread-3) [     ] o.e.j.u.s.S.config No Client EndPointIdentificationAlgorithm configured for Client@3b7cb5a7[provider=null,keyStore=null,trustStore=null]
   [junit4]   2> 33383 INFO  (jetty-launcher-25-thread-3) [     ] o.a.s.c.ZkContainer Zookeeper client=127.0.0.1:59772/solr
   [junit4]   2> 33387 INFO  (jetty-launcher-25-thread-3) [     ] o.a.s.c.c.ConnectionManager Waiting for client to connect to ZooKeeper
   [junit4]   2> 33403 INFO  (zkConnectionManagerCallback-49-thread-1) [     ] o.a.s.c.c.ConnectionManager zkClient has connected
   [junit4]   2> 33403 INFO  (zkConnectionManagerCallback-42-thread-1) [     ] o.a.s.c.c.ConnectionManager zkClient has connected
   [junit4]   2> 33403 INFO  (jetty-launcher-25-thread-1) [     ] o.a.s.c.c.ConnectionManager Client is connected to ZooKeeper
   [junit4]   2> 33403 INFO  (jetty-launcher-25-thread-2) [     ] o.a.s.c.c.ConnectionManager Client is connected to ZooKeeper
   [junit4]   2> 33426 INFO  (zkConnectionManagerCallback-52-thread-1) [     ] o.a.s.c.c.ConnectionManager zkClient has connected
   [junit4]   2> 33426 INFO  (jetty-launcher-25-thread-3) [     ] o.a.s.c.c.ConnectionManager Client is connected to ZooKeeper
   [junit4]   2> 33533 INFO  (jetty-launcher-25-thread-1) [n:127.0.0.1:59788_solr     ] o.a.s.c.c.ConnectionManager Waiting for client to connect to ZooKeeper
   [junit4]   2> 33543 INFO  (zkConnectionManagerCallback-54-thread-1) [     ] o.a.s.c.c.ConnectionManager zkClient has connected
   [junit4]   2> 33543 INFO  (jetty-launcher-25-thread-1) [n:127.0.0.1:59788_solr     ] o.a.s.c.c.ConnectionManager Client is connected to ZooKeeper
   [junit4]   2> 33645 INFO  (jetty-launcher-25-thread-2) [n:127.0.0.1:59785_solr     ] o.a.s.c.c.ConnectionManager Waiting for client to connect to ZooKeeper
   [junit4]   2> 33663 INFO  (zkConnectionManagerCallback-56-thread-1) [     ] o.a.s.c.c.ConnectionManager zkClient has connected
   [junit4]   2> 33663 INFO  (jetty-launcher-25-thread-2) [n:127.0.0.1:59785_solr     ] o.a.s.c.c.ConnectionManager Client is connected to ZooKeeper
   [junit4]   2> 33769 INFO  (jetty-launcher-25-thread-3) [n:127.0.0.1:59791_solr     ] o.a.s.c.c.ConnectionManager Waiting for client to connect to ZooKeeper
   [junit4]   2> 33880 INFO  (zkConnectionManagerCallback-58-thread-1) [     ] o.a.s.c.c.ConnectionManager zkClient has connected
   [junit4]   2> 33881 INFO  (jetty-launcher-25-thread-3) [n:127.0.0.1:59791_solr     ] o.a.s.c.c.ConnectionManager Client is connected to ZooKeeper
   [junit4]   2> 35101 INFO  (jetty-launcher-25-thread-2) [n:127.0.0.1:59785_solr     ] o.a.s.c.OverseerElectionContext I am going to be the leader 127.0.0.1:59785_solr
   [junit4]   2> 35104 INFO  (jetty-launcher-25-thread-3) [n:127.0.0.1:59791_solr     ] o.a.s.c.ZkController Register node as live in ZooKeeper:/live_nodes/127.0.0.1:59791_solr
   [junit4]   2> 35104 INFO  (jetty-launcher-25-thread-2) [n:127.0.0.1:59785_solr     ] o.a.s.c.Overseer Overseer (id=72120417638875146-127.0.0.1:59785_solr-n_0000000000) starting
   [junit4]   2> 35105 INFO  (jetty-launcher-25-thread-1) [n:127.0.0.1:59788_solr     ] o.a.s.c.ZkController Register node as live in ZooKeeper:/live_nodes/127.0.0.1:59788_solr
   [junit4]   2> 35168 INFO  (zkCallback-55-thread-1) [     ] o.a.s.c.c.ZkStateReader Updated live nodes from ZooKeeper... (0) -> (2)
   [junit4]   2> 35187 INFO  (jetty-launcher-25-thread-3) [n:127.0.0.1:59791_solr     ] o.a.s.c.c.ConnectionManager Waiting for client to connect to ZooKeeper
   [junit4]   2> 35187 INFO  (zkCallback-53-thread-1) [     ] o.a.s.c.c.ZkStateReader Updated live nodes from ZooKeeper... (0) -> (2)
   [junit4]   2> 35187 INFO  (zkCallback-57-thread-1) [     ] o.a.s.c.c.ZkStateReader Updated live nodes from ZooKeeper... (0) -> (2)
   [junit4]   2> 35189 INFO  (jetty-launcher-25-thread-1) [n:127.0.0.1:59788_solr     ] o.a.s.c.c.ConnectionManager Waiting for client to connect to ZooKeeper
   [junit4]   2> 35189 INFO  (jetty-launcher-25-thread-2) [n:127.0.0.1:59785_solr     ] o.a.s.c.c.ConnectionManager Waiting for client to connect to ZooKeeper
   [junit4]   2> 35206 INFO  (zkConnectionManagerCallback-75-thread-1) [     ] o.a.s.c.c.ConnectionManager zkClient has connected
   [junit4]   2> 35206 INFO  (jetty-launcher-25-thread-2) [n:127.0.0.1:59785_solr     ] o.a.s.c.c.ConnectionManager Client is connected to ZooKeeper
   [junit4]   2> 35209 INFO  (zkConnectionManagerCallback-71-thread-1) [     ] o.a.s.c.c.ConnectionManager zkClient has connected
   [junit4]   2> 35209 INFO  (jetty-launcher-25-thread-3) [n:127.0.0.1:59791_solr     ] o.a.s.c.c.ConnectionManager Client is connected to ZooKeeper
   [junit4]   2> 35210 INFO  (zkConnectionManagerCallback-79-thread-1) [     ] o.a.s.c.c.ConnectionManager zkClient has connected
   [junit4]   2> 35210 INFO  (jetty-launcher-25-thread-1) [n:127.0.0.1:59788_solr     ] o.a.s.c.c.ConnectionManager Client is connected to ZooKeeper
   [junit4]   2> 35218 INFO  (jetty-launcher-25-thread-1) [n:127.0.0.1:59788_solr     ] o.a.s.c.c.ZkStateReader Updated live nodes from ZooKeeper... (0) -> (2)
   [junit4]   2> 35220 INFO  (jetty-launcher-25-thread-2) [n:127.0.0.1:59785_solr     ] o.a.s.c.c.ZkStateReader Updated live nodes from ZooKeeper... (0) -> (2)
   [junit4]   2> 35218 INFO  (jetty-launcher-25-thread-3) [n:127.0.0.1:59791_solr     ] o.a.s.c.c.ZkStateReader Updated live nodes from ZooKeeper... (0) -> (2)
   [junit4]   2> 35225 INFO  (jetty-launcher-25-thread-2) [n:127.0.0.1:59785_solr     ] o.a.s.c.s.i.ZkClientClusterStateProvider Cluster at 127.0.0.1:59772/solr ready
   [junit4]   2> 35225 INFO  (jetty-launcher-25-thread-3) [n:127.0.0.1:59791_solr     ] o.a.s.c.s.i.ZkClientClusterStateProvider Cluster at 127.0.0.1:59772/solr ready
   [junit4]   2> 35227 INFO  (jetty-launcher-25-thread-1) [n:127.0.0.1:59788_solr     ] o.a.s.c.s.i.ZkClientClusterStateProvider Cluster at 127.0.0.1:59772/solr ready
   [junit4]   2> 35237 INFO  (jetty-launcher-25-thread-3) [n:127.0.0.1:59791_solr     ] o.a.s.c.LibListener clusterprops.json changed , version 0
   [junit4]   2> 35239 INFO  (jetty-launcher-25-thread-1) [n:127.0.0.1:59788_solr     ] o.a.s.c.LibListener clusterprops.json changed , version 0
   [junit4]   2> 35344 INFO  (jetty-launcher-25-thread-3) [n:127.0.0.1:59791_solr     ] o.a.s.h.a.MetricsHistoryHandler No .system collection, keeping metrics history in memory.
   [junit4]   2> 35371 INFO  (jetty-launcher-25-thread-2) [n:127.0.0.1:59785_solr     ] o.a.s.c.ZkController Publish node=127.0.0.1:59785_solr as DOWN
   [junit4]   2> 35375 INFO  (jetty-launcher-25-thread-2) [n:127.0.0.1:59785_solr     ] o.a.s.c.TransientSolrCoreCacheDefault Allocating transient cache for 4 transient cores
   [junit4]   2> 35375 INFO  (jetty-launcher-25-thread-2) [n:127.0.0.1:59785_solr     ] o.a.s.c.ZkController Register node as live in ZooKeeper:/live_nodes/127.0.0.1:59785_solr
   [junit4]   2> 35377 INFO  (jetty-launcher-25-thread-1) [n:127.0.0.1:59788_solr     ] o.a.s.h.a.MetricsHistoryHandler No .system collection, keeping metrics history in memory.
   [junit4]   2> 35398 INFO  (jetty-launcher-25-thread-3) [n:127.0.0.1:59791_solr     ] o.a.s.m.r.SolrJmxReporter JMX monitoring for 'solr.node' (registry 'solr.node') enabled at server: com.sun.jmx.mbeanserver.JmxMBeanServer@210bdb7e
   [junit4]   2> 35399 INFO  (jetty-launcher-25-thread-3) [n:127.0.0.1:59791_solr     ] o.a.s.m.r.SolrJmxReporter JMX monitoring for 'solr.jvm' (registry 'solr.jvm') enabled at server: com.sun.jmx.mbeanserver.JmxMBeanServer@210bdb7e
   [junit4]   2> 35399 INFO  (jetty-launcher-25-thread-3) [n:127.0.0.1:59791_solr     ] o.a.s.m.r.SolrJmxReporter JMX monitoring for 'solr.jetty' (registry 'solr.jetty') enabled at server: com.sun.jmx.mbeanserver.JmxMBeanServer@210bdb7e
   [junit4]   2> 35404 INFO  (jetty-launcher-25-thread-3) [n:127.0.0.1:59791_solr     ] o.a.s.c.CorePropertiesLocator Found 0 core definitions underneath C:\Users\jenkins\workspace\Lucene-Solr-8.x-Windows\solr\build\solr-core\test\J1\temp\solr.cloud.autoscaling.AutoAddReplicasIntegrationTest_C7F558FFEEF2E52F-001\tempDir-001\node1\.
   [junit4]   2> 35418 INFO  (jetty-launcher-25-thread-1) [n:127.0.0.1:59788_solr     ] o.a.s.m.r.SolrJmxReporter JMX monitoring for 'solr.node' (registry 'solr.node') enabled at server: com.sun.jmx.mbeanserver.JmxMBeanServer@210bdb7e
   [junit4]   2> 35418 INFO  (jetty-launcher-25-thread-1) [n:127.0.0.1:59788_solr     ] o.a.s.m.r.SolrJmxReporter JMX monitoring for 'solr.jvm' (registry 'solr.jvm') enabled at server: com.sun.jmx.mbeanserver.JmxMBeanServer@210bdb7e
   [junit4]   2> 35418 INFO  (jetty-launcher-25-thread-1) [n:127.0.0.1:59788_solr     ] o.a.s.m.r.SolrJmxReporter JMX monitoring for 'solr.jetty' (registry 'solr.jetty') enabled at server: com.sun.jmx.mbeanserver.JmxMBeanServer@210bdb7e
   [junit4]   2> 35420 INFO  (jetty-launcher-25-thread-1) [n:127.0.0.1:59788_solr     ] o.a.s.c.CorePropertiesLocator Found 0 core definitions underneath C:\Users\jenkins\workspace\Lucene-Solr-8.x-Windows\solr\build\solr-core\test\J1\temp\solr.cloud.autoscaling.AutoAddReplicasIntegrationTest_C7F558FFEEF2E52F-001\tempDir-001\node3\.
   [junit4]   2> 35423 INFO  (OverseerStateUpdate-72120417638875146-127.0.0.1:59785_solr-n_0000000000) [n:127.0.0.1:59785_solr     ] o.a.s.c.Overseer Starting to work on the main queue : 127.0.0.1:59785_solr
   [junit4]   2> 35436 INFO  (zkCallback-57-thread-1) [     ] o.a.s.c.c.ZkStateReader Updated live nodes from ZooKeeper... (2) -> (3)
   [junit4]   2> 35436 INFO  (zkCallback-53-thread-1) [     ] o.a.s.c.c.ZkStateReader Updated live nodes from ZooKeeper... (2) -> (3)
   [junit4]   2> 35436 INFO  (zkCallback-55-thread-1) [     ] o.a.s.c.c.ZkStateReader Updated live nodes from ZooKeeper... (2) -> (3)
   [junit4]   2> 35454 INFO  (zkCallback-78-thread-1) [     ] o.a.s.c.c.ZkStateReader Updated live nodes from ZooKeeper... (2) -> (3)
   [junit4]   2> 35455 INFO  (zkCallback-74-thread-1) [     ] o.a.s.c.c.ZkStateReader Updated live nodes from ZooKeeper... (2) -> (3)
   [junit4]   2> 35455 INFO  (zkCallback-70-thread-1) [     ] o.a.s.c.c.ZkStateReader Updated live nodes from ZooKeeper... (2) -> (3)
   [junit4]   2> 35456 INFO  (jetty-launcher-25-thread-2) [n:127.0.0.1:59785_solr     ] o.a.s.c.LibListener clusterprops.json changed , version 0
   [junit4]   2> 35508 INFO  (jetty-launcher-25-thread-2) [n:127.0.0.1:59785_solr     ] o.a.s.h.a.MetricsHistoryHandler No .system collection, keeping metrics history in memory.
   [junit4]   2> 35553 INFO  (jetty-launcher-25-thread-2) [n:127.0.0.1:59785_solr     ] o.a.s.m.r.SolrJmxReporter JMX monitoring for 'solr.node' (registry 'solr.node') enabled at server: com.sun.jmx.mbeanserver.JmxMBeanServer@210bdb7e
   [junit4]   2> 35554 INFO  (jetty-launcher-25-thread-2) [n:127.0.0.1:59785_solr     ] o.a.s.m.r.SolrJmxReporter JMX monitoring for 'solr.jvm' (registry 'solr.jvm') enabled at server: com.sun.jmx.mbeanserver.JmxMBeanServer@210bdb7e
   [junit4]   2> 35554 INFO  (jetty-launcher-25-thread-2) [n:127.0.0.1:59785_solr     ] o.a.s.m.r.SolrJmxReporter JMX monitoring for 'solr.jetty' (registry 'solr.jetty') enabled at server: com.sun.jmx.mbeanserver.JmxMBeanServer@210bdb7e
   [junit4]   2> 35556 INFO  (jetty-launcher-25-thread-2) [n:127.0.0.1:59785_solr     ] o.a.s.c.CorePropertiesLocator Found 0 core definitions underneath C:\Users\jenkins\workspace\Lucene-Solr-8.x-Windows\solr\build\solr-core\test\J1\temp\solr.cloud.autoscaling.AutoAddReplicasIntegrationTest_C7F558FFEEF2E52F-001\tempDir-001\node2\.
   [junit4]   2> 36376 INFO  (TEST-AutoAddReplicasIntegrationTest.testSimple-seed#[C7F558FFEEF2E52F]) [     ] o.a.s.c.c.ConnectionManager Waiting for client to connect to ZooKeeper
   [junit4]   2> 36535 INFO  (zkConnectionManagerCallback-87-thread-1) [     ] o.a.s.c.c.ConnectionManager zkClient has connected
   [junit4]   2> 36535 INFO  (TEST-AutoAddReplicasIntegrationTest.testSimple-seed#[C7F558FFEEF2E52F]) [     ] o.a.s.c.c.ConnectionManager Client is connected to ZooKeeper
   [junit4]   2> 36548 INFO  (TEST-AutoAddReplicasIntegrationTest.testSimple-seed#[C7F558FFEEF2E52F]) [     ] o.a.s.c.c.ZkStateReader Updated live nodes from ZooKeeper... (0) -> (3)
   [junit4]   2> 36555 INFO  (TEST-AutoAddReplicasIntegrationTest.testSimple-seed#[C7F558FFEEF2E52F]) [     ] o.a.s.c.s.i.ZkClientClusterStateProvider Cluster at 127.0.0.1:59772/solr ready
   [junit4]   2> 37303 INFO  (qtp1827456182-149) [n:127.0.0.1:59788_solr     ] o.a.s.s.HttpSolrCall [admin] webapp=null path=/cluster params={wt=javabin&version=2} status=0 QTime=19
   [junit4]   2> 37330 INFO  (zkCallback-55-thread-1) [     ] o.a.s.c.LibListener clusterprops.json changed , version 1
   [junit4]   2> 37330 INFO  (zkCallback-57-thread-1) [     ] o.a.s.c.LibListener clusterprops.json changed , version 1
   [junit4]   2> 37330 INFO  (zkCallback-53-thread-1) [     ] o.a.s.c.LibListener clusterprops.json changed , version 1
   [junit4]   2> 37366 INFO  (qtp493115512-148) [n:127.0.0.1:59785_solr     ] o.a.s.h.a.CollectionsHandler Invoked Collection Action :create with params collection.configName=conf&maxShardsPerNode=2&autoAddReplicas=true&name=testSimple1&nrtReplicas=2&action=CREATE&numShards=2&createNodeSet=127.0.0.1:59791_solr,127.0.0.1:59788_solr&wt=javabin&version=2 and sendToOCPQueue=true
   [junit4]   2> 37383 INFO  (OverseerThreadFactory-58-thread-1-processing-n:127.0.0.1:59785_solr) [n:127.0.0.1:59785_solr     ] o.a.s.c.a.c.CreateCollectionCmd Create collection testSimple1
   [junit4]   2> 37542 INFO  (OverseerStateUpdate-72120417638875146-127.0.0.1:59785_solr-n_0000000000) [n:127.0.0.1:59785_solr     ] o.a.s.c.o.SliceMutator createReplica() {
   [junit4]   2>   "operation":"ADDREPLICA",
   [junit4]   2>   "collection":"testSimple1",
   [junit4]   2>   "shard":"shard1",
   [junit4]   2>   "core":"testSimple1_shard1_replica_n1",
   [junit4]   2>   "state":"down",
   [junit4]   2>   "base_url":"https://127.0.0.1:59788/solr",
   [junit4]   2>   "type":"NRT",
   [junit4]   2>   "waitForFinalState":"false"} 
   [junit4]   2> 37555 INFO  (OverseerStateUpdate-72120417638875146-127.0.0.1:59785_solr-n_0000000000) [n:127.0.0.1:59785_solr     ] o.a.s.c.o.SliceMutator createReplica() {
   [junit4]   2>   "operation":"ADDREPLICA",
   [junit4]   2>   "collection":"testSimple1",
   [junit4]   2>   "shard":"shard1",
   [junit4]   2>   "core":"testSimple1_shard1_replica_n2",
   [junit4]   2>   "state":"down",
   [junit4]   2>   "base_url":"https://127.0.0.1:59791/solr",
   [junit4]   2>   "type":"NRT",
   [junit4]   2>   "waitForFinalState":"false"} 
   [junit4]   2> 37561 INFO  (OverseerStateUpdate-72120417638875146-127.0.0.1:59785_solr-n_0000000000) [n:127.0.0.1:59785_solr     ] o.a.s.c.o.SliceMutator createReplica() {
   [junit4]   2>   "operation":"ADDREPLICA",
   [junit4]   2>   "collection":"testSimple1",
   [junit4]   2>   "shard":"shard2",
   [junit4]   2>   "core":"testSimple1_shard2_replica_n4",
   [junit4]   2>   "state":"down",
   [junit4]   2>   "base_url":"https://127.0.0.1:59788/solr",
   [junit4]   2>   "type":"NRT",
   [junit4]   2>   "waitForFinalState":"false"} 
   [junit4]   2> 37566 INFO  (OverseerStateUpdate-72120417638875146-127.0.0.1:59785_solr-n_0000000000) [n:127.0.0.1:59785_solr     ] o.a.s.c.o.SliceMutator createReplica() {
   [junit4]   2>   "operation":"ADDREPLICA",
   [junit4]   2>   "collection":"testSimple1",
   [junit4]   2>   "shard":"shard2",
   [junit4]   2>   "core":"testSimple1_shard2_replica_n6",
   [junit4]   2>   "state":"down",
   [junit4]   2>   "base_url":"https://127.0.0.1:59791/solr",
   [junit4]   2>   "type":"NRT",
   [junit4]   2>   "waitForFinalState":"false"} 
   [junit4]   2> 37874 INFO  (qtp155550553-151) [n:127.0.0.1:59791_solr    x:testSimple1_shard2_replica_n6 ] o.a.s.h.a.CoreAdminOperation core create command qt=/admin/cores&coreNodeName=core_node8&collection.configName=conf&newCollection=true&name=testSimple1_shard2_replica_n6&action=CREATE&numShards=2&collection=testSimple1&shard=shard2&wt=javabin&version=2&replicaType=NRT
   [junit4]   2> 37874 INFO  (qtp155550553-151) [n:127.0.0.1:59791_solr    x:testSimple1_shard2_replica_n6 ] o.a.s.c.TransientSolrCoreCacheDefault Allocating transient cache for 4 transient cores
   [junit4]   2> 37939 INFO  (qtp155550553-156) [n:127.0.0.1:59791_solr    x:testSimple1_shard1_replica_n2 ] o.a.s.h.a.CoreAdminOperation core create command qt=/admin/cores&coreNodeName=core_node5&collection.configName=conf&newCollection=true&name=testSimple1_shard1_replica_n2&action=CREATE&numShards=2&collection=testSimple1&shard=shard1&wt=javabin&version=2&replicaType=NRT
   [junit4]   2> 37968 INFO  (qtp1827456182-145) [n:127.0.0.1:59788_solr    x:testSimple1_shard2_replica_n4 ] o.a.s.h.a.CoreAdminOperation core create command qt=/admin/cores&coreNodeName=core_node7&collection.configName=conf&newCollection=true&name=testSimple1_shard2_replica_n4&action=CREATE&numShards=2&collection=testSimple1&shard=shard2&wt=javabin&version=2&replicaType=NRT
   [junit4]   2> 37968 INFO  (qtp1827456182-145) [n:127.0.0.1:59788_solr    x:testSimple1_shard2_replica_n4 ] o.a.s.c.TransientSolrCoreCacheDefault Allocating transient cache for 4 transient cores
   [junit4]   2> 37984 INFO  (qtp1827456182-161) [n:127.0.0.1:59788_solr    x:testSimple1_shard1_replica_n1 ] o.a.s.h.a.CoreAdminOperation core create command qt=/admin/cores&coreNodeName=core_node3&collection.configName=conf&newCollection=true&name=testSimple1_shard1_replica_n1&action=CREATE&numShards=2&collection=testSimple1&shard=shard1&wt=javabin&version=2&replicaType=NRT
   [junit4]   2> 39166 INFO  (qtp155550553-156) [n:127.0.0.1:59791_solr c:testSimple1 s:shard1 r:core_node5 x:testSimple1_shard1_replica_n2 ] o.a.s.c.SolrConfig Using Lucene MatchVersion: 8.3.0
   [junit4]   2> 39192 INFO  (qtp155550553-156) [n:127.0.0.1:59791_solr c:testSimple1 s:shard1 r:core_node5 x:testSimple1_shard1_replica_n2 ] o.a.s.s.IndexSchema [testSimple1_shard1_replica_n2] Schema name=minimal
   [junit4]   2> 39199 INFO  (qtp155550553-156) [n:127.0.0.1:59791_solr c:testSimple1 s:shard1 r:core_node5 x:testSimple1_shard1_replica_n2 ] o.a.s.s.IndexSchema Loaded schema minimal/1.1 with uniqueid field id
   [junit4]   2> 39199 INFO  (qtp155550553-156) [n:127.0.0.1:59791_solr c:testSimple1 s:shard1 r:core_node5 x:testSimple1_shard1_replica_n2 ] o.a.s.c.CoreContainer Creating SolrCore 'testSimple1_shard1_replica_n2' using configuration from collection testSimple1, trusted=true
   [junit4]   2> 39200 INFO  (qtp155550553-156) [n:127.0.0.1:59791_solr c:testSimple1 s:shard1 r:core_node5 x:testSimple1_shard1_replica_n2 ] o.a.s.m.r.SolrJmxReporter JMX monitoring for 'solr.core.testSimple1.shard1.replica_n2' (registry 'solr.core.testSimple1.shard1.replica_n2') enabled at server: com.sun.jmx.mbeanserver.JmxMBeanServer@210bdb7e
   [junit4]   2> 39201 INFO  (qtp155550553-156) [n:127.0.0.1:59791_solr c:testSimple1 s:shard1 r:core_node5 x:testSimple1_shard1_replica_n2 ] o.a.s.c.SolrCore [[testSimple1_shard1_replica_n2] ] Opening new SolrCore at [C:\Users\jenkins\workspace\Lucene-Solr-8.x-Windows\solr\build\solr-core\test\J1\temp\solr.cloud.autoscaling.AutoAddReplicasIntegrationTest_C7F558FFEEF2E52F-001\tempDir-001\node1\testSimple1_shard1_replica_n2], dataDir=[C:\Users\jenkins\workspace\Lucene-Solr-8.x-Windows\solr\build\solr-core\test\J1\temp\solr.cloud.autoscaling.AutoAddReplicasIntegrationTest_C7F558FFEEF2E52F-001\tempDir-001\node1\.\testSimple1_shard1_replica_n2\data\]
   [junit4]   2> 39217 INFO  (qtp1827456182-161) [n:127.0.0.1:59788_solr c:testSimple1 s:shard1 r:core_node3 x:testSimple1_shard1_replica_n1 ] o.a.s.c.SolrConfig Using Lucene MatchVersion: 8.3.0
   [junit4]   2> 39217 INFO  (qtp155550553-151) [n:127.0.0.1:59791_solr c:testSimple1 s:shard2 r:core_node8 x:testSimple1_shard2_replica_n6 ] o.a.s.c.SolrConfig Using Lucene MatchVersion: 8.3.0
   [junit4]   2> 39239 INFO  (qtp1827456182-145) [n:127.0.0.1:59788_solr c:testSimple1 s:shard2 r:core_node7 x:testSimple1_shard2_replica_n4 ] o.a.s.c.SolrConfig Using Lucene MatchVersion: 8.3.0
   [junit4]   2> 39256 INFO  (qtp155550553-151) [n:127.0.0.1:59791_solr c:testSimple1 s:shard2 r:core_node8 x:testSimple1_shard2_replica_n6 ] o.a.s.s.IndexSchema [testSimple1_shard2_replica_n6] Schema name=minimal
   [junit4]   2> 39257 INFO  (qtp1827456182-161) [n:127.0.0.1:59788_solr c:testSimple1 s:shard1 r:core_node3 x:testSimple1_shard1_replica_n1 ] o.a.s.s.IndexSchema [testSimple1_shard1_replica_n1] Schema name=minimal
   [junit4]   2> 39258 INFO  (qtp155550553-151) [n:127.0.0.1:59791_solr c:testSimple1 s:shard2 r:core_node8 x:testSimple1_shard2_replica_n6 ] o.a.s.s.IndexSchema Loaded schema minimal/1.1 with uniqueid field id
   [junit4]   2> 39258 INFO  (qtp155550553-151) [n:127.0.0.1:59791_solr c:testSimple1 s:shard2 r:core_node8 x:testSimple1_shard2_replica_n6 ] o.a.s.c.CoreContainer Creating SolrCore 'testSimple1_shard2_replica_n6' using configuration from collection testSimple1, trusted=true
   [junit4]   2> 39260 INFO  (qtp155550553-151) [n:127.0.0.1:59791_solr c:testSimple1 s:shard2 r:core_node8 x:testSimple1_shard2_replica_n6 ] o.a.s.m.r.SolrJmxReporter JMX monitoring for 'solr.core.testSimple1.shard2.replica_n6' (registry 'solr.core.testSimple1.shard2.replica_n6') enabled at server: com.sun.jmx.mbeanserver.JmxMBeanServer@210bdb7e
   [junit4]   2> 39261 INFO  (qtp155550553-151) [n:127.0.0.1:59791_solr c:testSimple1 s:shard2 r:core_node8 x:testSimple1_shard2_replica_n6 ] o.a.s.c.SolrCore [[testSimple1_shard2_replica_n6] ] Opening new SolrCore at [C:\Users\jenkins\workspace\Lucene-Solr-8.x-Windows\solr\build\solr-core\test\J1\temp\solr.cloud.autoscaling.AutoAddReplicasIntegrationTest_C7F558FFEEF2E52F-001\tempDir-001\node1\testSimple1_shard2_replica_n6], dataDir=[C:\Users\jenkins\workspace\Lucene-Solr-8.x-Windows\solr\build\solr-core\test\J1\temp\solr.cloud.autoscaling.AutoAddReplicasIntegrationTest_C7F558FFEEF2E52F-001\tempDir-001\node1\.\testSimple1_shard2_replica_n6\data\]
   [junit4]   2> 39268 INFO  (qtp1827456182-161) [n:127.0.0.1:59788_solr c:testSimple1 s:shard1 r:core_node3 x:testSimple1_shard1_replica_n1 ] o.a.s.s.IndexSchema Loaded schema minimal/1.1 with uniqueid field id
   [junit4]   2> 39268 INFO  (qtp1827456182-161) [n:127.0.0.1:59788_solr c:testSimple1 s:shard1 r:core_node3 x:testSimple1_shard1_replica_n1 ] o.a.s.c.CoreContainer Creating SolrCore 'testSimple1_shard1_replica_n1' using configuration from collection testSimple1, trusted=true
   [junit4]   2> 39275 INFO  (qtp1827456182-161) [n:127.0.0.1:59788_solr c:testSimple1 s:shard1 r:core_node3 x:testSimple1_shard1_replica_n1 ] o.a.s.m.r.SolrJmxReporter JMX monitoring for 'solr.core.testSimple1.shard1.replica_n1' (registry 'solr.core.testSimple1.shard1.replica_n1') enabled at server: com.sun.jmx.mbeanserver.JmxMBeanServer@210bdb7e
   [junit4]   2> 39275 INFO  (qtp1827456182-161) [n:127.0.0.1:59788_solr c:testSimple1 s:shard1 r:core_node3 x:testSimple1_shard1_replica_n1 ] o.a.s.c.SolrCore [[testSimple1_shard1_replica_n1] ] Opening new SolrCore at [C:\Users\jenkins\workspace\Lucene-Solr-8.x-Windows\solr\build\solr-core\test\J1\temp\solr.cloud.autoscaling.AutoAddReplicasIntegrationTest_C7F558FFEEF2E52F-001\tempDir-001\node3\testSimple1_shard1_replica_n1], dataDir=[C:\Users\jenkins\workspace\Lucene-Solr-8.x-Windows\solr\build\solr-core\test\J1\temp\solr.cloud.autoscaling.AutoAddReplicasIntegrationTest_C7F558FFEEF2E52F-001\tempDir-001\node3\.\testSimple1_shard1_replica_n1\data\]
   [junit4]   2> 39279 INFO  (qtp1827456182-145) [n:127.0.0.1:59788_solr c:testSimple1 s:shard2 r:core_node7 x:testSimple1_shard2_replica_n4 ] o.a.s.s.IndexSchema [testSimple1_shard2_replica_n4] Schema name=minimal
   [junit4]   2> 39283 INFO  (qtp1827456182-145) [n:127.0.0.1:59788_solr c:testSimple1 s:shard2 r:core_node7 x:testSimple1_shard2_replica_n4 ] o.a.s.s.IndexSchema Loaded schema minimal/1.1 with uniqueid field id
   [junit4]   2> 39283 INFO  (qtp1827456182-145) [n:127.0.0.1:59788_solr c:testSimple1 s:shard2 r:core_node7 x:testSimple1_shard2_replica_n4 ] o.a.s.c.CoreContainer Creating SolrCore 'testSimple1_shard2_replica_n4' using configuration from collection testSimple1, trusted=true
   [junit4]   2> 39284 INFO  (qtp1827456182-145) [n:127.0.0.1:59788_solr c:testSimple1 s:shard2 r:core_node7 x:testSimple1_shard2_replica_n4 ] o.a.s.m.r.SolrJmxReporter JMX monitoring for 'solr.core.testSimple1.shard2.replica_n4' (registry 'solr.core.testSimple1.shard2.replica_n4') enabled at server: com.sun.jmx.mbeanserver.JmxMBeanServer@210bdb7e
   [junit4]   2> 39284 INFO  (qtp1827456182-145) [n:127.0.0.1:59788_solr c:testSimple1 s:shard2 r:core_node7 x:testSimple1_shard2_replica_n4 ] o.a.s.c.SolrCore [[testSimple1_shard2_replica_n4] ] Opening new SolrCore at [C:\Users\jenkins\workspace\Lucene-Solr-8.x-Windows\solr\build\solr-core\test\J1\temp\solr.cloud.autoscaling.AutoAddReplicasIntegrationTest_C7F558FFEEF2E52F-001\tempDir-001\node3\testSimple1_shard2_replica_n4], dataDir=[C:\Users\jenkins\workspace\Lucene-Solr-8.x-Windows\solr\build\solr-core\test\J1\temp\solr.cloud.autoscaling.AutoAddReplicasIntegrationTest_C7F558FFEEF2E52F-001\tempDir-001\node3\.\testSimple1_shard2_replica_n4\data\]
   [junit4]   2> 39585 INFO  (qtp155550553-156) [n:127.0.0.1:59791_solr c:testSimple1 s:shard1 r:core_node5 x:testSimple1_shard1_replica_n2 ] o.a.s.u.UpdateHandler Using UpdateLog implementation: org.apache.solr.update.UpdateLog
   [junit4]   2> 39585 INFO  (qtp155550553-156) [n:127.0.0.1:59791_solr c:testSimple1 s:shard1 r:core_node5 x:testSimple1_shard1_replica_n2 ] o.a.s.u.UpdateLog Initializing UpdateLog: dataDir=null defaultSyncLevel=FLUSH numRecordsToKeep=100 maxNumLogsToKeep=10 numVersionBuckets=65536
   [junit4]   2> 39588 INFO  (qtp155550553-156) [n:127.0.0.1:59791_solr c:testSimple1 s:shard1 r:core_node5 x:testSimple1_shard1_replica_n2 ] o.a.s.u.CommitTracker Hard AutoCommit: disabled
   [junit4]   2> 39588 INFO  (qtp155550553-156) [n:127.0.0.1:59791_solr c:testSimple1 s:shard1 r:core_node5 x:testSimple1_shard1_replica_n2 ] o.a.s.u.CommitTracker Soft AutoCommit: disabled
   [junit4]   2> 39799 INFO  (qtp155550553-151) [n:127.0.0.1:59791_solr c:testSimple1 s:shard2 r:core_node8 x:testSimple1_shard2_replica_n6 ] o.a.s.u.UpdateHandler Using UpdateLog implementation: org.apache.solr.update.UpdateLog
   [junit4]   2> 39799 INFO  (qtp155550553-151) [n:127.0.0.1:59791_solr c:testSimple1 s:shard2 r:core_node8 x:testSimple1_shard2_replica_n6 ] o.a.s.u.UpdateLog Initializing UpdateLog: dataDir=null defaultSyncLevel=FLUSH numRecordsToKeep=100 maxNumLogsToKeep=10 numVersionBuckets=65536
   [junit4]   2> 39831 INFO  (qtp155550553-151) [n:127.0.0.1:59791_solr c:testSimple1 s:shard2 r:core_node8 x:testSimple1_shard2_replica_n6 ] o.a.s.u.CommitTracker Hard AutoCommit: disabled
   [junit4]   2> 39831 INFO  (qtp155550553-151) [n:127.0.0.1:59791_solr c:testSimple1 s:shard2 r:core_node8 x:testSimple1_shard2_replica_n6 ] o.a.s.u.CommitTracker Soft AutoCommit: disabled
   [junit4]   2> 39845 INFO  (qtp155550553-156) [n:127.0.0.1:59791_solr c:testSimple1 s:shard1 r:core_node5 x:testSimple1_shard1_replica_n2 ] o.a.s.s.SolrIndexSearcher Opening [Searcher@15b34fc4[testSimple1_shard1_replica_n2] main]
   [junit4]   2> 39874 INFO  (qtp155550553-156) [n:127.0.0.1:59791_solr c:testSimple1 s:shard1 r:core_node5 x:testSimple1_shard1_replica_n2 ] o.a.s.r.ManagedResourceStorage Configured ZooKeeperStorageIO with znodeBase: /configs/conf
   [junit4]   2> 39876 INFO  (qtp155550553-156) [n:127.0.0.1:59791_solr c:testSimple1 s:shard1 r:core_node5 x:testSimple1_shard1_replica_n2 ] o.a.s.r.ManagedResourceStorage Loaded null at path _rest_managed.json using ZooKeeperStorageIO:path=/configs/conf
   [junit4]   2> 39876 INFO  (qtp155550553-156) [n:127.0.0.1:59791_solr c:testSimple1 s:shard1 r:core_node5 x:testSimple1_shard1_replica_n2 ] o.a.s.h.ReplicationHandler Commits will be reserved for 10000ms.
   [junit4]   2> 39876 INFO  (qtp155550553-156) [n:127.0.0.1:59791_solr c:testSimple1 s:shard1 r:core_node5 x:testSimple1_shard1_replica_n2 ] o.a.s.u.UpdateLog Could not find max version in index or recent updates, using new clock 1639687951446179840
   [junit4]   2> 39922 INFO  (qtp155550553-151) [n:127.0.0.1:59791_solr c:testSimple1 s:shard2 r:core_node8 x:testSimple1_shard2_replica_n6 ] o.a.s.s.SolrIndexSearcher Opening [Searcher@1d6f9194[testSimple1_shard2_replica_n6] main]
   [junit4]   2> 39922 INFO  (searcherExecutor-63-thread-1-processing-n:127.0.0.1:59791_solr x:testSimple1_shard1_replica_n2 c:testSimple1 s:shard1 r:core_node5) [n:127.0.0.1:59791_solr c:testSimple1 s:shard1 r:core_node5 x:testSimple1_shard1_replica_n2 ] o.a.s.c.SolrCore [testSimple1_shard1_replica_n2] Registered new searcher Searcher@15b34fc4[testSimple1_shard1_replica_n2] main{ExitableDirectoryReader(UninvertingDirectoryReader())}
   [junit4]   2> 39989 INFO  (qtp1827456182-161) [n:127.0.0.1:59788_solr c:testSimple1 s:shard1 r:core_node3 x:testSimple1_shard1_replica_n1 ] o.a.s.u.UpdateHandler Using UpdateLog implementation: org.apache.solr.update.UpdateLog
   [junit4]   2> 39989 INFO  (qtp1827456182-161) [n:127.0.0.1:59788_solr c:testSimple1 s:shard1 r:core_node3 x:testSimple1_shard1_replica_n1 ] o.a.s.u.UpdateLog Initializing UpdateLog: dataDir=null defaultSyncLevel=FLUSH numRecordsToKeep=100 maxNumLogsToKeep=10 numVersionBuckets=65536
   [junit4]   2> 39995 INFO  (qtp1827456182-161) [n:127.0.0.1:59788_solr c:testSimple1 s:shard1 r:core_node3 x:testSimple1_shard1_replica_n1 ] o.a.s.u.CommitTracker Hard AutoCommit: disabled
   [junit4]   2> 39995 INFO  (qtp1827456182-161) [n:127.0.0.1:59788_solr c:testSimple1 s:shard1 r:core_node3 x:testSimple1_shard1_replica_n1 ] o.a.s.u.CommitTracker Soft AutoCommit: disabled
   [junit4]   2> 40003 INFO  (qtp155550553-151) [n:127.0.0.1:59791_solr c:testSimple1 s:shard2 r:core_node8 x:testSimple1_shard2_replica_n6 ] o.a.s.r.ManagedResourceStorage Configured ZooKeeperStorageIO with znodeBase: /configs/conf
   [junit4]   2> 40008 INFO  (qtp155550553-151) [n:127.0.0.1:59791_solr c:testSimple1 s:shard2 r:core_node8 x:testSimple1_shard2_replica_n6 ] o.a.s.r.ManagedResourceStorage Loaded null at path _rest_managed.json using ZooKeeperStorageIO:path=/configs/conf
   [junit4]   2> 40008 INFO  (qtp155550553-151) [n:127.0.0.1:59791_solr c:testSimple1 s:shard2 r:core_node8 x:testSimple1_shard2_replica_n6 ] o.a.s.h.ReplicationHandler Commits will be reserved for 10000ms.
   [junit4]   2> 40008 INFO  (qtp155550553-151) [n:127.0.0.1:59791_solr c:testSimple1 s:shard2 r:core_node8 x:testSimple1_shard2_replica_n6 ] o.a.s.u.UpdateLog Could not find max version in index or recent updates, using new clock 1639687951584591872
   [junit4]   2> 40014 INFO  (qtp1827456182-145) [n:127.0.0.1:59788_solr c:testSimple1 s:shard2 r:core_node7 x:testSimple1_shard2_replica_n4 ] o.a.s.u.UpdateHandler Using UpdateLog implementation: org.apache.solr.update.UpdateLog
   [junit4]   2> 40014 INFO  (qtp1827456182-145) [n:127.0.0.1:59788_solr c:testSimple1 s:shard2 r:core_node7 x:testSimple1_shard2_replica_n4 ] o.a.s.u.UpdateLog Initializing UpdateLog: dataDir=null defaultSyncLevel=FLUSH numRecordsToKeep=100 maxNumLogsToKeep=10 numVersionBuckets=65536
   [junit4]   2> 40018 INFO  (qtp1827456182-145) [n:127.0.0.1:59788_solr c:testSimple1 s:shard2 r:core_node7 x:testSimple1_shard2_replica_n4 ] o.a.s.u.CommitTracker Hard AutoCommit: disabled
   [junit4]   2> 40018 INFO  (qtp1827456182-145) [n:127.0.0.1:59788_solr c:testSimple1 s:shard2 r:core_node7 x:testSimple1_shard2_replica_n4 ] o.a.s.u.CommitTracker Soft AutoCommit: disabled
   [junit4]   2> 40034 INFO  (searcherExecutor-64-thread-1-processing-n:127.0.0.1:59791_solr x:testSimple1_shard2_replica_n6 c:testSimple1 s:shard2 r:core_node8) [n:127.0.0.1:59791_solr c:testSimple1 s:shard2 r:core_node8 x:testSimple1_shard2_replica_n6 ] o.a.s.c.SolrCore [testSimple1_shard2_replica_n6] Registered new searcher Searcher@1d6f9194[testSimple1_shard2_replica_n6] main{ExitableDirectoryReader(UninvertingDirectoryReader())}
   [junit4]   2> 40042 INFO  (qtp1827456182-161) [n:127.0.0.1:59788_solr c:testSimple1 s:shard1 r:core_node3 x:testSimple1_shard1_replica_n1 ] o.a.s.s.SolrIndexSearcher Opening [Searcher@1ed9d3fc[testSimple1_shard1_replica_n1] main]
   [junit4]   2> 40046 INFO  (qtp155550553-156) [n:127.0.0.1:59791_solr c:testSimple1 s:shard1 r:core_node5 x:testSimple1_shard1_replica_n2 ] o.a.s.c.ZkShardTerms Successful update of terms at /collections/testSimple1/terms/shard1 to Terms{values={core_node5=0}, version=0}

[...truncated too long message...]

ild\contrib\solr-analytics\test\temp\junit4-J0-20190721_183019_69710628619713572280675.syserr
   [junit4] >>> JVM J0 emitted unexpected output (verbatim) ----
   [junit4] OpenJDK 64-Bit Server VM warning: Option UseConcMarkSweepGC was deprecated in version 9.0 and will likely be removed in a future release.
   [junit4] <<< JVM J0: EOF ----

[...truncated 572 lines...]
   [junit4] JVM J0: stderr was not empty, see: C:\Users\jenkins\workspace\Lucene-Solr-8.x-Windows\solr\build\contrib\solr-clustering\test\temp\junit4-J0-20190721_183338_12515752596961412155803.syserr
   [junit4] >>> JVM J0 emitted unexpected output (verbatim) ----
   [junit4] OpenJDK 64-Bit Server VM warning: Option UseConcMarkSweepGC was deprecated in version 9.0 and will likely be removed in a future release.
   [junit4] <<< JVM J0: EOF ----

[...truncated 3 lines...]
   [junit4] JVM J1: stderr was not empty, see: C:\Users\jenkins\workspace\Lucene-Solr-8.x-Windows\solr\build\contrib\solr-clustering\test\temp\junit4-J1-20190721_183338_12514316113043890323080.syserr
   [junit4] >>> JVM J1 emitted unexpected output (verbatim) ----
   [junit4] OpenJDK 64-Bit Server VM warning: Option UseConcMarkSweepGC was deprecated in version 9.0 and will likely be removed in a future release.
   [junit4] <<< JVM J1: EOF ----

[...truncated 1301 lines...]
   [junit4] JVM J0: stderr was not empty, see: C:\Users\jenkins\workspace\Lucene-Solr-8.x-Windows\solr\build\contrib\solr-dataimporthandler-extras\test\temp\junit4-J0-20190721_183417_04110647757669668080596.syserr
   [junit4] >>> JVM J0 emitted unexpected output (verbatim) ----
   [junit4] OpenJDK 64-Bit Server VM warning: Option UseConcMarkSweepGC was deprecated in version 9.0 and will likely be removed in a future release.
   [junit4] <<< JVM J0: EOF ----

[...truncated 3 lines...]
   [junit4] JVM J1: stderr was not empty, see: C:\Users\jenkins\workspace\Lucene-Solr-8.x-Windows\solr\build\contrib\solr-dataimporthandler-extras\test\temp\junit4-J1-20190721_183417_0413789898828834079774.syserr
   [junit4] >>> JVM J1 emitted unexpected output (verbatim) ----
   [junit4] OpenJDK 64-Bit Server VM warning: Option UseConcMarkSweepGC was deprecated in version 9.0 and will likely be removed in a future release.
   [junit4] <<< JVM J1: EOF ----

[...truncated 667 lines...]
   [junit4] JVM J0: stderr was not empty, see: C:\Users\jenkins\workspace\Lucene-Solr-8.x-Windows\solr\build\contrib\solr-dataimporthandler\test\temp\junit4-J0-20190721_183437_5261007053476521164899.syserr
   [junit4] >>> JVM J0 emitted unexpected output (verbatim) ----
   [junit4] OpenJDK 64-Bit Server VM warning: Option UseConcMarkSweepGC was deprecated in version 9.0 and will likely be removed in a future release.
   [junit4] <<< JVM J0: EOF ----

[...truncated 3 lines...]
   [junit4] JVM J1: stderr was not empty, see: C:\Users\jenkins\workspace\Lucene-Solr-8.x-Windows\solr\build\contrib\solr-dataimporthandler\test\temp\junit4-J1-20190721_183437_52615569570372620279055.syserr
   [junit4] >>> JVM J1 emitted unexpected output (verbatim) ----
   [junit4] OpenJDK 64-Bit Server VM warning: Option UseConcMarkSweepGC was deprecated in version 9.0 and will likely be removed in a future release.
   [junit4] <<< JVM J1: EOF ----

[...truncated 574 lines...]
   [junit4] JVM J0: stderr was not empty, see: C:\Users\jenkins\workspace\Lucene-Solr-8.x-Windows\solr\build\contrib\solr-cell\test\temp\junit4-J0-20190721_183544_88312229661949065169702.syserr
   [junit4] >>> JVM J0 emitted unexpected output (verbatim) ----
   [junit4] OpenJDK 64-Bit Server VM warning: Option UseConcMarkSweepGC was deprecated in version 9.0 and will likely be removed in a future release.
   [junit4] <<< JVM J0: EOF ----

[...truncated 3 lines...]
   [junit4] JVM J1: stderr was not empty, see: C:\Users\jenkins\workspace\Lucene-Solr-8.x-Windows\solr\build\contrib\solr-cell\test\temp\junit4-J1-20190721_183544_8837343287004566258885.syserr
   [junit4] >>> JVM J1 emitted unexpected output (verbatim) ----
   [junit4] OpenJDK 64-Bit Server VM warning: Option UseConcMarkSweepGC was deprecated in version 9.0 and will likely be removed in a future release.
   [junit4] <<< JVM J1: EOF ----

[...truncated 566 lines...]
   [junit4] JVM J0: stderr was not empty, see: C:\Users\jenkins\workspace\Lucene-Solr-8.x-Windows\solr\build\contrib\solr-jaegertracer-configurator\test\temp\junit4-J0-20190721_183620_20417430703415853687424.syserr
   [junit4] >>> JVM J0 emitted unexpected output (verbatim) ----
   [junit4] OpenJDK 64-Bit Server VM warning: Option UseConcMarkSweepGC was deprecated in version 9.0 and will likely be removed in a future release.
   [junit4] <<< JVM J0: EOF ----

[...truncated 578 lines...]
   [junit4] JVM J0: stderr was not empty, see: C:\Users\jenkins\workspace\Lucene-Solr-8.x-Windows\solr\build\contrib\solr-langid\test\temp\junit4-J0-20190721_183648_3871264187219078776156.syserr
   [junit4] >>> JVM J0 emitted unexpected output (verbatim) ----
   [junit4] OpenJDK 64-Bit Server VM warning: Option UseConcMarkSweepGC was deprecated in version 9.0 and will likely be removed in a future release.
   [junit4] <<< JVM J0: EOF ----

[...truncated 3 lines...]
   [junit4] JVM J1: stderr was not empty, see: C:\Users\jenkins\workspace\Lucene-Solr-8.x-Windows\solr\build\contrib\solr-langid\test\temp\junit4-J1-20190721_183648_38713400833647257601803.syserr
   [junit4] >>> JVM J1 emitted unexpected output (verbatim) ----
   [junit4] OpenJDK 64-Bit Server VM warning: Option UseConcMarkSweepGC was deprecated in version 9.0 and will likely be removed in a future release.
   [junit4] <<< JVM J1: EOF ----

[...truncated 683 lines...]
   [junit4] JVM J0: stderr was not empty, see: C:\Users\jenkins\workspace\Lucene-Solr-8.x-Windows\solr\build\contrib\solr-ltr\test\temp\junit4-J0-20190721_183717_8357658409147292917887.syserr
   [junit4] >>> JVM J0 emitted unexpected output (verbatim) ----
   [junit4] OpenJDK 64-Bit Server VM warning: Option UseConcMarkSweepGC was deprecated in version 9.0 and will likely be removed in a future release.
   [junit4] <<< JVM J0: EOF ----

[...truncated 3 lines...]
   [junit4] JVM J1: stderr was not empty, see: C:\Users\jenkins\workspace\Lucene-Solr-8.x-Windows\solr\build\contrib\solr-ltr\test\temp\junit4-J1-20190721_183717_83517997824792602090754.syserr
   [junit4] >>> JVM J1 emitted unexpected output (verbatim) ----
   [junit4] OpenJDK 64-Bit Server VM warning: Option UseConcMarkSweepGC was deprecated in version 9.0 and will likely be removed in a future release.
   [junit4] <<< JVM J1: EOF ----

[...truncated 582 lines...]
   [junit4] JVM J1: stderr was not empty, see: C:\Users\jenkins\workspace\Lucene-Solr-8.x-Windows\solr\build\contrib\solr-prometheus-exporter\test\temp\junit4-J1-20190721_183826_54611366216770927574425.syserr
   [junit4] >>> JVM J1 emitted unexpected output (verbatim) ----
   [junit4] OpenJDK 64-Bit Server VM warning: Option UseConcMarkSweepGC was deprecated in version 9.0 and will likely be removed in a future release.
   [junit4] <<< JVM J1: EOF ----

[...truncated 3 lines...]
   [junit4] JVM J0: stderr was not empty, see: C:\Users\jenkins\workspace\Lucene-Solr-8.x-Windows\solr\build\contrib\solr-prometheus-exporter\test\temp\junit4-J0-20190721_183826_5463416738286468921033.syserr
   [junit4] >>> JVM J0 emitted unexpected output (verbatim) ----
   [junit4] OpenJDK 64-Bit Server VM warning: Option UseConcMarkSweepGC was deprecated in version 9.0 and will likely be removed in a future release.
   [junit4] <<< JVM J0: EOF ----

[...truncated 568 lines...]
   [junit4] JVM J0: stderr was not empty, see: C:\Users\jenkins\workspace\Lucene-Solr-8.x-Windows\solr\build\contrib\solr-velocity\test\temp\junit4-J0-20190721_183921_79711862310144264015040.syserr
   [junit4] >>> JVM J0 emitted unexpected output (verbatim) ----
   [junit4] OpenJDK 64-Bit Server VM warning: Option UseConcMarkSweepGC was deprecated in version 9.0 and will likely be removed in a future release.
   [junit4] <<< JVM J0: EOF ----

[...truncated 35375 lines...]
[repro] Jenkins log URL: https://jenkins.thetaphi.de/job/Lucene-Solr-8.x-Windows/378/consoleText

[repro] Revision: 5ff3ebec1249552a6f43e23763d48a492f8ed135

[repro] Ant options: "-Dargs=-XX:-UseCompressedOops -XX:+UseConcMarkSweepGC"

[repro] ant clean

[...truncated 6 lines...]
[repro] Test suites by module:
[repro]    solr\core
[repro]       AutoAddReplicasIntegrationTest
[repro] ant compile-test

[...truncated 3610 lines...]
[repro] ant test-nocompile -Dtests.dups=5 -Dtests.maxfailures=5 -Dtests.class="*.AutoAddReplicasIntegrationTest" -Dtests.showOutput=onerror "-Dargs=-XX:-UseCompressedOops -XX:+UseConcMarkSweepGC" -Dtests.seed=C7F558FFEEF2E52F -Dtests.slow=true -Dtests.locale=en-VC -Dtests.timezone=Asia/Istanbul -Dtests.asserts=true -Dtests.file.encoding=UTF-8

[...truncated 52 lines...]
   [junit4] JVM J0: stderr was not empty, see: C:\Users\jenkins\workspace\Lucene-Solr-8.x-Windows\solr\build\solr-core\test\temp\junit4-J0-20190721_184912_0698508083339576423005.syserr
   [junit4] >>> JVM J0 emitted unexpected output (verbatim) ----
   [junit4] OpenJDK 64-Bit Server VM warning: Option UseConcMarkSweepGC was deprecated in version 9.0 and will likely be removed in a future release.
   [junit4] <<< JVM J0: EOF ----

[...truncated 5 lines...]
   [junit4] JVM J1: stderr was not empty, see: C:\Users\jenkins\workspace\Lucene-Solr-8.x-Windows\solr\build\solr-core\test\temp\junit4-J1-20190721_184912_0693972191189293262738.syserr
   [junit4] >>> JVM J1 emitted unexpected output (verbatim) ----
   [junit4] OpenJDK 64-Bit Server VM warning: Option UseConcMarkSweepGC was deprecated in version 9.0 and will likely be removed in a future release.
   [junit4] <<< JVM J1: EOF ----

[...truncated 21 lines...]
[repro] Failures:
[repro]   0/5 failed: org.apache.solr.cloud.autoscaling.AutoAddReplicasIntegrationTest
[repro] Exiting with code 0

[...truncated 78 lines...]

Mime
View raw message