lucene-dev mailing list archives

Site index · List index
Message view « Date » · « Thread »
Top « Date » · « Thread »
From Apache Jenkins Server <jenk...@builds.apache.org>
Subject [JENKINS] Lucene-Solr-BadApples-NightlyTests-8.x - Build # 24 - Unstable
Date Sat, 06 Jul 2019 03:12:39 GMT
Build: https://builds.apache.org/job/Lucene-Solr-BadApples-NightlyTests-8.x/24/

1 tests failed.
FAILED:  org.apache.solr.cloud.SharedFSAutoReplicaFailoverTest.test

Error Message:
Expected numSlices=5 numReplicas=1 but found DocCollection(solrj_collection4//collections/solrj_collection4/state.json/26)={   "pullReplicas":"0",   "replicationFactor":"1",   "shards":{     "shard1":{       "range":"80000000-b332ffff",       "state":"active",       "replicas":{}},     "shard2":{       "range":"b3330000-e665ffff",       "state":"active",       "replicas":{"core_node5":{           "dataDir":"hdfs://lucene2-us-west.apache.org:37041/solr_hdfs_home/solrj_collection4/core_node5/data/",           "base_url":"http://127.0.0.1:33923",           "node_name":"127.0.0.1:33923_",           "type":"NRT",           "force_set_state":"false",           "ulogDir":"hdfs://lucene2-us-west.apache.org:37041/solr_hdfs_home/solrj_collection4/core_node5/data/tlog",           "core":"solrj_collection4_shard2_replica_n2",           "shared_storage":"true",           "state":"active",           "leader":"true"}}},     "shard3":{       "range":"e6660000-1998ffff",       "state":"active",       "replicas":{"core_node7":{           "dataDir":"hdfs://lucene2-us-west.apache.org:37041/solr_hdfs_home/solrj_collection4/core_node7/data/",           "base_url":"http://127.0.0.1:37578",           "node_name":"127.0.0.1:37578_",           "type":"NRT",           "force_set_state":"false",           "ulogDir":"hdfs://lucene2-us-west.apache.org:37041/solr_hdfs_home/solrj_collection4/core_node7/data/tlog",           "core":"solrj_collection4_shard3_replica_n4",           "shared_storage":"true",           "state":"active",           "leader":"true"}}},     "shard4":{       "range":"19990000-4ccbffff",       "state":"active",       "replicas":{"core_node9":{           "dataDir":"hdfs://lucene2-us-west.apache.org:37041/solr_hdfs_home/solrj_collection4/core_node9/data/",           "base_url":"http://127.0.0.1:37578",           "node_name":"127.0.0.1:37578_",           "type":"NRT",           "force_set_state":"false",           "ulogDir":"hdfs://lucene2-us-west.apache.org:37041/solr_hdfs_home/solrj_collection4/core_node9/data/tlog",           "core":"solrj_collection4_shard4_replica_n6",           "shared_storage":"true",           "state":"active",           "leader":"true"}}},     "shard5":{       "range":"4ccc0000-7fffffff",       "state":"active",       "replicas":{"core_node10":{           "dataDir":"hdfs://lucene2-us-west.apache.org:37041/solr_hdfs_home/solrj_collection4/core_node10/data/",           "base_url":"http://127.0.0.1:33923",           "node_name":"127.0.0.1:33923_",           "type":"NRT",           "force_set_state":"false",           "ulogDir":"hdfs://lucene2-us-west.apache.org:37041/solr_hdfs_home/solrj_collection4/core_node10/data/tlog",           "core":"solrj_collection4_shard5_replica_n8",           "shared_storage":"true",           "state":"active",           "leader":"true"}}}},   "router":{     "field":"text",     "name":"compositeId"},   "maxShardsPerNode":"5",   "autoAddReplicas":"true",   "nrtReplicas":"1",   "tlogReplicas":"0"} with /live_nodes: [127.0.0.1:33923_, 127.0.0.1:33953_, 127.0.0.1:36262_, 127.0.0.1:37578_, 127.0.0.1:44299_]

Stack Trace:
java.lang.AssertionError: Expected numSlices=5 numReplicas=1 but found DocCollection(solrj_collection4//collections/solrj_collection4/state.json/26)={
  "pullReplicas":"0",
  "replicationFactor":"1",
  "shards":{
    "shard1":{
      "range":"80000000-b332ffff",
      "state":"active",
      "replicas":{}},
    "shard2":{
      "range":"b3330000-e665ffff",
      "state":"active",
      "replicas":{"core_node5":{
          "dataDir":"hdfs://lucene2-us-west.apache.org:37041/solr_hdfs_home/solrj_collection4/core_node5/data/",
          "base_url":"http://127.0.0.1:33923",
          "node_name":"127.0.0.1:33923_",
          "type":"NRT",
          "force_set_state":"false",
          "ulogDir":"hdfs://lucene2-us-west.apache.org:37041/solr_hdfs_home/solrj_collection4/core_node5/data/tlog",
          "core":"solrj_collection4_shard2_replica_n2",
          "shared_storage":"true",
          "state":"active",
          "leader":"true"}}},
    "shard3":{
      "range":"e6660000-1998ffff",
      "state":"active",
      "replicas":{"core_node7":{
          "dataDir":"hdfs://lucene2-us-west.apache.org:37041/solr_hdfs_home/solrj_collection4/core_node7/data/",
          "base_url":"http://127.0.0.1:37578",
          "node_name":"127.0.0.1:37578_",
          "type":"NRT",
          "force_set_state":"false",
          "ulogDir":"hdfs://lucene2-us-west.apache.org:37041/solr_hdfs_home/solrj_collection4/core_node7/data/tlog",
          "core":"solrj_collection4_shard3_replica_n4",
          "shared_storage":"true",
          "state":"active",
          "leader":"true"}}},
    "shard4":{
      "range":"19990000-4ccbffff",
      "state":"active",
      "replicas":{"core_node9":{
          "dataDir":"hdfs://lucene2-us-west.apache.org:37041/solr_hdfs_home/solrj_collection4/core_node9/data/",
          "base_url":"http://127.0.0.1:37578",
          "node_name":"127.0.0.1:37578_",
          "type":"NRT",
          "force_set_state":"false",
          "ulogDir":"hdfs://lucene2-us-west.apache.org:37041/solr_hdfs_home/solrj_collection4/core_node9/data/tlog",
          "core":"solrj_collection4_shard4_replica_n6",
          "shared_storage":"true",
          "state":"active",
          "leader":"true"}}},
    "shard5":{
      "range":"4ccc0000-7fffffff",
      "state":"active",
      "replicas":{"core_node10":{
          "dataDir":"hdfs://lucene2-us-west.apache.org:37041/solr_hdfs_home/solrj_collection4/core_node10/data/",
          "base_url":"http://127.0.0.1:33923",
          "node_name":"127.0.0.1:33923_",
          "type":"NRT",
          "force_set_state":"false",
          "ulogDir":"hdfs://lucene2-us-west.apache.org:37041/solr_hdfs_home/solrj_collection4/core_node10/data/tlog",
          "core":"solrj_collection4_shard5_replica_n8",
          "shared_storage":"true",
          "state":"active",
          "leader":"true"}}}},
  "router":{
    "field":"text",
    "name":"compositeId"},
  "maxShardsPerNode":"5",
  "autoAddReplicas":"true",
  "nrtReplicas":"1",
  "tlogReplicas":"0"} with /live_nodes: [127.0.0.1:33923_, 127.0.0.1:33953_, 127.0.0.1:36262_, 127.0.0.1:37578_, 127.0.0.1:44299_]
	at __randomizedtesting.SeedInfo.seed([4F7BBC67702012C6:C72F83BDDEDC7F3E]:0)
	at org.junit.Assert.fail(Assert.java:88)
	at org.apache.solr.cloud.SharedFSAutoReplicaFailoverTest.assertSliceAndReplicaCount(SharedFSAutoReplicaFailoverTest.java:418)
	at org.apache.solr.cloud.SharedFSAutoReplicaFailoverTest.testBasics(SharedFSAutoReplicaFailoverTest.java:277)
	at org.apache.solr.cloud.SharedFSAutoReplicaFailoverTest.test(SharedFSAutoReplicaFailoverTest.java:148)
	at sun.reflect.NativeMethodAccessorImpl.invoke0(Native Method)
	at sun.reflect.NativeMethodAccessorImpl.invoke(NativeMethodAccessorImpl.java:62)
	at sun.reflect.DelegatingMethodAccessorImpl.invoke(DelegatingMethodAccessorImpl.java:43)
	at java.lang.reflect.Method.invoke(Method.java:498)
	at com.carrotsearch.randomizedtesting.RandomizedRunner.invoke(RandomizedRunner.java:1750)
	at com.carrotsearch.randomizedtesting.RandomizedRunner$8.evaluate(RandomizedRunner.java:938)
	at com.carrotsearch.randomizedtesting.RandomizedRunner$9.evaluate(RandomizedRunner.java:974)
	at com.carrotsearch.randomizedtesting.RandomizedRunner$10.evaluate(RandomizedRunner.java:988)
	at org.apache.solr.BaseDistributedSearchTestCase$ShardsRepeatRule$ShardsFixedStatement.callStatement(BaseDistributedSearchTestCase.java:1082)
	at org.apache.solr.BaseDistributedSearchTestCase$ShardsRepeatRule$ShardsStatement.evaluate(BaseDistributedSearchTestCase.java:1054)
	at com.carrotsearch.randomizedtesting.rules.SystemPropertiesRestoreRule$1.evaluate(SystemPropertiesRestoreRule.java:57)
	at org.apache.lucene.util.TestRuleSetupTeardownChained$1.evaluate(TestRuleSetupTeardownChained.java:49)
	at org.apache.lucene.util.AbstractBeforeAfterRule$1.evaluate(AbstractBeforeAfterRule.java:45)
	at org.apache.lucene.util.TestRuleThreadAndTestName$1.evaluate(TestRuleThreadAndTestName.java:48)
	at org.apache.lucene.util.TestRuleIgnoreAfterMaxFailures$1.evaluate(TestRuleIgnoreAfterMaxFailures.java:64)
	at org.apache.lucene.util.TestRuleMarkFailure$1.evaluate(TestRuleMarkFailure.java:47)
	at com.carrotsearch.randomizedtesting.rules.StatementAdapter.evaluate(StatementAdapter.java:36)
	at com.carrotsearch.randomizedtesting.ThreadLeakControl$StatementRunner.run(ThreadLeakControl.java:368)
	at com.carrotsearch.randomizedtesting.ThreadLeakControl.forkTimeoutingTask(ThreadLeakControl.java:817)
	at com.carrotsearch.randomizedtesting.ThreadLeakControl$3.evaluate(ThreadLeakControl.java:468)
	at com.carrotsearch.randomizedtesting.RandomizedRunner.runSingleTest(RandomizedRunner.java:947)
	at com.carrotsearch.randomizedtesting.RandomizedRunner$5.evaluate(RandomizedRunner.java:832)
	at com.carrotsearch.randomizedtesting.RandomizedRunner$6.evaluate(RandomizedRunner.java:883)
	at com.carrotsearch.randomizedtesting.RandomizedRunner$7.evaluate(RandomizedRunner.java:894)
	at com.carrotsearch.randomizedtesting.rules.StatementAdapter.evaluate(StatementAdapter.java:36)
	at com.carrotsearch.randomizedtesting.rules.SystemPropertiesRestoreRule$1.evaluate(SystemPropertiesRestoreRule.java:57)
	at org.apache.lucene.util.AbstractBeforeAfterRule$1.evaluate(AbstractBeforeAfterRule.java:45)
	at com.carrotsearch.randomizedtesting.rules.StatementAdapter.evaluate(StatementAdapter.java:36)
	at org.apache.lucene.util.TestRuleStoreClassName$1.evaluate(TestRuleStoreClassName.java:41)
	at com.carrotsearch.randomizedtesting.rules.NoShadowingOrOverridesOnMethodsRule$1.evaluate(NoShadowingOrOverridesOnMethodsRule.java:40)
	at com.carrotsearch.randomizedtesting.rules.NoShadowingOrOverridesOnMethodsRule$1.evaluate(NoShadowingOrOverridesOnMethodsRule.java:40)
	at com.carrotsearch.randomizedtesting.rules.StatementAdapter.evaluate(StatementAdapter.java:36)
	at com.carrotsearch.randomizedtesting.rules.StatementAdapter.evaluate(StatementAdapter.java:36)
	at com.carrotsearch.randomizedtesting.rules.StatementAdapter.evaluate(StatementAdapter.java:36)
	at org.apache.lucene.util.TestRuleAssertionsRequired$1.evaluate(TestRuleAssertionsRequired.java:53)
	at org.apache.lucene.util.TestRuleMarkFailure$1.evaluate(TestRuleMarkFailure.java:47)
	at org.apache.lucene.util.TestRuleIgnoreAfterMaxFailures$1.evaluate(TestRuleIgnoreAfterMaxFailures.java:64)
	at org.apache.lucene.util.TestRuleIgnoreTestSuites$1.evaluate(TestRuleIgnoreTestSuites.java:54)
	at com.carrotsearch.randomizedtesting.rules.StatementAdapter.evaluate(StatementAdapter.java:36)
	at com.carrotsearch.randomizedtesting.ThreadLeakControl$StatementRunner.run(ThreadLeakControl.java:368)
	at java.lang.Thread.run(Thread.java:748)




Build Log:
[...truncated 14442 lines...]
   [junit4] Suite: org.apache.solr.cloud.SharedFSAutoReplicaFailoverTest
   [junit4]   2> Creating dataDir: /home/jenkins/jenkins-slave/workspace/Lucene-Solr-BadApples-NightlyTests-8.x/checkout/solr/build/solr-core/test/J0/temp/solr.cloud.SharedFSAutoReplicaFailoverTest_4F7BBC67702012C6-001/init-core-data-001
   [junit4]   2> 1136271 WARN  (SUITE-SharedFSAutoReplicaFailoverTest-seed#[4F7BBC67702012C6]-worker) [     ] o.a.s.SolrTestCaseJ4 startTrackingSearchers: numOpens=4 numCloses=4
   [junit4]   2> 1136271 INFO  (SUITE-SharedFSAutoReplicaFailoverTest-seed#[4F7BBC67702012C6]-worker) [     ] o.a.s.SolrTestCaseJ4 Using PointFields (NUMERIC_POINTS_SYSPROP=true) w/NUMERIC_DOCVALUES_SYSPROP=false
   [junit4]   2> 1136273 INFO  (SUITE-SharedFSAutoReplicaFailoverTest-seed#[4F7BBC67702012C6]-worker) [     ] o.a.s.SolrTestCaseJ4 Randomized ssl (false) and clientAuth (false) via: @org.apache.solr.SolrTestCaseJ4$SuppressSSL(bugUrl=None)
   [junit4]   2> 1136273 INFO  (SUITE-SharedFSAutoReplicaFailoverTest-seed#[4F7BBC67702012C6]-worker) [     ] o.a.s.SolrTestCaseJ4 SecureRandom sanity checks: test.solr.allowed.securerandom=null & java.security.egd=file:/dev/./urandom
   [junit4]   2> 1136273 INFO  (SUITE-SharedFSAutoReplicaFailoverTest-seed#[4F7BBC67702012C6]-worker) [     ] o.a.s.BaseDistributedSearchTestCase Setting hostContext system property: /
   [junit4]   2> 1141777 WARN  (SUITE-SharedFSAutoReplicaFailoverTest-seed#[4F7BBC67702012C6]-worker) [     ] o.a.h.u.NativeCodeLoader Unable to load native-hadoop library for your platform... using builtin-java classes where applicable
   [junit4]   1> Formatting using clusterid: testClusterID
   [junit4]   2> 1148334 WARN  (SUITE-SharedFSAutoReplicaFailoverTest-seed#[4F7BBC67702012C6]-worker) [     ] o.a.h.m.i.MetricsConfig Cannot locate configuration: tried hadoop-metrics2-namenode.properties,hadoop-metrics2.properties
   [junit4]   2> 1149788 WARN  (SUITE-SharedFSAutoReplicaFailoverTest-seed#[4F7BBC67702012C6]-worker) [     ] o.a.h.h.HttpRequestLog Jetty request log can only be enabled using Log4j
   [junit4]   2> 1149937 INFO  (SUITE-SharedFSAutoReplicaFailoverTest-seed#[4F7BBC67702012C6]-worker) [     ] o.e.j.s.Server jetty-9.4.19.v20190610; built: 2019-06-10T16:30:51.723Z; git: afcf563148970e98786327af5e07c261fda175d3; jvm 1.8.0_191-b12
   [junit4]   2> 1149957 INFO  (SUITE-SharedFSAutoReplicaFailoverTest-seed#[4F7BBC67702012C6]-worker) [     ] o.e.j.s.session DefaultSessionIdManager workerName=node0
   [junit4]   2> 1149957 INFO  (SUITE-SharedFSAutoReplicaFailoverTest-seed#[4F7BBC67702012C6]-worker) [     ] o.e.j.s.session No SessionScavenger set, using defaults
   [junit4]   2> 1149957 INFO  (SUITE-SharedFSAutoReplicaFailoverTest-seed#[4F7BBC67702012C6]-worker) [     ] o.e.j.s.session node0 Scavenging every 600000ms
   [junit4]   2> 1149971 INFO  (SUITE-SharedFSAutoReplicaFailoverTest-seed#[4F7BBC67702012C6]-worker) [     ] o.e.j.s.h.ContextHandler Started o.e.j.s.ServletContextHandler@483cc479{static,/static,jar:file:/home/jenkins/.ivy2/cache/org.apache.hadoop/hadoop-hdfs/tests/hadoop-hdfs-3.2.0-tests.jar!/webapps/static,AVAILABLE}
   [junit4]   2> 1151058 INFO  (SUITE-SharedFSAutoReplicaFailoverTest-seed#[4F7BBC67702012C6]-worker) [     ] o.e.j.s.h.ContextHandler Started o.e.j.w.WebAppContext@1e843406{hdfs,/,file:///home/jenkins/jenkins-slave/workspace/Lucene-Solr-BadApples-NightlyTests-8.x/checkout/solr/build/solr-core/test/J0/temp/jetty-lucene2-us-west.apache.org-40857-hdfs-_-any-1187659763410727642.dir/webapp/,AVAILABLE}{/hdfs}
   [junit4]   2> 1151088 INFO  (SUITE-SharedFSAutoReplicaFailoverTest-seed#[4F7BBC67702012C6]-worker) [     ] o.e.j.s.AbstractConnector Started ServerConnector@40a5cc88{HTTP/1.1,[http/1.1]}{lucene2-us-west.apache.org:40857}
   [junit4]   2> 1151088 INFO  (SUITE-SharedFSAutoReplicaFailoverTest-seed#[4F7BBC67702012C6]-worker) [     ] o.e.j.s.Server Started @1151148ms
   [junit4]   2> 1157619 WARN  (SUITE-SharedFSAutoReplicaFailoverTest-seed#[4F7BBC67702012C6]-worker) [     ] o.a.h.h.HttpRequestLog Jetty request log can only be enabled using Log4j
   [junit4]   2> 1157637 INFO  (SUITE-SharedFSAutoReplicaFailoverTest-seed#[4F7BBC67702012C6]-worker) [     ] o.e.j.s.Server jetty-9.4.19.v20190610; built: 2019-06-10T16:30:51.723Z; git: afcf563148970e98786327af5e07c261fda175d3; jvm 1.8.0_191-b12
   [junit4]   2> 1157638 INFO  (SUITE-SharedFSAutoReplicaFailoverTest-seed#[4F7BBC67702012C6]-worker) [     ] o.e.j.s.session DefaultSessionIdManager workerName=node0
   [junit4]   2> 1157638 INFO  (SUITE-SharedFSAutoReplicaFailoverTest-seed#[4F7BBC67702012C6]-worker) [     ] o.e.j.s.session No SessionScavenger set, using defaults
   [junit4]   2> 1157638 INFO  (SUITE-SharedFSAutoReplicaFailoverTest-seed#[4F7BBC67702012C6]-worker) [     ] o.e.j.s.session node0 Scavenging every 660000ms
   [junit4]   2> 1157656 INFO  (SUITE-SharedFSAutoReplicaFailoverTest-seed#[4F7BBC67702012C6]-worker) [     ] o.e.j.s.h.ContextHandler Started o.e.j.s.ServletContextHandler@41c6fae8{static,/static,jar:file:/home/jenkins/.ivy2/cache/org.apache.hadoop/hadoop-hdfs/tests/hadoop-hdfs-3.2.0-tests.jar!/webapps/static,AVAILABLE}
   [junit4]   2> 1158518 INFO  (SUITE-SharedFSAutoReplicaFailoverTest-seed#[4F7BBC67702012C6]-worker) [     ] o.e.j.s.h.ContextHandler Started o.e.j.w.WebAppContext@5d027136{datanode,/,file:///home/jenkins/jenkins-slave/workspace/Lucene-Solr-BadApples-NightlyTests-8.x/checkout/solr/build/solr-core/test/J0/temp/jetty-localhost-34713-datanode-_-any-8505510950117063604.dir/webapp/,AVAILABLE}{/datanode}
   [junit4]   2> 1158518 INFO  (SUITE-SharedFSAutoReplicaFailoverTest-seed#[4F7BBC67702012C6]-worker) [     ] o.e.j.s.AbstractConnector Started ServerConnector@625376af{HTTP/1.1,[http/1.1]}{localhost:34713}
   [junit4]   2> 1158518 INFO  (SUITE-SharedFSAutoReplicaFailoverTest-seed#[4F7BBC67702012C6]-worker) [     ] o.e.j.s.Server Started @1158578ms
   [junit4]   2> 1160779 WARN  (SUITE-SharedFSAutoReplicaFailoverTest-seed#[4F7BBC67702012C6]-worker) [     ] o.a.h.h.HttpRequestLog Jetty request log can only be enabled using Log4j
   [junit4]   2> 1160780 INFO  (SUITE-SharedFSAutoReplicaFailoverTest-seed#[4F7BBC67702012C6]-worker) [     ] o.e.j.s.Server jetty-9.4.19.v20190610; built: 2019-06-10T16:30:51.723Z; git: afcf563148970e98786327af5e07c261fda175d3; jvm 1.8.0_191-b12
   [junit4]   2> 1160838 INFO  (SUITE-SharedFSAutoReplicaFailoverTest-seed#[4F7BBC67702012C6]-worker) [     ] o.e.j.s.session DefaultSessionIdManager workerName=node0
   [junit4]   2> 1160838 INFO  (SUITE-SharedFSAutoReplicaFailoverTest-seed#[4F7BBC67702012C6]-worker) [     ] o.e.j.s.session No SessionScavenger set, using defaults
   [junit4]   2> 1160838 INFO  (SUITE-SharedFSAutoReplicaFailoverTest-seed#[4F7BBC67702012C6]-worker) [     ] o.e.j.s.session node0 Scavenging every 660000ms
   [junit4]   2> 1160862 INFO  (SUITE-SharedFSAutoReplicaFailoverTest-seed#[4F7BBC67702012C6]-worker) [     ] o.e.j.s.h.ContextHandler Started o.e.j.s.ServletContextHandler@2dbc3ea2{static,/static,jar:file:/home/jenkins/.ivy2/cache/org.apache.hadoop/hadoop-hdfs/tests/hadoop-hdfs-3.2.0-tests.jar!/webapps/static,AVAILABLE}
   [junit4]   2> 1161574 INFO  (SUITE-SharedFSAutoReplicaFailoverTest-seed#[4F7BBC67702012C6]-worker) [     ] o.e.j.s.h.ContextHandler Started o.e.j.w.WebAppContext@32fdcff9{datanode,/,file:///home/jenkins/jenkins-slave/workspace/Lucene-Solr-BadApples-NightlyTests-8.x/checkout/solr/build/solr-core/test/J0/temp/jetty-localhost-35285-datanode-_-any-4418390008788659510.dir/webapp/,AVAILABLE}{/datanode}
   [junit4]   2> 1161591 INFO  (SUITE-SharedFSAutoReplicaFailoverTest-seed#[4F7BBC67702012C6]-worker) [     ] o.e.j.s.AbstractConnector Started ServerConnector@598c0486{HTTP/1.1,[http/1.1]}{localhost:35285}
   [junit4]   2> 1161591 INFO  (SUITE-SharedFSAutoReplicaFailoverTest-seed#[4F7BBC67702012C6]-worker) [     ] o.e.j.s.Server Started @1161651ms
   [junit4]   2> 1167625 INFO  (Block report processor) [     ] BlockStateChange BLOCK* processReport 0x528d55a567ae02c8: Processing first storage report for DS-7a0b6f1b-2c56-44db-9351-b719583d4be1 from datanode 91536fb6-eae5-4898-8062-631c86ac75a7
   [junit4]   2> 1167675 INFO  (Block report processor) [     ] BlockStateChange BLOCK* processReport 0x528d55a567ae02c8: from storage DS-7a0b6f1b-2c56-44db-9351-b719583d4be1 node DatanodeRegistration(127.0.0.1:34578, datanodeUuid=91536fb6-eae5-4898-8062-631c86ac75a7, infoPort=34612, infoSecurePort=0, ipcPort=38024, storageInfo=lv=-57;cid=testClusterID;nsid=1187154163;c=1562370570003), blocks: 0, hasStaleStorage: true, processing time: 3 msecs, invalidatedBlocks: 0
   [junit4]   2> 1167677 INFO  (Block report processor) [     ] BlockStateChange BLOCK* processReport 0x528d55a567ae02c8: Processing first storage report for DS-45f9da54-32a1-4ba0-8dc8-c9834cffdf5a from datanode 91536fb6-eae5-4898-8062-631c86ac75a7
   [junit4]   2> 1167678 INFO  (Block report processor) [     ] BlockStateChange BLOCK* processReport 0x528d55a567ae02c8: from storage DS-45f9da54-32a1-4ba0-8dc8-c9834cffdf5a node DatanodeRegistration(127.0.0.1:34578, datanodeUuid=91536fb6-eae5-4898-8062-631c86ac75a7, infoPort=34612, infoSecurePort=0, ipcPort=38024, storageInfo=lv=-57;cid=testClusterID;nsid=1187154163;c=1562370570003), blocks: 0, hasStaleStorage: false, processing time: 0 msecs, invalidatedBlocks: 0
   [junit4]   2> 1167678 INFO  (Block report processor) [     ] BlockStateChange BLOCK* processReport 0xc44cdf74a641f098: Processing first storage report for DS-f4f5adfd-d364-4284-a886-7210d4228a5c from datanode f880abc7-4d4c-4ce0-8902-7dc7f0c6e706
   [junit4]   2> 1167678 INFO  (Block report processor) [     ] BlockStateChange BLOCK* processReport 0xc44cdf74a641f098: from storage DS-f4f5adfd-d364-4284-a886-7210d4228a5c node DatanodeRegistration(127.0.0.1:40369, datanodeUuid=f880abc7-4d4c-4ce0-8902-7dc7f0c6e706, infoPort=45372, infoSecurePort=0, ipcPort=43230, storageInfo=lv=-57;cid=testClusterID;nsid=1187154163;c=1562370570003), blocks: 0, hasStaleStorage: true, processing time: 0 msecs, invalidatedBlocks: 0
   [junit4]   2> 1167690 INFO  (Block report processor) [     ] BlockStateChange BLOCK* processReport 0xc44cdf74a641f098: Processing first storage report for DS-f3050be0-45ae-40a1-9f80-b56fc81e6a88 from datanode f880abc7-4d4c-4ce0-8902-7dc7f0c6e706
   [junit4]   2> 1167691 INFO  (Block report processor) [     ] BlockStateChange BLOCK* processReport 0xc44cdf74a641f098: from storage DS-f3050be0-45ae-40a1-9f80-b56fc81e6a88 node DatanodeRegistration(127.0.0.1:40369, datanodeUuid=f880abc7-4d4c-4ce0-8902-7dc7f0c6e706, infoPort=45372, infoSecurePort=0, ipcPort=43230, storageInfo=lv=-57;cid=testClusterID;nsid=1187154163;c=1562370570003), blocks: 0, hasStaleStorage: false, processing time: 0 msecs, invalidatedBlocks: 0
   [junit4]   2> 1168460 INFO  (TEST-SharedFSAutoReplicaFailoverTest.test-seed#[4F7BBC67702012C6]) [     ] o.a.s.c.ZkTestServer STARTING ZK TEST SERVER
   [junit4]   2> 1168462 INFO  (ZkTestServer Run Thread) [     ] o.a.s.c.ZkTestServer client port:0.0.0.0/0.0.0.0:0
   [junit4]   2> 1168462 INFO  (ZkTestServer Run Thread) [     ] o.a.s.c.ZkTestServer Starting server
   [junit4]   2> 1168562 INFO  (TEST-SharedFSAutoReplicaFailoverTest.test-seed#[4F7BBC67702012C6]) [     ] o.a.s.c.ZkTestServer start zk server on port:33195
   [junit4]   2> 1168562 INFO  (TEST-SharedFSAutoReplicaFailoverTest.test-seed#[4F7BBC67702012C6]) [     ] o.a.s.c.ZkTestServer parse host and port list: 127.0.0.1:33195
   [junit4]   2> 1168562 INFO  (TEST-SharedFSAutoReplicaFailoverTest.test-seed#[4F7BBC67702012C6]) [     ] o.a.s.c.ZkTestServer connecting to 127.0.0.1 33195
   [junit4]   2> 1168564 INFO  (TEST-SharedFSAutoReplicaFailoverTest.test-seed#[4F7BBC67702012C6]) [     ] o.a.s.c.c.ConnectionManager Waiting for client to connect to ZooKeeper
   [junit4]   2> 1168567 INFO  (zkConnectionManagerCallback-2200-thread-1) [     ] o.a.s.c.c.ConnectionManager zkClient has connected
   [junit4]   2> 1168567 INFO  (TEST-SharedFSAutoReplicaFailoverTest.test-seed#[4F7BBC67702012C6]) [     ] o.a.s.c.c.ConnectionManager Client is connected to ZooKeeper
   [junit4]   2> 1168573 INFO  (TEST-SharedFSAutoReplicaFailoverTest.test-seed#[4F7BBC67702012C6]) [     ] o.a.s.c.c.ConnectionManager Waiting for client to connect to ZooKeeper
   [junit4]   2> 1168595 INFO  (zkConnectionManagerCallback-2202-thread-1) [     ] o.a.s.c.c.ConnectionManager zkClient has connected
   [junit4]   2> 1168595 INFO  (TEST-SharedFSAutoReplicaFailoverTest.test-seed#[4F7BBC67702012C6]) [     ] o.a.s.c.c.ConnectionManager Client is connected to ZooKeeper
   [junit4]   2> 1168596 INFO  (TEST-SharedFSAutoReplicaFailoverTest.test-seed#[4F7BBC67702012C6]) [     ] o.a.s.c.ZkTestServer put /home/jenkins/jenkins-slave/workspace/Lucene-Solr-BadApples-NightlyTests-8.x/checkout/solr/core/src/test-files/solr/collection1/conf/solrconfig-tlog.xml to /configs/conf1/solrconfig.xml
   [junit4]   2> 1168598 INFO  (TEST-SharedFSAutoReplicaFailoverTest.test-seed#[4F7BBC67702012C6]) [     ] o.a.s.c.ZkTestServer put /home/jenkins/jenkins-slave/workspace/Lucene-Solr-BadApples-NightlyTests-8.x/checkout/solr/core/src/test-files/solr/collection1/conf/schema15.xml to /configs/conf1/schema.xml
   [junit4]   2> 1168611 INFO  (TEST-SharedFSAutoReplicaFailoverTest.test-seed#[4F7BBC67702012C6]) [     ] o.a.s.c.ZkTestServer put /home/jenkins/jenkins-slave/workspace/Lucene-Solr-BadApples-NightlyTests-8.x/checkout/solr/core/src/test-files/solr/collection1/conf/solrconfig.snippet.randomindexconfig.xml to /configs/conf1/solrconfig.snippet.randomindexconfig.xml
   [junit4]   2> 1168612 INFO  (TEST-SharedFSAutoReplicaFailoverTest.test-seed#[4F7BBC67702012C6]) [     ] o.a.s.c.ZkTestServer put /home/jenkins/jenkins-slave/workspace/Lucene-Solr-BadApples-NightlyTests-8.x/checkout/solr/core/src/test-files/solr/collection1/conf/stopwords.txt to /configs/conf1/stopwords.txt
   [junit4]   2> 1168614 INFO  (TEST-SharedFSAutoReplicaFailoverTest.test-seed#[4F7BBC67702012C6]) [     ] o.a.s.c.ZkTestServer put /home/jenkins/jenkins-slave/workspace/Lucene-Solr-BadApples-NightlyTests-8.x/checkout/solr/core/src/test-files/solr/collection1/conf/protwords.txt to /configs/conf1/protwords.txt
   [junit4]   2> 1168623 INFO  (TEST-SharedFSAutoReplicaFailoverTest.test-seed#[4F7BBC67702012C6]) [     ] o.a.s.c.ZkTestServer put /home/jenkins/jenkins-slave/workspace/Lucene-Solr-BadApples-NightlyTests-8.x/checkout/solr/core/src/test-files/solr/collection1/conf/currency.xml to /configs/conf1/currency.xml
   [junit4]   2> 1168624 INFO  (TEST-SharedFSAutoReplicaFailoverTest.test-seed#[4F7BBC67702012C6]) [     ] o.a.s.c.ZkTestServer put /home/jenkins/jenkins-slave/workspace/Lucene-Solr-BadApples-NightlyTests-8.x/checkout/solr/core/src/test-files/solr/collection1/conf/enumsConfig.xml to /configs/conf1/enumsConfig.xml
   [junit4]   2> 1168626 INFO  (TEST-SharedFSAutoReplicaFailoverTest.test-seed#[4F7BBC67702012C6]) [     ] o.a.s.c.ZkTestServer put /home/jenkins/jenkins-slave/workspace/Lucene-Solr-BadApples-NightlyTests-8.x/checkout/solr/core/src/test-files/solr/collection1/conf/open-exchange-rates.json to /configs/conf1/open-exchange-rates.json
   [junit4]   2> 1168647 INFO  (TEST-SharedFSAutoReplicaFailoverTest.test-seed#[4F7BBC67702012C6]) [     ] o.a.s.c.ZkTestServer put /home/jenkins/jenkins-slave/workspace/Lucene-Solr-BadApples-NightlyTests-8.x/checkout/solr/core/src/test-files/solr/collection1/conf/mapping-ISOLatin1Accent.txt to /configs/conf1/mapping-ISOLatin1Accent.txt
   [junit4]   2> 1168649 INFO  (TEST-SharedFSAutoReplicaFailoverTest.test-seed#[4F7BBC67702012C6]) [     ] o.a.s.c.ZkTestServer put /home/jenkins/jenkins-slave/workspace/Lucene-Solr-BadApples-NightlyTests-8.x/checkout/solr/core/src/test-files/solr/collection1/conf/old_synonyms.txt to /configs/conf1/old_synonyms.txt
   [junit4]   2> 1168650 INFO  (TEST-SharedFSAutoReplicaFailoverTest.test-seed#[4F7BBC67702012C6]) [     ] o.a.s.c.ZkTestServer put /home/jenkins/jenkins-slave/workspace/Lucene-Solr-BadApples-NightlyTests-8.x/checkout/solr/core/src/test-files/solr/collection1/conf/synonyms.txt to /configs/conf1/synonyms.txt
   [junit4]   2> 1168663 INFO  (TEST-SharedFSAutoReplicaFailoverTest.test-seed#[4F7BBC67702012C6]) [     ] o.a.s.c.AbstractFullDistribZkTestBase Will use NRT replicas unless explicitly asked otherwise
   [junit4]   2> 1170124 WARN  (TEST-SharedFSAutoReplicaFailoverTest.test-seed#[4F7BBC67702012C6]) [     ] o.e.j.s.AbstractConnector Ignoring deprecated socket close linger time
   [junit4]   2> 1170124 INFO  (TEST-SharedFSAutoReplicaFailoverTest.test-seed#[4F7BBC67702012C6]) [     ] o.a.s.c.s.e.JettySolrRunner Start Jetty (original configured port=0)
   [junit4]   2> 1170124 INFO  (TEST-SharedFSAutoReplicaFailoverTest.test-seed#[4F7BBC67702012C6]) [     ] o.a.s.c.s.e.JettySolrRunner Trying to start Jetty on port 0 try number 1 ...
   [junit4]   2> 1170137 INFO  (TEST-SharedFSAutoReplicaFailoverTest.test-seed#[4F7BBC67702012C6]) [     ] o.e.j.s.Server jetty-9.4.19.v20190610; built: 2019-06-10T16:30:51.723Z; git: afcf563148970e98786327af5e07c261fda175d3; jvm 1.8.0_191-b12
   [junit4]   2> 1170138 INFO  (TEST-SharedFSAutoReplicaFailoverTest.test-seed#[4F7BBC67702012C6]) [     ] o.e.j.s.session DefaultSessionIdManager workerName=node0
   [junit4]   2> 1170138 INFO  (TEST-SharedFSAutoReplicaFailoverTest.test-seed#[4F7BBC67702012C6]) [     ] o.e.j.s.session No SessionScavenger set, using defaults
   [junit4]   2> 1170138 INFO  (TEST-SharedFSAutoReplicaFailoverTest.test-seed#[4F7BBC67702012C6]) [     ] o.e.j.s.session node0 Scavenging every 660000ms
   [junit4]   2> 1170138 INFO  (TEST-SharedFSAutoReplicaFailoverTest.test-seed#[4F7BBC67702012C6]) [     ] o.e.j.s.h.ContextHandler Started o.e.j.s.ServletContextHandler@1fbd4846{/,null,AVAILABLE}
   [junit4]   2> 1170157 INFO  (TEST-SharedFSAutoReplicaFailoverTest.test-seed#[4F7BBC67702012C6]) [     ] o.e.j.s.AbstractConnector Started ServerConnector@75149d46{HTTP/1.1,[http/1.1, h2c]}{127.0.0.1:44299}
   [junit4]   2> 1170157 INFO  (TEST-SharedFSAutoReplicaFailoverTest.test-seed#[4F7BBC67702012C6]) [     ] o.e.j.s.Server Started @1170217ms
   [junit4]   2> 1170157 INFO  (TEST-SharedFSAutoReplicaFailoverTest.test-seed#[4F7BBC67702012C6]) [     ] o.a.s.c.s.e.JettySolrRunner Jetty properties: {replicaType=NRT, hostContext=/, hostPort=44299, coreRootDirectory=/home/jenkins/jenkins-slave/workspace/Lucene-Solr-BadApples-NightlyTests-8.x/checkout/solr/build/solr-core/test/J0/temp/solr.cloud.SharedFSAutoReplicaFailoverTest_4F7BBC67702012C6-001/control-001/cores}
   [junit4]   2> 1170158 ERROR (TEST-SharedFSAutoReplicaFailoverTest.test-seed#[4F7BBC67702012C6]) [     ] o.a.s.u.StartupLoggingUtils Missing Java Option solr.log.dir. Logging may be missing or incomplete.
   [junit4]   2> 1170158 INFO  (TEST-SharedFSAutoReplicaFailoverTest.test-seed#[4F7BBC67702012C6]) [     ] o.a.s.s.SolrDispatchFilter Using logger factory org.apache.logging.slf4j.Log4jLoggerFactory
   [junit4]   2> 1170158 INFO  (TEST-SharedFSAutoReplicaFailoverTest.test-seed#[4F7BBC67702012C6]) [     ] o.a.s.s.SolrDispatchFilter  ___      _       Welcome to Apache Solr™ version 8.2.0
   [junit4]   2> 1170158 INFO  (TEST-SharedFSAutoReplicaFailoverTest.test-seed#[4F7BBC67702012C6]) [     ] o.a.s.s.SolrDispatchFilter / __| ___| |_ _   Starting in cloud mode on port null
   [junit4]   2> 1170158 INFO  (TEST-SharedFSAutoReplicaFailoverTest.test-seed#[4F7BBC67702012C6]) [     ] o.a.s.s.SolrDispatchFilter \__ \/ _ \ | '_|  Install dir: null
   [junit4]   2> 1170158 INFO  (TEST-SharedFSAutoReplicaFailoverTest.test-seed#[4F7BBC67702012C6]) [     ] o.a.s.s.SolrDispatchFilter |___/\___/_|_|    Start time: 2019-07-05T23:49:54.594Z
   [junit4]   2> 1170197 INFO  (TEST-SharedFSAutoReplicaFailoverTest.test-seed#[4F7BBC67702012C6]) [     ] o.a.s.c.c.ConnectionManager Waiting for client to connect to ZooKeeper
   [junit4]   2> 1170355 INFO  (zkConnectionManagerCallback-2204-thread-1) [     ] o.a.s.c.c.ConnectionManager zkClient has connected
   [junit4]   2> 1170367 INFO  (TEST-SharedFSAutoReplicaFailoverTest.test-seed#[4F7BBC67702012C6]) [     ] o.a.s.c.c.ConnectionManager Client is connected to ZooKeeper
   [junit4]   2> 1170505 INFO  (TEST-SharedFSAutoReplicaFailoverTest.test-seed#[4F7BBC67702012C6]) [     ] o.a.s.s.SolrDispatchFilter Loading solr.xml from SolrHome (not found in ZooKeeper)
   [junit4]   2> 1170505 INFO  (TEST-SharedFSAutoReplicaFailoverTest.test-seed#[4F7BBC67702012C6]) [     ] o.a.s.c.SolrXmlConfig Loading container configuration from /home/jenkins/jenkins-slave/workspace/Lucene-Solr-BadApples-NightlyTests-8.x/checkout/solr/build/solr-core/test/J0/temp/solr.cloud.SharedFSAutoReplicaFailoverTest_4F7BBC67702012C6-001/control-001/solr.xml
   [junit4]   2> 1170509 INFO  (TEST-SharedFSAutoReplicaFailoverTest.test-seed#[4F7BBC67702012C6]) [     ] o.a.s.c.SolrXmlConfig Configuration parameter autoReplicaFailoverWorkLoopDelay is ignored
   [junit4]   2> 1170509 INFO  (TEST-SharedFSAutoReplicaFailoverTest.test-seed#[4F7BBC67702012C6]) [     ] o.a.s.c.SolrXmlConfig Configuration parameter autoReplicaFailoverBadNodeExpiration is ignored
   [junit4]   2> 1170529 INFO  (TEST-SharedFSAutoReplicaFailoverTest.test-seed#[4F7BBC67702012C6]) [     ] o.a.s.c.SolrXmlConfig MBean server found: com.sun.jmx.mbeanserver.JmxMBeanServer@411f5ee4, but no JMX reporters were configured - adding default JMX reporter.
   [junit4]   2> 1171142 INFO  (TEST-SharedFSAutoReplicaFailoverTest.test-seed#[4F7BBC67702012C6]) [     ] o.a.s.h.c.HttpShardHandlerFactory Host whitelist initialized: WhitelistHostChecker [whitelistHosts=null, whitelistHostCheckingEnabled=false]
   [junit4]   2> 1171162 WARN  (TEST-SharedFSAutoReplicaFailoverTest.test-seed#[4F7BBC67702012C6]) [     ] o.e.j.u.s.S.config Trusting all certificates configured for Client@4572c130[provider=null,keyStore=null,trustStore=null]
   [junit4]   2> 1171162 WARN  (TEST-SharedFSAutoReplicaFailoverTest.test-seed#[4F7BBC67702012C6]) [     ] o.e.j.u.s.S.config No Client EndPointIdentificationAlgorithm configured for Client@4572c130[provider=null,keyStore=null,trustStore=null]
   [junit4]   2> 1171182 WARN  (TEST-SharedFSAutoReplicaFailoverTest.test-seed#[4F7BBC67702012C6]) [     ] o.e.j.u.s.S.config Trusting all certificates configured for Client@1443147e[provider=null,keyStore=null,trustStore=null]
   [junit4]   2> 1171182 WARN  (TEST-SharedFSAutoReplicaFailoverTest.test-seed#[4F7BBC67702012C6]) [     ] o.e.j.u.s.S.config No Client EndPointIdentificationAlgorithm configured for Client@1443147e[provider=null,keyStore=null,trustStore=null]
   [junit4]   2> 1171183 INFO  (TEST-SharedFSAutoReplicaFailoverTest.test-seed#[4F7BBC67702012C6]) [     ] o.a.s.c.ZkContainer Zookeeper client=127.0.0.1:33195/solr
   [junit4]   2> 1171184 INFO  (TEST-SharedFSAutoReplicaFailoverTest.test-seed#[4F7BBC67702012C6]) [     ] o.a.s.c.c.ConnectionManager Waiting for client to connect to ZooKeeper
   [junit4]   2> 1171207 INFO  (zkConnectionManagerCallback-2211-thread-1) [     ] o.a.s.c.c.ConnectionManager zkClient has connected
   [junit4]   2> 1171208 INFO  (TEST-SharedFSAutoReplicaFailoverTest.test-seed#[4F7BBC67702012C6]) [     ] o.a.s.c.c.ConnectionManager Client is connected to ZooKeeper
   [junit4]   2> 1171327 INFO  (TEST-SharedFSAutoReplicaFailoverTest.test-seed#[4F7BBC67702012C6]) [n:127.0.0.1:44299_     ] o.a.s.c.c.ConnectionManager Waiting for client to connect to ZooKeeper
   [junit4]   2> 1171345 INFO  (zkConnectionManagerCallback-2213-thread-1) [     ] o.a.s.c.c.ConnectionManager zkClient has connected
   [junit4]   2> 1171345 INFO  (TEST-SharedFSAutoReplicaFailoverTest.test-seed#[4F7BBC67702012C6]) [n:127.0.0.1:44299_     ] o.a.s.c.c.ConnectionManager Client is connected to ZooKeeper
   [junit4]   2> 1171693 INFO  (TEST-SharedFSAutoReplicaFailoverTest.test-seed#[4F7BBC67702012C6]) [n:127.0.0.1:44299_     ] o.a.s.c.OverseerElectionContext I am going to be the leader 127.0.0.1:44299_
   [junit4]   2> 1171694 INFO  (TEST-SharedFSAutoReplicaFailoverTest.test-seed#[4F7BBC67702012C6]) [n:127.0.0.1:44299_     ] o.a.s.c.Overseer Overseer (id=74987577123995652-127.0.0.1:44299_-n_0000000000) starting
   [junit4]   2> 1171740 INFO  (TEST-SharedFSAutoReplicaFailoverTest.test-seed#[4F7BBC67702012C6]) [n:127.0.0.1:44299_     ] o.a.s.c.c.ConnectionManager Waiting for client to connect to ZooKeeper
   [junit4]   2> 1171891 INFO  (zkConnectionManagerCallback-2220-thread-1) [     ] o.a.s.c.c.ConnectionManager zkClient has connected
   [junit4]   2> 1171891 INFO  (TEST-SharedFSAutoReplicaFailoverTest.test-seed#[4F7BBC67702012C6]) [n:127.0.0.1:44299_     ] o.a.s.c.c.ConnectionManager Client is connected to ZooKeeper
   [junit4]   2> 1171893 INFO  (TEST-SharedFSAutoReplicaFailoverTest.test-seed#[4F7BBC67702012C6]) [n:127.0.0.1:44299_     ] o.a.s.c.s.i.ZkClientClusterStateProvider Cluster at 127.0.0.1:33195/solr ready
   [junit4]   2> 1171911 INFO  (OverseerStateUpdate-74987577123995652-127.0.0.1:44299_-n_0000000000) [n:127.0.0.1:44299_     ] o.a.s.c.Overseer Starting to work on the main queue : 127.0.0.1:44299_
   [junit4]   2> 1171963 INFO  (TEST-SharedFSAutoReplicaFailoverTest.test-seed#[4F7BBC67702012C6]) [n:127.0.0.1:44299_     ] o.a.s.c.ZkController Register node as live in ZooKeeper:/live_nodes/127.0.0.1:44299_
   [junit4]   2> 1171964 DEBUG (OverseerAutoScalingTriggerThread-74987577123995652-127.0.0.1:44299_-n_0000000000) [     ] o.a.s.c.a.OverseerTriggerThread Adding .auto_add_replicas and .scheduled_maintenance triggers
   [junit4]   2> 1171965 DEBUG (OverseerAutoScalingTriggerThread-74987577123995652-127.0.0.1:44299_-n_0000000000) [     ] o.a.s.c.a.OverseerTriggerThread Refreshing /autoscaling.json with znode version 1
   [junit4]   2> 1171966 DEBUG (OverseerAutoScalingTriggerThread-74987577123995652-127.0.0.1:44299_-n_0000000000) [     ] o.a.s.c.a.OverseerTriggerThread Current znodeVersion 1, lastZnodeVersion 0
   [junit4]   2> 1171966 DEBUG (OverseerAutoScalingTriggerThread-74987577123995652-127.0.0.1:44299_-n_0000000000) [     ] o.a.s.c.a.OverseerTriggerThread Processed trigger updates upto znodeVersion 1
   [junit4]   2> 1172020 INFO  (zkCallback-2212-thread-1) [     ] o.a.s.c.c.ZkStateReader Updated live nodes from ZooKeeper... (0) -> (1)
   [junit4]   2> 1172020 INFO  (zkCallback-2219-thread-1) [     ] o.a.s.c.c.ZkStateReader Updated live nodes from ZooKeeper... (0) -> (1)
   [junit4]   2> 1172022 DEBUG (OverseerAutoScalingTriggerThread-74987577123995652-127.0.0.1:44299_-n_0000000000) [     ] o.a.s.c.a.NodeLostTrigger NodeLostTrigger .auto_add_replicas - Initial livenodes: [127.0.0.1:44299_]
   [junit4]   2> 1172052 DEBUG (OverseerAutoScalingTriggerThread-74987577123995652-127.0.0.1:44299_-n_0000000000) [     ] o.a.s.c.a.OverseerTriggerThread -- cleaning old nodeLost / nodeAdded markers
   [junit4]   2> 1172057 DEBUG (ScheduledTrigger-2440-thread-1) [     ] o.a.s.c.a.NodeLostTrigger Running NodeLostTrigger: .auto_add_replicas with currently live nodes: 1 and last live nodes: 1
   [junit4]   2> 1172057 DEBUG (OverseerAutoScalingTriggerThread-74987577123995652-127.0.0.1:44299_-n_0000000000) [     ] o.a.s.c.a.OverseerTriggerThread Current znodeVersion 1, lastZnodeVersion 1
   [junit4]   2> 1172247 INFO  (TEST-SharedFSAutoReplicaFailoverTest.test-seed#[4F7BBC67702012C6]) [n:127.0.0.1:44299_     ] o.a.s.h.a.MetricsHistoryHandler No .system collection, keeping metrics history in memory.
   [junit4]   2> 1172409 INFO  (TEST-SharedFSAutoReplicaFailoverTest.test-seed#[4F7BBC67702012C6]) [n:127.0.0.1:44299_     ] o.a.s.m.r.SolrJmxReporter JMX monitoring for 'solr.node' (registry 'solr.node') enabled at server: com.sun.jmx.mbeanserver.JmxMBeanServer@411f5ee4
   [junit4]   2> 1172485 INFO  (TEST-SharedFSAutoReplicaFailoverTest.test-seed#[4F7BBC67702012C6]) [n:127.0.0.1:44299_     ] o.a.s.m.r.SolrJmxReporter JMX monitoring for 'solr.jvm' (registry 'solr.jvm') enabled at server: com.sun.jmx.mbeanserver.JmxMBeanServer@411f5ee4
   [junit4]   2> 1172485 INFO  (TEST-SharedFSAutoReplicaFailoverTest.test-seed#[4F7BBC67702012C6]) [n:127.0.0.1:44299_     ] o.a.s.m.r.SolrJmxReporter JMX monitoring for 'solr.jetty' (registry 'solr.jetty') enabled at server: com.sun.jmx.mbeanserver.JmxMBeanServer@411f5ee4
   [junit4]   2> 1172519 INFO  (TEST-SharedFSAutoReplicaFailoverTest.test-seed#[4F7BBC67702012C6]) [n:127.0.0.1:44299_     ] o.a.s.c.CorePropertiesLocator Found 0 core definitions underneath /home/jenkins/jenkins-slave/workspace/Lucene-Solr-BadApples-NightlyTests-8.x/checkout/solr/build/solr-core/test/J0/temp/solr.cloud.SharedFSAutoReplicaFailoverTest_4F7BBC67702012C6-001/control-001/cores
   [junit4]   2> 1172752 INFO  (TEST-SharedFSAutoReplicaFailoverTest.test-seed#[4F7BBC67702012C6]) [     ] o.a.s.c.c.ConnectionManager Waiting for client to connect to ZooKeeper
   [junit4]   2> 1172774 INFO  (zkConnectionManagerCallback-2226-thread-1) [     ] o.a.s.c.c.ConnectionManager zkClient has connected
   [junit4]   2> 1172774 INFO  (TEST-SharedFSAutoReplicaFailoverTest.test-seed#[4F7BBC67702012C6]) [     ] o.a.s.c.c.ConnectionManager Client is connected to ZooKeeper
   [junit4]   2> 1172775 INFO  (TEST-SharedFSAutoReplicaFailoverTest.test-seed#[4F7BBC67702012C6]) [     ] o.a.s.c.c.ZkStateReader Updated live nodes from ZooKeeper... (0) -> (1)
   [junit4]   2> 1172777 INFO  (TEST-SharedFSAutoReplicaFailoverTest.test-seed#[4F7BBC67702012C6]) [     ] o.a.s.c.s.i.ZkClientClusterStateProvider Cluster at 127.0.0.1:33195/solr ready
   [junit4]   2> 1172823 INFO  (qtp234721073-6569) [n:127.0.0.1:44299_     ] o.a.s.h.a.CollectionsHandler Invoked Collection Action :create with params collection.configName=conf1&name=control_collection&nrtReplicas=1&action=CREATE&numShards=1&createNodeSet=127.0.0.1:44299_&wt=javabin&version=2 and sendToOCPQueue=true
   [junit4]   2> 1172940 INFO  (OverseerThreadFactory-2442-thread-1-processing-n:127.0.0.1:44299_) [n:127.0.0.1:44299_     ] o.a.s.c.a.c.CreateCollectionCmd Create collection control_collection
   [junit4]   2> 1173080 DEBUG (ScheduledTrigger-2440-thread-3) [     ] o.a.s.c.a.NodeLostTrigger Running NodeLostTrigger: .auto_add_replicas with currently live nodes: 1 and last live nodes: 1
   [junit4]   2> 1173120 INFO  (qtp234721073-6571) [n:127.0.0.1:44299_    x:control_collection_shard1_replica_n1 ] o.a.s.h.a.CoreAdminOperation core create command qt=/admin/cores&collection.configName=conf1&newCollection=true&name=control_collection_shard1_replica_n1&action=CREATE&numShards=1&collection=control_collection&shard=shard1&wt=javabin&version=2&replicaType=NRT
   [junit4]   2> 1173120 INFO  (qtp234721073-6571) [n:127.0.0.1:44299_    x:control_collection_shard1_replica_n1 ] o.a.s.c.TransientSolrCoreCacheDefault Allocating transient cache for 4 transient cores
   [junit4]   2> 1174082 DEBUG (ScheduledTrigger-2440-thread-2) [     ] o.a.s.c.a.NodeLostTrigger Running NodeLostTrigger: .auto_add_replicas with currently live nodes: 1 and last live nodes: 1
   [junit4]   2> 1174317 INFO  (qtp234721073-6571) [n:127.0.0.1:44299_ c:control_collection s:shard1  x:control_collection_shard1_replica_n1 ] o.a.s.c.SolrConfig Using Lucene MatchVersion: 8.2.0
   [junit4]   2> 1174432 INFO  (qtp234721073-6571) [n:127.0.0.1:44299_ c:control_collection s:shard1  x:control_collection_shard1_replica_n1 ] o.a.s.s.IndexSchema [control_collection_shard1_replica_n1] Schema name=test
   [junit4]   2> 1174840 INFO  (qtp234721073-6571) [n:127.0.0.1:44299_ c:control_collection s:shard1  x:control_collection_shard1_replica_n1 ] o.a.s.s.IndexSchema Loaded schema test/1.6 with uniqueid field id
   [junit4]   2> 1175047 INFO  (qtp234721073-6571) [n:127.0.0.1:44299_ c:control_collection s:shard1  x:control_collection_shard1_replica_n1 ] o.a.s.c.CoreContainer Creating SolrCore 'control_collection_shard1_replica_n1' using configuration from collection control_collection, trusted=true
   [junit4]   2> 1175048 INFO  (qtp234721073-6571) [n:127.0.0.1:44299_ c:control_collection s:shard1  x:control_collection_shard1_replica_n1 ] o.a.s.m.r.SolrJmxReporter JMX monitoring for 'solr.core.control_collection.shard1.replica_n1' (registry 'solr.core.control_collection.shard1.replica_n1') enabled at server: com.sun.jmx.mbeanserver.JmxMBeanServer@411f5ee4
   [junit4]   2> 1175083 DEBUG (ScheduledTrigger-2440-thread-2) [     ] o.a.s.c.a.NodeLostTrigger Running NodeLostTrigger: .auto_add_replicas with currently live nodes: 1 and last live nodes: 1
   [junit4]   2> 1175084 INFO  (qtp234721073-6571) [n:127.0.0.1:44299_ c:control_collection s:shard1  x:control_collection_shard1_replica_n1 ] o.a.s.c.HdfsDirectoryFactory solr.hdfs.home=hdfs://lucene2-us-west.apache.org:37041/solr_hdfs_home
   [junit4]   2> 1175084 INFO  (qtp234721073-6571) [n:127.0.0.1:44299_ c:control_collection s:shard1  x:control_collection_shard1_replica_n1 ] o.a.s.c.HdfsDirectoryFactory Solr Kerberos Authentication disabled
   [junit4]   2> 1175084 INFO  (qtp234721073-6571) [n:127.0.0.1:44299_ c:control_collection s:shard1  x:control_collection_shard1_replica_n1 ] o.a.s.c.SolrCore [[control_collection_shard1_replica_n1] ] Opening new SolrCore at [/home/jenkins/jenkins-slave/workspace/Lucene-Solr-BadApples-NightlyTests-8.x/checkout/solr/build/solr-core/test/J0/temp/solr.cloud.SharedFSAutoReplicaFailoverTest_4F7BBC67702012C6-001/control-001/cores/control_collection_shard1_replica_n1], dataDir=[hdfs://lucene2-us-west.apache.org:37041/solr_hdfs_home/control_collection/core_node2/data/]
   [junit4]   2> 1175085 INFO  (qtp234721073-6571) [n:127.0.0.1:44299_ c:control_collection s:shard1  x:control_collection_shard1_replica_n1 ] o.a.s.c.HdfsDirectoryFactory creating directory factory for path hdfs://lucene2-us-west.apache.org:37041/solr_hdfs_home/control_collection/core_node2/data/snapshot_metadata
   [junit4]   2> 1175215 INFO  (qtp234721073-6571) [n:127.0.0.1:44299_ c:control_collection s:shard1  x:control_collection_shard1_replica_n1 ] o.a.s.c.HdfsDirectoryFactory Number of slabs of block cache [1] with direct memory allocation set to [true]
   [junit4]   2> 1175215 INFO  (qtp234721073-6571) [n:127.0.0.1:44299_ c:control_collection s:shard1  x:control_collection_shard1_replica_n1 ] o.a.s.c.HdfsDirectoryFactory Block cache target memory usage, slab size of [33554432] will allocate [1] slabs and use ~[33554432] bytes
   [junit4]   2> 1175215 INFO  (qtp234721073-6571) [n:127.0.0.1:44299_ c:control_collection s:shard1  x:control_collection_shard1_replica_n1 ] o.a.s.c.HdfsDirectoryFactory Creating new global HDFS BlockCache
   [junit4]   2> 1176083 DEBUG (ScheduledTrigger-2440-thread-4) [     ] o.a.s.c.a.NodeLostTrigger Running NodeLostTrigger: .auto_add_replicas with currently live nodes: 1 and last live nodes: 1
   [junit4]   2> 1177084 DEBUG (ScheduledTrigger-2440-thread-4) [     ] o.a.s.c.a.NodeLostTrigger Running NodeLostTrigger: .auto_add_replicas with currently live nodes: 1 and last live nodes: 1
   [junit4]   2> 1178085 DEBUG (ScheduledTrigger-2440-thread-4) [     ] o.a.s.c.a.NodeLostTrigger Running NodeLostTrigger: .auto_add_replicas with currently live nodes: 1 and last live nodes: 1
   [junit4]   2> 1178807 INFO  (qtp234721073-6571) [n:127.0.0.1:44299_ c:control_collection s:shard1  x:control_collection_shard1_replica_n1 ] o.a.s.s.b.BlockDirectory Block cache on write is disabled
   [junit4]   2> 1178930 INFO  (qtp234721073-6571) [n:127.0.0.1:44299_ c:control_collection s:shard1  x:control_collection_shard1_replica_n1 ] o.a.s.c.HdfsDirectoryFactory creating directory factory for path hdfs://lucene2-us-west.apache.org:37041/solr_hdfs_home/control_collection/core_node2/data
   [junit4]   2> 1179085 DEBUG (ScheduledTrigger-2440-thread-4) [     ] o.a.s.c.a.NodeLostTrigger Running NodeLostTrigger: .auto_add_replicas with currently live nodes: 1 and last live nodes: 1
   [junit4]   2> 1179217 INFO  (qtp234721073-6571) [n:127.0.0.1:44299_ c:control_collection s:shard1  x:control_collection_shard1_replica_n1 ] o.a.s.c.HdfsDirectoryFactory creating directory factory for path hdfs://lucene2-us-west.apache.org:37041/solr_hdfs_home/control_collection/core_node2/data/index
   [junit4]   2> 1179276 INFO  (qtp234721073-6571) [n:127.0.0.1:44299_ c:control_collection s:shard1  x:control_collection_shard1_replica_n1 ] o.a.s.c.HdfsDirectoryFactory Number of slabs of block cache [1] with direct memory allocation set to [true]
   [junit4]   2> 1179276 INFO  (qtp234721073-6571) [n:127.0.0.1:44299_ c:control_collection s:shard1  x:control_collection_shard1_replica_n1 ] o.a.s.c.HdfsDirectoryFactory Block cache target memory usage, slab size of [33554432] will allocate [1] slabs and use ~[33554432] bytes
   [junit4]   2> 1179388 INFO  (qtp234721073-6571) [n:127.0.0.1:44299_ c:control_collection s:shard1  x:control_collection_shard1_replica_n1 ] o.a.s.s.b.BlockDirectory Block cache on write is disabled
   [junit4]   2> 1179389 INFO  (qtp234721073-6571) [n:127.0.0.1:44299_ c:control_collection s:shard1  x:control_collection_shard1_replica_n1 ] o.a.s.u.RandomMergePolicy RandomMergePolicy wrapping class org.apache.lucene.index.LogDocMergePolicy: [LogDocMergePolicy: minMergeSize=1000, mergeFactor=8, maxMergeSize=9223372036854775807, maxMergeSizeForForcedMerge=9223372036854775807, calibrateSizeByDeletes=false, maxMergeDocs=2147483647, maxCFSSegmentSizeMB=8.796093022207999E12, noCFSRatio=1.0]
   [junit4]   2> 1180089 DEBUG (ScheduledTrigger-2440-thread-4) [     ] o.a.s.c.a.NodeLostTrigger Running NodeLostTrigger: .auto_add_replicas with currently live nodes: 1 and last live nodes: 1
   [junit4]   2> 1181150 DEBUG (ScheduledTrigger-2440-thread-4) [     ] o.a.s.c.a.NodeLostTrigger Running NodeLostTrigger: .auto_add_replicas with currently live nodes: 1 and last live nodes: 1
   [junit4]   2> 1181421 WARN  (qtp234721073-6571) [n:127.0.0.1:44299_ c:control_collection s:shard1  x:control_collection_shard1_replica_n1 ] o.a.s.c.RequestHandlers INVALID paramSet a in requestHandler {type = requestHandler,name = /dump,class = DumpRequestHandler,attributes = {initParams=a, name=/dump, class=DumpRequestHandler},args = {defaults={a=A,b=B}}}
   [junit4]   2> 1181775 INFO  (qtp234721073-6571) [n:127.0.0.1:44299_ c:control_collection s:shard1  x:control_collection_shard1_replica_n1 ] o.a.s.u.UpdateHandler Using UpdateLog implementation: org.apache.solr.update.HdfsUpdateLog
   [junit4]   2> 1181775 INFO  (qtp234721073-6571) [n:127.0.0.1:44299_ c:control_collection s:shard1  x:control_collection_shard1_replica_n1 ] o.a.s.u.UpdateLog Initializing UpdateLog: dataDir= defaultSyncLevel=FLUSH numRecordsToKeep=100 maxNumLogsToKeep=10 numVersionBuckets=65536
   [junit4]   2> 1181775 INFO  (qtp234721073-6571) [n:127.0.0.1:44299_ c:control_collection s:shard1  x:control_collection_shard1_replica_n1 ] o.a.s.u.HdfsUpdateLog Initializing HdfsUpdateLog: tlogDfsReplication=2
   [junit4]   2> 1181909 INFO  (qtp234721073-6571) [n:127.0.0.1:44299_ c:control_collection s:shard1  x:control_collection_shard1_replica_n1 ] o.a.s.u.CommitTracker Hard AutoCommit: disabled
   [junit4]   2> 1181909 INFO  (qtp234721073-6571) [n:127.0.0.1:44299_ c:control_collection s:shard1  x:control_collection_shard1_replica_n1 ] o.a.s.u.CommitTracker Soft AutoCommit: disabled
   [junit4]   2> 1181917 INFO  (qtp234721073-6571) [n:127.0.0.1:44299_ c:control_collection s:shard1  x:control_collection_shard1_replica_n1 ] o.a.s.u.RandomMergePolicy RandomMergePolicy wrapping class org.apache.lucene.index.TieredMergePolicy: [TieredMergePolicy: maxMergeAtOnce=22, maxMergeAtOnceExplicit=43, maxMergedSegmentMB=58.5478515625, floorSegmentMB=2.1572265625, forceMergeDeletesPctAllowed=12.29141053980573, segmentsPerTier=47.0, maxCFSSegmentSizeMB=8.796093022207999E12, noCFSRatio=1.0, deletesPctAllowed=42.46567006133326
   [junit4]   2> 1182159 DEBUG (ScheduledTrigger-2440-thread-4) [     ] o.a.s.c.a.NodeLostTrigger Running NodeLostTrigger: .auto_add_replicas with currently live nodes: 1 and last live nodes: 1
   [junit4]   2> 1182533 INFO  (qtp234721073-6571) [n:127.0.0.1:44299_ c:control_collection s:shard1  x:control_collection_shard1_replica_n1 ] o.a.s.s.SolrIndexSearcher Opening [Searcher@82e3d65[control_collection_shard1_replica_n1] main]
   [junit4]   2> 1182535 INFO  (qtp234721073-6571) [n:127.0.0.1:44299_ c:control_collection s:shard1  x:control_collection_shard1_replica_n1 ] o.a.s.r.ManagedResourceStorage Configured ZooKeeperStorageIO with znodeBase: /configs/conf1
   [junit4]   2> 1182548 INFO  (qtp234721073-6571) [n:127.0.0.1:44299_ c:control_collection s:shard1  x:control_collection_shard1_replica_n1 ] o.a.s.r.ManagedResourceStorage Loaded null at path _rest_managed.json using ZooKeeperStorageIO:path=/configs/conf1
   [junit4]   2> 1182588 INFO  (qtp234721073-6571) [n:127.0.0.1:44299_ c:control_collection s:shard1  x:control_collection_shard1_replica_n1 ] o.a.s.h.ReplicationHandler Commits will be reserved for 10000ms.
   [junit4]   2> 1182631 INFO  (qtp234721073-6571) [n:127.0.0.1:44299_ c:control_collection s:shard1  x:control_collection_shard1_replica_n1 ] o.a.s.u.UpdateLog Could not find max version in index or recent updates, using new clock 1638264321675886592
   [junit4]   2> 1182647 INFO  (searcherExecutor-2447-thread-1-processing-n:127.0.0.1:44299_ x:control_collection_shard1_replica_n1 c:control_collection s:shard1) [n:127.0.0.1:44299_ c:control_collection s:shard1  x:control_collection_shard1_replica_n1 ] o.a.s.c.SolrCore [control_collection_shard1_replica_n1] Registered new searcher Searcher@82e3d65[control_collection_shard1_replica_n1] main{ExitableDirectoryReader(UninvertingDirectoryReader())}
   [junit4]   2> 1182739 INFO  (qtp234721073-6571) [n:127.0.0.1:44299_ c:control_collection s:shard1  x:control_collection_shard1_replica_n1 ] o.a.s.c.ZkShardTerms Successful update of terms at /collections/control_collection/terms/shard1 to Terms{values={core_node2=0}, version=0}
   [junit4]   2> 1182739 INFO  (qtp234721073-6571) [n:127.0.0.1:44299_ c:control_collection s:shard1  x:control_collection_shard1_replica_n1 ] o.a.s.c.ShardLeaderElectionContextBase make sure parent is created /collections/control_collection/leaders/shard1
   [junit4]   2> 1182799 INFO  (qtp234721073-6571) [n:127.0.0.1:44299_ c:control_collection s:shard1  x:control_collection_shard1_replica_n1 ] o.a.s.c.ShardLeaderElectionContext Enough replicas found to continue.
   [junit4]   2> 1182799 INFO  (qtp234721073-6571) [n:127.0.0.1:44299_ c:control_collection s:shard1  x:control_collection_shard1_replica_n1 ] o.a.s.c.ShardLeaderElectionContext I may be the new leader - try and sync
   [junit4]   2> 1182799 INFO  (qtp234721073-6571) [n:127.0.0.1:44299_ c:control_collection s:shard1  x:control_collection_shard1_replica_n1 ] o.a.s.c.SyncStrategy Sync replicas to http://127.0.0.1:44299/control_collection_shard1_replica_n1/
   [junit4]   2> 1182823 INFO  (qtp234721073-6571) [n:127.0.0.1:44299_ c:control_collection s:shard1  x:control_collection_shard1_replica_n1 ] o.a.s.c.SyncStrategy Sync Success - now sync replicas to me
   [junit4]   2> 1182843 INFO  (qtp234721073-6571) [n:127.0.0.1:44299_ c:control_collection s:shard1  x:control_collection_shard1_replica_n1 ] o.a.s.c.SyncStrategy http://127.0.0.1:44299/control_collection_shard1_replica_n1/ has no replicas
   [junit4]   2> 1182859 INFO  (qtp234721073-6571) [n:127.0.0.1:44299_ c:control_collection s:shard1  x:control_collection_shard1_replica_n1 ] o.a.s.c.ShardLeaderElectionContextBase Creating leader registration node /collections/control_collection/leaders/shard1/leader after winning as /collections/control_collection/leader_elect/shard1/election/74987577123995652-core_node2-n_0000000000
   [junit4]   2> 1182901 INFO  (qtp234721073-6571) [n:127.0.0.1:44299_ c:control_collection s:shard1  x:control_collection_shard1_replica_n1 ] o.a.s.c.ShardLeaderElectionContext I am the new leader: http://127.0.0.1:44299/control_collection_shard1_replica_n1/ shard1
   [junit4]   2> 1182902 INFO  (zkCallback-2212-thread-1) [     ] o.a.s.c.c.ZkStateReader A cluster state change: [WatchedEvent state:SyncConnected type:NodeDataChanged path:/collections/control_collection/state.json] for collection [control_collection] has occurred - updating... (live nodes size: [1])
   [junit4]   2> 1182903 INFO  (qtp234721073-6571) [n:127.0.0.1:44299_ c:control_collection s:shard1  x:control_collection_shard1_replica_n1 ] o.a.s.c.ZkController I am the leader, no recovery necessary
   [junit4]   2> 1182937 INFO  (qtp234721073-6571) [n:127.0.0.1:44299_ c:control_collection s:shard1  x:control_collection_shard1_replica_n1 ] o.a.s.s.HttpSolrCall [admin] webapp=null path=/admin/cores params={qt=/admin/cores&collection.configName=conf1&newCollection=true&name=control_collection_shard1_replica_n1&action=CREATE&numShards=1&collection=control_collection&shard=shard1&wt=javabin&version=2&replicaType=NRT} status=0 QTime=9817
   [junit4]   2> 1183030 INFO  (zkCallback-2212-thread-2) [     ] o.a.s.c.c.ZkStateReader A cluster state change: [WatchedEvent state:SyncConnected type:NodeDataChanged path:/collections/control_collection/state.json] for collection [control_collection] has occurred - updating... (live nodes size: [1])
   [junit4]   2> 1183068 INFO  (qtp234721073-6569) [n:127.0.0.1:44299_     ] o.a.s.h.a.CollectionsHandler Wait for new collection to be active for at most 45 seconds. Check all shard replicas
   [junit4]   2> 1183169 INFO  (zkCallback-2212-thread-2) [     ] o.a.s.c.c.ZkStateReader A cluster state change: [WatchedEvent state:SyncConnected type:NodeDataChanged path:/collections/control_collection/state.json] for collection [control_collection] has occurred - updating... (live nodes size: [1])
   [junit4]   2> 1183170 INFO  (qtp234721073-6569) [n:127.0.0.1:44299_     ] o.a.s.s.HttpSolrCall [admin] webapp=null path=/admin/collections params={collection.configName=conf1&name=control_collection&nrtReplicas=1&action=CREATE&numShards=1&createNodeSet=127.0.0.1:44299_&wt=javabin&version=2} status=0 QTime=10347
   [junit4]   2> 1183171 INFO  (zkCallback-2212-thread-1) [     ] o.a.s.c.c.ZkStateReader A cluster state change: [WatchedEvent state:SyncConnected type:NodeDataChanged path:/collections/control_collection/state.json] for collection [control_collection] has occurred - updating... (live nodes size: [1])
   [junit4]   2> 1183176 DEBUG (ScheduledTrigger-2440-thread-4) [     ] o.a.s.c.a.NodeLostTrigger Running NodeLostTrigger: .auto_add_replicas with currently live nodes: 1 and last live nodes: 1
   [junit4]   2> 1183184 INFO  (zkCallback-2212-thread-3) [     ] o.a.s.c.c.ZkStateReader A cluster state change: [WatchedEvent state:SyncConnected type:NodeDataChanged path:/collections/control_collection/state.json] for collection [control_collection] has occurred - updating... (live nodes size: [1])
   [junit4]   2> 1183520 INFO  (TEST-SharedFSAutoReplicaFailoverTest.test-seed#[4F7BBC67702012C6]) [     ] o.a.s.c.c.ConnectionManager Waiting for client to connect to ZooKeeper
   [junit4]   2> 1183609 INFO  (zkConnectionManagerCallback-2232-thread-1) [     ] o.a.s.c.c.ConnectionManager zkClient has connected
   [junit4]   2> 1183613 INFO  (TEST-SharedFSAutoReplicaFailoverTest.test-seed#[4F7BBC67702012C6]) [     ] o.a.s.c.c.ConnectionManager Client is connected to ZooKeeper
   [junit4]   2> 1183614 INFO  (TEST-SharedFSAutoReplicaFailoverTest.test-seed#[4F7BBC67702012C6]) [     ] o.a.s.c.c.ZkStateReader Updated live nodes from ZooKeeper... (0) -> (1)
   [junit4]   2> 1183615 INFO  (TEST-SharedFSAutoReplicaFailoverTest.test-seed#[4F7BBC67702012C6]) [     ] o.a.s.c.s.i.ZkClientClusterStateProvider Cluster at 127.0.0.1:33195/solr ready
   [junit4]   2> 1183615 INFO  (TEST-SharedFSAutoReplicaFailoverTest.test-seed#[4F7BBC67702012C6]) [     ] o.a.s.c.ChaosMonkey monkey: init - expire sessions:false cause connection loss:false
   [junit4]   2> 1183616 INFO  (qtp234721073-6571) [n:127.0.0.1:44299_     ] o.a.s.h.a.CollectionsHandler Invoked Collection Action :create with params collection.configName=conf1&name=collection1&nrtReplicas=1&action=CREATE&numShards=2&createNodeSet=&stateFormat=2&wt=javabin&version=2 and sendToOCPQueue=true
   [junit4]   2> 1183715 INFO  (OverseerThreadFactory-2442-thread-2-processing-n:127.0.0.1:44299_) [n:127.0.0.1:44299_     ] o.a.s.c.a.c.CreateCollectionCmd Create collection collection1
   [junit4]   2> 1184019 WARN  (OverseerThreadFactory-2442-thread-2-processing-n:127.0.0.1:44299_) [n:127.0.0.1:44299_     ] o.a.s.c.a.c.CreateCollectionCmd It is unusual to create a collection (collection1) without cores.
   [junit4]   2> 1184035 INFO  (qtp234721073-6571) [n:127.0.0.1:44299_     ] o.a.s.h.a.CollectionsHandler Wait for new collection to be active for at most 45 seconds. Check all shard replicas
   [junit4]   2> 1184037 INFO  (qtp234721073-6571) [n:127.0.0.1:44299_     ] o.a.s.s.HttpSolrCall [admin] webapp=null path=/admin/collections params={collection.configName=conf1&name=collection1&nrtReplicas=1&action=CREATE&numShards=2&createNodeSet=&stateFormat=2&wt=javabin&version=2} status=0 QTime=421
   [junit4]   2> 1184122 INFO  (TEST-SharedFSAutoReplicaFailoverTest.test-seed#[4F7BBC67702012C6]) [     ] o.a.s.c.AbstractFullDistribZkTestBase Creating jetty instances pullReplicaCount=0 numOtherReplicas=4
   [junit4]   2> 1184208 DEBUG (ScheduledTrigger-2440-thread-2) [     ] o.a.s.c.a.NodeLostTrigger Running NodeLostTrigger: .auto_add_replicas with currently live nodes: 1 and last live nodes: 1
   [junit4]   2> 1184804 INFO  (TEST-SharedFSAutoReplicaFailoverTest.test-seed#[4F7BBC67702012C6]) [     ] o.a.s.c.AbstractFullDistribZkTestBase create jetty 1 in directory /home/jenkins/jenkins-slave/workspace/Lucene-Solr-BadApples-NightlyTests-8.x/checkout/solr/build/solr-core/test/J0/temp/solr.cloud.SharedFSAutoReplicaFailoverTest_4F7BBC67702012C6-001/shard-1-001 of type NRT
   [junit4]   2> 1184805 WARN  (closeThreadPool-2233-thread-1) [     ] o.e.j.s.AbstractConnector Ignoring deprecated socket close linger time
   [junit4]   2> 1184824 INFO  (closeThreadPool-2233-thread-1) [     ] o.a.s.c.s.e.JettySolrRunner Start Jetty (original configured port=0)
   [junit4]   2> 1184825 INFO  (closeThreadPool-2233-thread-1) [     ] o.a.s.c.s.e.JettySolrRunner Trying to start Jetty on port 0 try number 1 ...
   [junit4]   2> 1184825 INFO  (closeThreadPool-2233-thread-1) [     ] o.e.j.s.Server jetty-9.4.19.v20190610; built: 2019-06-10T16:30:51.723Z; git: afcf563148970e98786327af5e07c261fda175d3; jvm 1.8.0_191-b12
   [junit4]   2> 1184918 INFO  (TEST-SharedFSAutoReplicaFailoverTest.test-seed#[4F7BBC67702012C6]) [     ] o.a.s.c.AbstractFullDistribZkTestBase create jetty 2 in directory /home/jenkins/jenkins-slave/workspace/Lucene-Solr-BadApples-NightlyTests-8.x/checkout/solr/build/solr-core/test/J0/temp/solr.cloud.SharedFSAutoReplicaFailoverTest_4F7BBC67702012C6-001/shard-2-001 of type NRT
   [junit4]   2> 1184919 INFO  (closeThreadPool-2233-thread-1) [     ] o.e.j.s.session DefaultSessionIdManager workerName=node0
   [junit4]   2> 1184919 INFO  (closeThreadPool-2233-thread-1) [     ] o.e.j.s.session No SessionScavenger set, using defaults
   [junit4]   2> 1184919 INFO  (closeThreadPool-2233-thread-1) [     ] o.e.j.s.session node0 Scavenging every 600000ms
   [junit4]   2> 1184919 INFO  (closeThreadPool-2233-thread-1) [     ] o.e.j.s.h.ContextHandler Started o.e.j.s.ServletContextHandler@4d5fd519{/,null,AVAILABLE}
   [junit4]   2> 1184920 INFO  (closeThreadPool-2233-thread-1) [     ] o.e.j.s.AbstractConnector Started ServerConnector@e0ac343{HTTP/1.1,[http/1.1, h2c]}{127.0.0.1:33923}
   [junit4]   2> 1184920 INFO  (closeThreadPool-2233-thread-1) [     ] o.e.j.s.Server Started @1184980ms
   [junit4]   2> 1184920 INFO  (closeThreadPool-2233-thread-1) [     ] o.a.s.c.s.e.JettySolrRunner Jetty properties: {solrconfig=solrconfig.xml, hostContext=/, hostPort=33923, coreRootDirectory=/home/jenkins/jenkins-slave/workspace/Lucene-Solr-BadApples-NightlyTests-8.x/checkout/solr/build/solr-core/test/J0/../../../../../../../../../../../home/jenkins/jenkins-slave/workspace/Lucene-Solr-BadApples-NightlyTests-8.x/checkout/solr/build/solr-core/test/J0/temp/solr.cloud.SharedFSAutoReplicaFailoverTest_4F7BBC67702012C6-001/shard-1-001/cores}
   [junit4]   2> 1184920 ERROR (closeThreadPool-2233-thread-1) [     ] o.a.s.u.StartupLoggingUtils Missing Java Option solr.log.dir. Logging may be missing or incomplete.
   [junit4]   2> 1184920 INFO  (closeThreadPool-2233-thread-1) [     ] o.a.s.s.SolrDispatchFilter Using logger factory org.apache.logging.slf4j.Log4jLoggerFactory
   [junit4]   2> 1184920 INFO  (closeThreadPool-2233-thread-1) [     ] o.a.s.s.SolrDispatchFilter  ___      _       Welcome to Apache Solr™ version 8.2.0
   [junit4]   2> 1184920 INFO  (closeThreadPool-2233-thread-1) [     ] o.a.s.s.SolrDispatchFilter / __| ___| |_ _   Starting in cloud mode on port null
   [junit4]   2> 1184920 INFO  (closeThreadPool-2233-thread-1) [     ] o.a.s.s.SolrDispatchFilter \__ \/ _ \ | '_|  Install dir: null
   [junit4]   2> 1184920 INFO  (closeThreadPool-2233-thread-1) [     ] o.a.s.s.SolrDispatchFilter |___/\___/_|_|    Start time: 2019-07-05T23:50:09.356Z
   [junit4]   2> 1184921 INFO  (closeThreadPool-2233-thread-1) [     ] o.a.s.c.c.ConnectionManager Waiting for client to connect to ZooKeeper
   [junit4]   2> 1184947 WARN  (closeThreadPool-2233-thread-2) [     ] o.e.j.s.AbstractConnector Ignoring deprecated socket close linger time
   [junit4]   2> 1184948 INFO  (closeThreadPool-2233-thread-2) [     ] o.a.s.c.s.e.JettySolrRunner Start Jetty (original configured port=0)
   [junit4]   2> 1184948 INFO  (closeThreadPool-2233-thread-2) [     ] o.a.s.c.s.e.JettySolrRunner Trying to start Jetty on port 0 try number 1 ...
   [junit4]   2> 1184948 INFO  (closeThreadPool-2233-thread-2) [     ] o.e.j.s.Server jetty-9.4.19.v20190610; built: 2019-06-10T16:30:51.723Z; git: afcf563148970e98786327af5e07c261fda175d3; jvm 1.8.0_191-b12
   [junit4]   2> 1184948 INFO  (zkConnectionManagerCallback-2235-thread-1) [     ] o.a.s.c.c.ConnectionManager zkClient has connected
   [junit4]   2> 1184948 INFO  (closeThreadPool-2233-thread-1) [     ] o.a.s.c.c.ConnectionManager Client is connected to ZooKeeper
   [junit4]   2> 1184989 INFO  (closeThreadPool-2233-thread-2) [     ] o.e.j.s.session DefaultSessionIdManager workerName=node0
   [junit4]   2> 1184989 INFO  (closeThreadPool-2233-thread-2) [     ] o.e.j.s.session No SessionScavenger set, using defaults
   [junit4]   2> 1184990 INFO  (closeThreadPool-2233-thread-2) [     ] o.e.j.s.session node0 Scavenging every 600000ms
   [junit4]   2> 1184990 INFO  (closeThreadPool-2233-thread-2) [     ] o.e.j.s.h.ContextHandler Started o.e.j.s.ServletContextHandler@3b7e7379{/,null,AVAILABLE}
   [junit4]   2> 1184991 INFO  (closeThreadPool-2233-thread-2) [     ] o.e.j.s.AbstractConnector Started ServerConnector@7c5d8dca{HTTP/1.1,[http/1.1, h2c]}{127.0.0.1:37578}
   [junit4]   2> 1184991 INFO  (closeThreadPool-2233-thread-2) [     ] o.e.j.s.Server Started @1185051ms
   [junit4]   2> 1184991 INFO  (closeThreadPool-2233-thread-2) [     ] o.a.s.c.s.e.JettySolrRunner Jetty properties: {solrconfig=solrconfig.xml, hostContext=/, hostPort=37578, coreRootDirectory=/home/jenkins/jenkins-slave/workspace/Lucene-Solr-BadApples-NightlyTests-8.x/checkout/solr/build/solr-core/test/J0/../../../../../../../../../../../home/jenkins/jenkins-slave/workspace/Lucene-Solr-BadApples-NightlyTests-8.x/checkout/solr/build/solr-core/test/J0/temp/solr.cloud.SharedFSAutoReplicaFailoverTest_4F7BBC67702012C6-001/shard-2-001/cores}
   [junit4]   2> 1184993 ERROR (closeThreadPool-2233-thread-2) [     ] o.a.s.u.StartupLoggingUtils Missing Java Option solr.log.dir. Logging may be missing or incomplete.
   [junit4]   2> 1184993 INFO  (closeThreadPool-2233-thread-2) [     ] o.a.s.s.SolrDispatchFilter Using logger factory org.apache.logging.slf4j.Log4jLoggerFactory
   [junit4]   2> 1184993 INFO  (closeThreadPool-2233-thread-2) [     ] o.a.s.s.SolrDispatchFilter  ___      _       Welcome to Apache Solr™ version 8.2.0
   [junit4]   2> 1184993 INFO  (closeThreadPool-2233-thread-2) [     ] o.a.s.s.SolrDispatchFilter / __| ___| |_ _   Starting in cloud mode on port null
   [junit4]   2> 1184993 INFO  (closeThreadPool-2233-thread-2) [     ] o.a.s.s.SolrDispatchFilter \__ \/ _ \ | '_|  Install dir: null
   [junit4]   2> 1184993 INFO  (closeThreadPool-2233-thread-2) [     ] o.a.s.s.SolrDispatchFilter |___/\___/_|_|    Start time: 2019-07-05T23:50:09.429Z
   [junit4]   2> 1185012 INFO  (closeThreadPool-2233-thread-2) [     ] o.a.s.c.c.ConnectionManager Waiting for client to connect to ZooKeeper
   [junit4]   2> 1185034 INFO  (zkConnectionManagerCallback-2237-thread-1) [     ] o.a.s.c.c.ConnectionManager zkClient has connected
   [junit4]   2> 1185034 INFO  (closeThreadPool-2233-thread-2) [     ] o.a.s.c.c.ConnectionManager Client is connected to ZooKeeper
   [junit4]   2> 1185060 INFO  (closeThreadPool-2233-thread-1) [     ] o.a.s.s.SolrDispatchFilter Loading solr.xml from SolrHome (not found in ZooKeeper)
   [junit4]   2> 1185060 INFO  (closeThreadPool-2233-thread-1) [     ] o.a.s.c.SolrXmlConfig Loading container configuration from /home/jenkins/jenkins-slave/workspace/Lucene-Solr-BadApples-NightlyTests-8.x/checkout/solr/build/solr-core/test/J0/temp/solr.cloud.SharedFSAutoReplicaFailoverTest_4F7BBC67702012C6-001/shard-1-001/solr.xml
   [junit4]   2> 1185064 INFO  (closeThreadPool-2233-thread-1) [     ] o.a.s.c.SolrXmlConfig Configuration parameter autoReplicaFailoverWorkLoopDelay is ignored
   [junit4]   2> 1185064 INFO  (closeThreadPool-2233-thread-1) [     ] o.a.s.c.SolrXmlConfig Configuration parameter autoReplicaFailoverBadNodeExpiration is ignored
   [junit4]   2> 1185066 INFO  (closeThreadPool-2233-thread-1) [     ] o.a.s.c.SolrXmlConfig MBean server found: com.sun.jmx.mbeanserver.JmxMBeanServer@411f5ee4, but no JMX reporters were configured - adding default JMX reporter.
   [junit4]   2> 1185101 INFO  (TEST-SharedFSAutoReplicaFailoverTest.test-seed#[4F7BBC67702012C6]) [     ] o.a.s.c.AbstractFullDistribZkTestBase create jetty 3 in directory /home/jenkins/jenkins-slave/workspace/Lucene-Solr-BadApples-NightlyTests-8.x/checkout/solr/build/solr-core/test/J0/temp/solr.cloud.SharedFSAutoReplicaFailoverTest_4F7BBC67702012C6-001/shard-3-001 of type NRT
   [junit4]   2> 1185143 WARN  (closeThreadPool-2233-thread-3) [     ] o.e.j.s.AbstractConnector Ignoring deprecated socket close linger time
   [junit4]   2> 1185143 INFO  (closeThreadPool-2233-thread-3) [     ] o.a.s.c.s.e.JettySolrRunner Start Jetty (original configured port=0)
   [junit4]   2> 1185143 INFO  (closeThreadPool-2233-thread-3) [     ] o.a.s.c.s.e.JettySolrRunner Trying to start Jetty on port 0 try number 1 ...
   [junit4]   2> 1185143 INFO  (closeThreadPool-2233-thread-3) [     ] o.e.j.s.Server jetty-9.4.19.v20190610; built: 2019-06-10T16:30:51.723Z; git: afcf563148970e98786327af5e07c261fda175d3; jvm 1.8.0_191-b12
   [junit4]   2> 1185187 INFO  (closeThreadPool-2233-thread-3) [     ] o.e.j.s.session DefaultSessionIdManager workerName=node0
   [junit4]   2> 1185187 INFO  (closeThreadPool-2233-thread-3) [     ] o.e.j.s.session No SessionScavenger set, using defaults
   [junit4]   2> 1185187 INFO  (closeThreadPool-2233-thread-3) [     ] o.e.j.s.session node0 Scavenging every 600000ms
   [junit4]   2> 1185193 INFO  (closeThreadPool-2233-thread-3) [     ] o.e.j.s.h.ContextHandler Started o.e.j.s.ServletContextHandler@2b9ac80{/,null,AVAILABLE}
   [junit4]   2> 1185193 INFO  (closeThreadPool-2233-thread-2) [     ] o.a.s.s.SolrDispatchFilter Loading solr.xml from SolrHome (not found in ZooKeeper)
   [junit4]   2> 1185193 INFO  (closeThreadPool-2233-thread-2) [     ] o.a.s.c.SolrXmlConfig Loading container configuration from /home/jenkins/jenkins-slave/workspace/Lucene-Solr-BadApples-NightlyTests-8.x/checkout/solr/build/solr-core/test/J0/temp/solr.cloud.SharedFSAutoReplicaFailoverTest_4F7BBC67702012C6-001/shard-2-001/solr.xml
   [junit4]   2> 1185207 INFO  (closeThreadPool-2233-thread-3) [     ] o.e.j.s.AbstractConnector Started ServerConnector@724f7f9d{HTTP/1.1,[http/1.1, h2c]}{127.0.0.1:36262}
   [junit4]   2> 1185207 INFO  (closeThreadPool-2233-thread-3) [     ] o.e.j.s.Server Started @1185267ms
   [junit4]   2> 1185207 INFO  (closeThreadPool-2233-thread-3) [     ] o.a.s.c.s.e.JettySolrRunner Jetty properties: {solrconfig=solrconfig.xml, hostContext=/, hostPort=36262, coreRootDirectory=/home/jenkins/jenkins-slave/workspace/Lucene-Solr-BadApples-NightlyTests-8.x/checkout/solr/build/solr-core/test/J0/../../../../../../../../../../../home/jenkins/jenkins-slave/workspace/Lucene-Solr-BadApples-NightlyTests-8.x/checkout/solr/build/solr-core/test/J0/temp/solr.cloud.SharedFSAutoReplicaFailoverTest_4F7BBC67702012C6-001/shard-3-001/cores}
   [junit4]   2> 1185207 INFO  (closeThreadPool-2233-thread-2) [     ] o.a.s.c.SolrXmlConfig Configuration parameter autoReplicaFailoverWorkLoopDelay is ignored
   [junit4]   2> 1185207 INFO  (closeThreadPool-2233-thread-2) [     ] o.a.s.c.SolrXmlConfig Configuration parameter autoReplicaFailoverBadNodeExpiration is ignored
   [junit4]   2> 1185209 DEBUG (ScheduledTrigger-2440-thread-2) [     ] o.a.s.c.a.NodeLostTrigger Running NodeLostTrigger: .auto_add_replicas with currently live nodes: 1 and last live nodes: 1
   [junit4]   2> 1185209 ERROR (closeThreadPool-2233-thread-3) [     ] o.a.s.u.StartupLoggingUtils Missing Java Option solr.log.dir. Logging may be missing or incomplete.
   [junit4]   2> 1185209 INFO  (closeThreadPool-2233-thread-3) [     ] o.a.s.s.SolrDispatchFilter Using logger factory org.apache.logging.slf4j.Log4jLoggerFactory
   [junit4]   2> 1185209 INFO  (closeThreadPool-2233-thread-3) [     ] o.a.s.s.SolrDispatchFilter  ___      _       Welcome to Apache Solr™ version 8.2.0
   [junit4]   2> 1185209 INFO  (closeThreadPool-2233-thread-3) [     ] o.a.s.s.SolrDispatchFilter / __| ___| |_ _   Starting in cloud mode on port null
   [junit4]   2> 1185209 INFO  (closeThreadPool-2233-thread-3) [     ] o.a.s.s.SolrDispatchFilter \__ \/ _ \ | '_|  Install dir: null
   [junit4]   2> 1185209 INFO  (closeThreadPool-2233-thread-3) [     ] o.a.s.s.SolrDispatchFilter |___/\___/_|_|    Start time: 2019-07-05T23:50:09.645Z
   [junit4]   2> 1185210 INFO  (closeThreadPool-2233-thread-2) [     ] o.a.s.c.SolrXmlConfig MBean server found: com.sun.jmx.mbeanserver.JmxMBeanServer@411f5ee4, but no JMX reporters were configured - adding default JMX reporter.
   [junit4]   2> 1185213 INFO  (closeThreadPool-2233-thread-1) [     ] o.a.s.h.c.HttpShardHandlerFactory Host whitelist initialized: WhitelistHostChecker [whitelistHosts=null, whitelistHostCheckingEnabled=false]
   [junit4]   2> 1185213 INFO  (closeThreadPool-2233-thread-3) [     ] o.a.s.c.c.ConnectionManager Waiting for client to connect to ZooKeeper
   [junit4]   2> 1185231 WARN  (closeThreadPool-2233-thread-1) [     ] o.e.j.u.s.S.config Trusting all certificates configured for Client@27967a48[provider=null,keyStore=null,trustStore=null]
   [junit4]   2> 1185231 WARN  (closeThreadPool-2233-thread-1) [     ] o.e.j.u.s.S.config No Client EndPointIdentificationAlgorithm configured for Client@27967a48[provider=null,keyStore=null,trustStore=null]
   [junit4]   2> 1185253 INFO  (zkConnectionManagerCallback-2240-thread-1) [     ] o.a.s.c.c.ConnectionManager zkClient has connected
   [junit4]   2> 1185255 INFO  (closeThreadPool-2233-thread-3) [     ] o.a.s.c.c.ConnectionManager Client is connected to ZooKeeper
   [junit4]   2> 1185273 WARN  (closeThreadPool-2233-thread-1) [     ] o.e.j.u.s.S.config Trusting all certificates configured for Client@7bf4074d[provider=null,keyStore=null,trustStore=null]
   [junit4]   2> 1185273 WARN  (closeThreadPool-2233-thread-1) [     ] o.e.j.u.s.S.config No Client EndPointIdentificationAlgorithm configured for Client@7bf4074d[provider=null,keyStore=null,trustStore=null]
   [junit4]   2> 1185274 INFO  (closeThreadPool-2233-thread-1) [     ] o.a.s.c.ZkContainer Zookeeper client=127.0.0.1:33195/solr
   [junit4]   2> 1185295 INFO  (closeThreadPool-2233-thread-1) [     ] o.a.s.c.c.ConnectionManager Waiting for client to connect to ZooKeeper
   [junit4]   2> 1185304 INFO  (TEST-SharedFSAutoReplicaFailoverTest.test-seed#[4F7BBC67702012C6]) [     ] o.a.s.c.AbstractFullDistribZkTestBase create jetty 4 in directory /home/jenkins/jenkins-slave/workspace/Lucene-Solr-BadApples-NightlyTests-8.x/checkout/solr/build/solr-core/test/J0/temp/solr.cloud.SharedFSAutoReplicaFailoverTest_4F7BBC67702012C6-001/shard-4-001 of type NRT
   [junit4]   2> 1185307 INFO  (zkConnectionManagerCallback-2247-thread-1) [     ] o.a.s.c.c.ConnectionManager zkClient has connected
   [junit4]   2> 1185307 INFO  (closeThreadPool-2233-thread-1) [     ] o.a.s.c.c.ConnectionManager Client is connected to ZooKeeper
   [junit4]   2> 1185307 WARN  (closeThreadPool-2233-thread-4) [     ] o.e.j.s.AbstractConnector Ignoring deprecated socket close linger time
   [junit4]   2> 1185309 INFO  (closeThreadPool-2233-thread-4) [     ] o.a.s.c.s.e.JettySolrRunner Start Jetty (original configured port=0)
   [junit4]   2> 1185309 INFO  (closeThreadPool-2233-thread-4) [     ] o.a.s.c.s.e.JettySolrRunner Trying to start Jetty on port 0 try number 1 ...
   [junit4]   2> 1185309 INFO  (closeThreadPool-2233-thread-4) [     ] o.e.j.s.Server jetty-9.4.19.v20190610; built: 2019-06-10T16:30:51.723Z; git: afcf563148970e98786327af5e07c261fda175d3; jvm 1.8.0_191-b12
   [junit4]   2> 1185309 INFO  (closeThreadPool-2233-thread-4) [     ] o.e.j.s.session DefaultSessionIdManager workerName=node0
   [junit4]   2> 1185309 INFO  (closeThreadPool-2233-thread-4) [     ] o.e.j.s.session No SessionScavenger set, using defaults
   [junit4]   2> 1185310 INFO  (closeThreadPool-2233-thread-4) [     ] o.e.j.s.session node0 Scavenging every 660000ms
   [junit4]   2> 1185310 INFO  (closeThreadPool-2233-thread-4) [     ] o.e.j.s.h.ContextHandler Started o.e.j.s.ServletContextHandler@34d42562{/,null,AVAILABLE}
   [junit4]   2> 1185310 INFO  (closeThreadPool-2233-thread-4) [     ] o.e.j.s.AbstractConnector Started ServerConnector@7bbe3f65{HTTP/1.1,[http/1.1, h2c]}{127.0.0.1:33953}
   [junit4]   2> 1185310 INFO  (closeThreadPool-2233-thread-4) [     ] o.e.j.s.Server Started @1185370ms
   [junit4]   2> 1185310 INFO  (closeThreadPool-2233-thread-4) [     ] o.a.s.c.s.e.JettySolrRunner Jetty properties: {solrconfig=solrconfig.xml, hostContext=/, hostPort=33953, coreRootDirectory=/home/jenkins/jenkins-slave/workspace/Lucene-Solr-BadApples-NightlyTests-8.x/checkout/solr/build/solr-core/test/J0/../../../../../../../../../../../home/jenkins/jenkins-slave/workspace/Lucene-Solr-BadApples-NightlyTests-8.x/checkout/solr/build/solr-core/test/J0/temp/solr.cloud.SharedFSAutoReplicaFailoverTest_4F7BBC67702012C6-001/shard-4-001/cores}
   [junit4]   2> 1185311 ERROR (closeThreadPool-2233-thread-4) [     ] o.a.s.u.StartupLoggingUtils Missing Java Option solr.log.dir. Logging may be missing or incomplete.
   [junit4]   2> 1185311 INFO  (closeThreadPool-2233-thread-4) [     ] o.a.s.s.SolrDispatchFilter Using logger factory org.apache.logging.slf4j.Log4jLoggerFactory
   [junit4]   2> 1185311 INFO  (closeThreadPool-2233-thread-4) [     ] o.a.s.s.SolrDispatchFilter  ___      _       Welcome to Apache Solr™ version 8.2.0
   [junit4]   2> 1185311 INFO  (closeThreadPool-2233-thread-4) [     ] o.a.s.s.SolrDispatchFilter / __| ___| |_ _   Starting in cloud mode on port null
   [junit4]   2> 1185311 INFO  (closeThreadPool-2233-thread-4) [     ] o.a.s.s.SolrDispatchFilter \__ \/ _ \ | '_|  Install dir: null
   [junit4]   2> 1185311 INFO  (closeThreadPool-2233-thread-4) [     ] o.a.s.s.SolrDispatchFilter |___/\___/_|_|    Start time: 2019-07-05T23:50:09.747Z
   [junit4]   2> 1185312 INFO  (closeThreadPool-2233-thread-4) [     ] o.a.s.c.c.ConnectionManager Waiting for client to connect to ZooKeeper
   [junit4]   2> 1185343 INFO  (zkConnectionManagerCallback-2249-thread-1) [     ] o.a.s.c.c.ConnectionManager zkClient has connected
   [junit4]   2> 1185343 INFO  (closeThreadPool-2233-thread-4) [     ] o.a.s.c.c.ConnectionManager Client is connected to ZooKeeper
   [junit4]   2> 1185372 INFO  (closeThreadPool-2233-thread-3) [     ] o.a.s.s.SolrDispatchFilter Loading solr.xml from SolrHome (not found in ZooKeeper)
   [junit4]   2> 1185372 INFO  (closeThreadPool-2233-thread-3) [     ] o.a.s.c.SolrXmlConfig Loading container configuration from /home/jenkins/jenkins-slave/workspace/Lucene-Solr-BadApples-NightlyTests-8.x/checkout/solr/build/solr-core/test/J0/temp/solr.cloud.SharedFSAutoReplicaFailoverTest_4F7BBC67702012C6-001/shard-3-001/solr.xml
   [junit4]   2> 1185388 INFO  (closeThreadPool-2233-thread-3) [     ] o.a.s.c.SolrXmlConfig Configuration parameter autoReplicaFailoverWorkLoopDelay is ignored
   [junit4]   2> 1185388 INFO  (closeThreadPool-2233-thread-3) [     ] o.a.s.c.SolrXmlConfig Configuration parameter autoReplicaFailoverBadNodeExpiration is ignored
   [junit4]   2> 1185390 INFO  (closeThreadPool-2233-thread-3) [     ] o.a.s.c.SolrXmlConfig MBean server found: com.sun.jmx.mbeanserver.JmxMBeanServer@411f5ee4, but no JMX reporters were configured - adding default JMX reporter.
   [junit4]   2> 1185481 INFO  (closeThreadPool-2233-thread-3) [     ] o.a.s.h.c.HttpShardHandlerFactory Host whitelist initialized: WhitelistHostChecker [whitelistHosts=null, whitelistHostCheckingEnabled=false]
   [junit4]   2> 1185483 WARN  (closeThreadPool-2233-thread-3) [     ] o.e.j.u.s.S.config Trusting all certificates configured for Client@374d693[provider=null,keyStore=null,trustStore=null]
   [junit4]   2> 1185483 WARN  (closeThreadPool-2233-thread-3) [     ] o.e.j.u.s.S.config No Client EndPointIdentificationAlgorithm configured for Client@374d693[provider=null,keyStore=null,trustStore=null]
   [junit4]   2> 1185486 WARN  (closeThreadPool-2233-thread-3) [     ] o.e.j.u.s.S.config Trusting all certificates configured for Client@a255fa0[provider=null,keyStore=null,trustStore=null]
   [junit4]   2> 1185486 WARN  (closeThreadPool-2233-thread-3) [     ] o.e.j.u.s.S.config No Client EndPointIdentificationAlgorithm configured for Client@a255fa0[provider=null,keyStore=null,trustStore=null]
   [junit4]   2> 1185487 INFO  (closeThreadPool-2233-thread-3) [     ] o.a.s.c.ZkContainer Zookeeper client=127.0.0.1:33195/solr
   [junit4]   2> 1185488 INFO  (closeThreadPool-2233-thread-4) [     ] o.a.s.s.SolrDispatchFilter Loading solr.xml from SolrHome (not found in ZooKeeper)
   [junit4]   2> 1185488 INFO  (closeThreadPool-2233-thread-4) [     ] o.a.s.c.SolrXmlConfig Loading container configuration from /home/jenkins/jenkins-slave/workspace/Lucene-Solr-BadApples-NightlyTests-8.x/checkout/solr/build/solr-core/test/J0/temp/solr.cloud.SharedFSAutoReplicaFailoverTest_4F7BBC67702012C6-001/shard-4-001/solr.xml
   [junit4]   2> 1185491 INFO  (closeThreadPool-2233-thread-4) [     ] o.a.s.c.SolrXmlConfig Configuration parameter autoReplicaFailoverWorkLoopDelay is ignored
   [junit4]   2> 1185491 INFO  (closeThreadPool-2233-thread-4) [     ] o.a.s.c.SolrXmlConfig Configuration parameter autoReplicaFailoverBadNodeExpiration is ignored
   [junit4]   2> 1185492 INFO  (closeThreadPool-2233-thread-4) [     ] o.a.s.c.SolrXmlConfig MBean server found: com.sun.jmx.mbeanserver.JmxMBeanServer@411f5ee4, but no JMX reporters were configured - adding default JMX reporter.
   [junit4]   2> 1185518 INFO  (closeThreadPool-2233-thread-1) [n:127.0.0.1:33923_     ] o.a.s.c.c.ConnectionManager Waiting for client to connect to ZooKeeper
   [junit4]   2> 1185518 INFO  (closeThreadPool-2233-thread-3) [     ] o.a.s.c.c.ConnectionManager Waiting for client to connect to ZooKeeper
   [junit4]   2> 1185520 INFO  (zkConnectionManagerCallback-2256-thread-1) [     ] o.a.s.c.c.ConnectionManager zkClient has connected
   [junit4]   2> 1185520 INFO  (closeThreadPool-2233-thread-3) [     ] o.a.s.c.c.ConnectionManager Client is connected to ZooKeeper
   [junit4]   2> 1185555 INFO  (zkConnectionManagerCallback-2258-thread-1) [     ] o.a.s.c.c.ConnectionManager zkClient has connected
   [junit4]   2> 1185555 INFO  (closeThreadPool-2233-thread-1) [n:127.0.0.1:33923_     ] o.a.s.c.c.ConnectionManager Client is connected to ZooKeeper
   [junit4]   2> 1185639 INFO  (closeThreadPool-2233-thread-3) [n:127.0.0.1:36262_     ] o.a.s.c.c.ConnectionManager Waiting for client to connect to ZooKeeper
   [junit4]   2> 1185641 INFO  (closeThreadPool-2233-thread-1) [n:127.0.0.1:33923_     ] o.a.s.c.c.ZkStateReader Updated live nodes from ZooKeeper... (0) -> (1)
   [junit4]   2> 1185644 INFO  (closeThreadPool-2233-thread-1) [n:127.0.0.1:33923_     ] o.a.s.c.ZkController Publish node=127.0.0.1:33923_ as DOWN
   [junit4]   2> 1185645 INFO  (closeThreadPool-2233-thread-1) [n:127.0.0.1:33923_     ] o.a.s.c.TransientSolrCoreCacheDefault Allocating transient cache for 4 transient cores
   [junit4]   2> 1185645 INFO  (closeThreadPool-2233-thread-1) [n:127.0.0.1:33923_     ] o.a.s.c.ZkController Register node as live in ZooKeeper:/live_nodes/127.0.0.1:33923_
   [junit4]   2> 1185646 INFO  (zkCallback-2219-thread-1) [     ] o.a.s.c.c.ZkStateReader Updated live nodes from ZooKeeper... (1) -> (2)
   [junit4]   2> 1185647 INFO  (zkCallback-2231-thread-1) [     ] o.a.s.c.c.ZkStateReader Updated live nodes from ZooKeeper... (1) -> (2)
   [junit4]   2> 1185647 INFO  (zkCallback-2212-thread-3) [     ] o.a.s.c.c.ZkStateReader Updated live nodes from ZooKeeper... (1) -> (2)
   [junit4]   2> 1185654 INFO  (zkCallback-2257-thread-1) [     ] o.a.s.c.c.ZkStateReader Updated live nodes from ZooKeeper... (1) -> (2)
   [junit4]   2> 1185675 INFO  (zkConnectionManagerCallback-2261-thread-1) [     ] o.a.s.c.c.ConnectionManager zkClient has connected
   [junit4]   2> 1185675 INFO  (closeThreadPool-2233-thread-3) [n:127.0.0.1:36262_     ] o.a.s.c.c.ConnectionManager Client is connected to ZooKeeper
   [junit4]   2> 1185678 INFO  (closeThreadPool-2233-thread-3) [n:127.0.0.1:36262_     ] o.a.s.c.c.ZkStateReader Updated live nodes from ZooKeeper... (0) -> (2)
   [junit4]   2> 1185681 INFO  (closeThreadPool-2233-thread-3) [n:127.0.0.1:36262_     ] o.a.s.c.ZkController Publish node=127.0.0.1:36262_ as DOWN
   [junit4]   2> 1185682 INFO  (closeThreadPool-2233-thread-3) [n:127.0.0.1:36262_     ] o.a.s.c.TransientSolrCoreCacheDefault Allocating transient cache for 4 transient cores
   [junit4]   2> 1185682 INFO  (closeThreadPool-2233-thread-3) [n:127.0.0.1:36262_     ] o.a.s.c.ZkController Register node as live in ZooKeeper:/live_nodes/127.0.0.1:36262_
   [junit4]   2> 1185683 INFO  (zkCallback-2219-thread-1) [     ] o.a.s.c.c.ZkStateReader Updated live nodes from ZooKeeper... (2) -> (3)
   [junit4]   2> 1185683 INFO  (zkCallback-2212-thread-2) [     ] o.a.s.c.c.ZkStateReader Updated live nodes from ZooKeeper... (2) -> (3)
   [junit4]   2> 1185687 INFO  (closeThreadPool-2233-thread-1) [n:127.0.0.1:33923_     ] o.a.s.c.c.ConnectionManager Waiting for client to connect to ZooKeeper
   [junit4]   2> 1185709 INFO  (closeThreadPool-2233-thread-4) [     ] o.a.s.h.c.HttpShardHandlerFactory Host whitelist initialized: WhitelistHostChecker [whitelistHosts=null, whitelistHostCheckingEnabled=false]
   [junit4]   2> 1185736 INFO  (zkCallback-2260-thread-1) [     ] o.a.s.c.c.ZkStateReader Updated live nodes from ZooKeeper... (2) -> (3)
   [junit4]   2> 1185739 INFO  (zkCallback-2257-thread-1) [     ] o.a.s.c.c.ZkStateReader Updated live nodes from ZooKeeper... (2) -> (3)
   [junit4]   2> 1185739 INFO  (zkConnectionManagerCallback-2268-thread-1) [     ] o.a.s.c.c.ConnectionManager zkClient has connected
   [junit4]   2> 1185739 INFO  (closeThreadPool-2233-thread-1) [n:127.0.0.1:33923_     ] o.a.s.c.c.ConnectionManager Client is connected to ZooKeeper
   [junit4]   2> 1185739 INFO  (zkCallback-2231-thread-1) [     ] o.a.s.c.c.ZkStateReader Updated live nodes from ZooKeeper... (2) -> (3)
   [junit4]   2> 1185740 INFO  (closeThreadPool-2233-thread-1) [n:127.0.0.1:33923_     ] o.a.s.c.c.ZkStateReader Updated live nodes from ZooKeeper... (0) -> (3)
   [junit4]   2> 1185741 INFO  (closeThreadPool-2233-thread-1) [n:127.0.0.1:33923_     ] o.a.s.c.s.i.ZkClientClusterStateProvider Cluster at 127.0.0.1:33195/solr ready
   [junit4]   2> 1185750 INFO  (OverseerCollectionConfigSetProcessor-74987577123995652-127.0.0.1:44299_-n_0000000000) [n:127.0.0.1:44299_     ] o.a.s.c.OverseerTaskQueue Response ZK path: /overseer/collection-queue-work/qnr-0000000002 doesn't exist.  Requestor may have disconnected from ZooKeeper
   [junit4]   2> 1185751 INFO  (closeThreadPool-2233-thread-3) [n:127.0.0.1:36262_     ] o.a.s.c.c.ConnectionManager Waiting for client to connect to ZooKeeper
   [junit4]   2> 1185786 INFO  (zkConnectionManagerCallback-2275-thread-1) [     ] o.a.s.c.c.ConnectionManager zkClient has connected
   [junit4]   2> 1185786 INFO  (closeThreadPool-2233-thread-3) [n:127.0.0.1:36262_     ] o.a.s.c.c.ConnectionManager Client is connected to ZooKeeper
   [junit4]   2> 1185787 INFO  (closeThreadPool-2233-thread-3) [n:127.0.0.1:36262_     ] o.a.s.c.c.ZkStateReader Updated live nodes from ZooKeeper... (0) -> (3)
   [junit4]   2> 1185789 INFO  (closeThreadPool-2233-thread-3) [n:127.0.0.1:36262_     ] o.a.s.c.s.i.ZkClientClusterStateProvider Cluster at 127.0.0.1:33195/solr ready
   [junit4]   2> 1185799 WARN  (closeThreadPool-2233-thread-4) [     ] o.e.j.u.s.S.config Trusting all certificates configured for Client@619aa4a7[provider=null,keyStore=null,trustStore=null]
   [junit4]   2> 1185799 WARN  (closeThreadPool-2233-thread-4) [     ] o.e.j.u.s.S.config No Client EndPointIdentificationAlgorithm configured for Client@619aa4a7[provider=null,keyStore=null,trustStore=null]
   [junit4]   2> 1185811 INFO  (closeThreadPool-2233-thread-1) [n:127.0.0.1:33923_     ] o.a.s.h.a.MetricsHistoryHandler No .system collection, keeping metrics history in memory.
   [junit4]   2> 1185813 WARN  (closeThreadPool-2233-thread-4) [     ] o.e.j.u.s.S.config Trusting all certificates configured for Client@454c051b[provider=null,keyStore=null,trustStore=null]
   [junit4]   2> 1185813 WARN  (closeThreadPool-2233-thread-4) [     ] o.e.j.u.s.S.config No Client EndPointIdentificationAlgorithm configured for Client@454c051b[provider=null,keyStore=null,trustStore=null]
   [junit4]   2> 1185814 INFO  (closeThreadPool-2233-thread-4) [     ] o.a.s.c.ZkContainer Zookeeper client=127.0.0.1:33195/solr
   [junit4]   2> 1185815 INFO  (closeThreadPool-2233-thread-4) [     ] o.a.s.c.c.ConnectionManager Waiting for client to connect to ZooKeeper
   [junit4]   2> 1185855 INFO  (zkConnectionManagerCallback-2282-thread-1) [     ] o.a.s.c.c.ConnectionManager zkClient has connected
   [junit4]   2> 1185855 INFO  (closeThreadPool-2233-thread-4) [     ] o.a.s.c.c.ConnectionManager Client is connected to ZooKeeper
   [junit4]   2> 1185880 INFO  (closeThreadPool-2233-thread-3) [n:127.0.0.1:36262_     ] o.a.s.h.a.MetricsHistoryHandler No .system collection, keeping metrics history in memory.
   [junit4]   2> 1185936 INFO  (closeThreadPool-2233-thread-1) [n:127.0.0.1:33923_     ] o.a.s.m.r.SolrJmxReporter JMX monitoring for 'solr

[...truncated too long message...]

ngs.xml

resolve:

ivy-availability-check:
[loadresource] Do not set property disallowed.ivy.jars.list as its length is 0.

-ivy-fail-disallowed-ivy-version:

ivy-fail:

ivy-fail:

ivy-configure:
[ivy:configure] :: loading settings :: file = /home/jenkins/jenkins-slave/workspace/Lucene-Solr-BadApples-NightlyTests-8.x/checkout/lucene/top-level-ivy-settings.xml

resolve:

ivy-availability-check:
[loadresource] Do not set property disallowed.ivy.jars.list as its length is 0.

-ivy-fail-disallowed-ivy-version:

ivy-fail:

ivy-configure:
[ivy:configure] :: loading settings :: file = /home/jenkins/jenkins-slave/workspace/Lucene-Solr-BadApples-NightlyTests-8.x/checkout/lucene/top-level-ivy-settings.xml

resolve:

ivy-availability-check:
[loadresource] Do not set property disallowed.ivy.jars.list as its length is 0.

-ivy-fail-disallowed-ivy-version:

ivy-fail:

ivy-fail:

ivy-configure:
[ivy:configure] :: loading settings :: file = /home/jenkins/jenkins-slave/workspace/Lucene-Solr-BadApples-NightlyTests-8.x/checkout/lucene/top-level-ivy-settings.xml

resolve:

ivy-availability-check:
[loadresource] Do not set property disallowed.ivy.jars.list as its length is 0.

-ivy-fail-disallowed-ivy-version:

ivy-fail:

ivy-fail:

ivy-configure:
[ivy:configure] :: loading settings :: file = /home/jenkins/jenkins-slave/workspace/Lucene-Solr-BadApples-NightlyTests-8.x/checkout/lucene/top-level-ivy-settings.xml

resolve:

ivy-availability-check:
[loadresource] Do not set property disallowed.ivy.jars.list as its length is 0.

-ivy-fail-disallowed-ivy-version:

ivy-fail:

ivy-fail:

ivy-configure:
[ivy:configure] :: loading settings :: file = /home/jenkins/jenkins-slave/workspace/Lucene-Solr-BadApples-NightlyTests-8.x/checkout/lucene/top-level-ivy-settings.xml

resolve:

ivy-availability-check:
[loadresource] Do not set property disallowed.ivy.jars.list as its length is 0.

-ivy-fail-disallowed-ivy-version:

ivy-fail:

ivy-fail:

ivy-configure:
[ivy:configure] :: loading settings :: file = /home/jenkins/jenkins-slave/workspace/Lucene-Solr-BadApples-NightlyTests-8.x/checkout/lucene/top-level-ivy-settings.xml

resolve:

ivy-availability-check:
[loadresource] Do not set property disallowed.ivy.jars.list as its length is 0.

-ivy-fail-disallowed-ivy-version:

ivy-fail:

ivy-fail:

ivy-configure:
[ivy:configure] :: loading settings :: file = /home/jenkins/jenkins-slave/workspace/Lucene-Solr-BadApples-NightlyTests-8.x/checkout/lucene/top-level-ivy-settings.xml

resolve:

ivy-availability-check:
[loadresource] Do not set property disallowed.ivy.jars.list as its length is 0.

-ivy-fail-disallowed-ivy-version:

ivy-fail:

ivy-fail:

ivy-configure:
[ivy:configure] :: loading settings :: file = /home/jenkins/jenkins-slave/workspace/Lucene-Solr-BadApples-NightlyTests-8.x/checkout/lucene/top-level-ivy-settings.xml

resolve:

ivy-availability-check:
[loadresource] Do not set property disallowed.ivy.jars.list as its length is 0.

-ivy-fail-disallowed-ivy-version:

ivy-fail:

ivy-fail:

ivy-configure:
[ivy:configure] :: loading settings :: file = /home/jenkins/jenkins-slave/workspace/Lucene-Solr-BadApples-NightlyTests-8.x/checkout/lucene/top-level-ivy-settings.xml

resolve:

ivy-availability-check:
[loadresource] Do not set property disallowed.ivy.jars.list as its length is 0.

-ivy-fail-disallowed-ivy-version:

ivy-fail:

ivy-fail:

ivy-configure:
[ivy:configure] :: loading settings :: file = /home/jenkins/jenkins-slave/workspace/Lucene-Solr-BadApples-NightlyTests-8.x/checkout/lucene/top-level-ivy-settings.xml

resolve:

ivy-availability-check:
[loadresource] Do not set property disallowed.ivy.jars.list as its length is 0.

-ivy-fail-disallowed-ivy-version:

ivy-fail:

ivy-fail:

ivy-configure:
[ivy:configure] :: loading settings :: file = /home/jenkins/jenkins-slave/workspace/Lucene-Solr-BadApples-NightlyTests-8.x/checkout/lucene/top-level-ivy-settings.xml

resolve:

ivy-availability-check:
[loadresource] Do not set property disallowed.ivy.jars.list as its length is 0.

-ivy-fail-disallowed-ivy-version:

ivy-fail:

ivy-fail:

ivy-configure:
[ivy:configure] :: loading settings :: file = /home/jenkins/jenkins-slave/workspace/Lucene-Solr-BadApples-NightlyTests-8.x/checkout/lucene/top-level-ivy-settings.xml

resolve:

ivy-availability-check:
[loadresource] Do not set property disallowed.ivy.jars.list as its length is 0.

-ivy-fail-disallowed-ivy-version:

ivy-fail:

ivy-fail:

ivy-configure:
[ivy:configure] :: loading settings :: file = /home/jenkins/jenkins-slave/workspace/Lucene-Solr-BadApples-NightlyTests-8.x/checkout/lucene/top-level-ivy-settings.xml

resolve:

jar-checksums:
    [mkdir] Created dir: /home/jenkins/jenkins-slave/workspace/Lucene-Solr-BadApples-NightlyTests-8.x/checkout/solr/null1644386699
     [copy] Copying 249 files to /home/jenkins/jenkins-slave/workspace/Lucene-Solr-BadApples-NightlyTests-8.x/checkout/solr/null1644386699
   [delete] Deleting directory /home/jenkins/jenkins-slave/workspace/Lucene-Solr-BadApples-NightlyTests-8.x/checkout/solr/null1644386699

check-working-copy:
[ivy:cachepath] :: resolving dependencies :: #;working@lucene2-us-west.apache.org
[ivy:cachepath] 	confs: [default]
[ivy:cachepath] 	found org.eclipse.jgit#org.eclipse.jgit;5.3.0.201903130848-r in public
[ivy:cachepath] 	found com.jcraft#jsch;0.1.54 in public
[ivy:cachepath] 	found com.jcraft#jzlib;1.1.1 in public
[ivy:cachepath] 	found com.googlecode.javaewah#JavaEWAH;1.1.6 in public
[ivy:cachepath] 	found org.slf4j#slf4j-api;1.7.2 in public
[ivy:cachepath] 	found org.bouncycastle#bcpg-jdk15on;1.60 in public
[ivy:cachepath] 	found org.bouncycastle#bcprov-jdk15on;1.60 in public
[ivy:cachepath] 	found org.bouncycastle#bcpkix-jdk15on;1.60 in public
[ivy:cachepath] 	found org.slf4j#slf4j-nop;1.7.2 in public
[ivy:cachepath] :: resolution report :: resolve 79ms :: artifacts dl 9ms
	---------------------------------------------------------------------
	|                  |            modules            ||   artifacts   |
	|       conf       | number| search|dwnlded|evicted|| number|dwnlded|
	---------------------------------------------------------------------
	|      default     |   9   |   0   |   0   |   0   ||   9   |   0   |
	---------------------------------------------------------------------
[wc-checker] Initializing working copy...
[wc-checker] Checking working copy status...

-jenkins-base:

BUILD SUCCESSFUL
Total time: 593 minutes 55 seconds
Archiving artifacts
java.lang.InterruptedException: no matches found within 10000
	at hudson.FilePath$ValidateAntFileMask.hasMatch(FilePath.java:2847)
	at hudson.FilePath$ValidateAntFileMask.invoke(FilePath.java:2726)
	at hudson.FilePath$ValidateAntFileMask.invoke(FilePath.java:2707)
	at hudson.FilePath$FileCallableWrapper.call(FilePath.java:3086)
Also:   hudson.remoting.Channel$CallSiteStackTrace: Remote call to lucene2
		at hudson.remoting.Channel.attachCallSiteStackTrace(Channel.java:1741)
		at hudson.remoting.UserRequest$ExceptionResponse.retrieve(UserRequest.java:357)
		at hudson.remoting.Channel.call(Channel.java:955)
		at hudson.FilePath.act(FilePath.java:1072)
		at hudson.FilePath.act(FilePath.java:1061)
		at hudson.FilePath.validateAntFileMask(FilePath.java:2705)
		at hudson.tasks.ArtifactArchiver.perform(ArtifactArchiver.java:243)
		at hudson.tasks.BuildStepCompatibilityLayer.perform(BuildStepCompatibilityLayer.java:81)
		at hudson.tasks.BuildStepMonitor$1.perform(BuildStepMonitor.java:20)
		at hudson.model.AbstractBuild$AbstractBuildExecution.perform(AbstractBuild.java:744)
		at hudson.model.AbstractBuild$AbstractBuildExecution.performAllBuildSteps(AbstractBuild.java:690)
		at hudson.model.Build$BuildExecution.post2(Build.java:186)
		at hudson.model.AbstractBuild$AbstractBuildExecution.post(AbstractBuild.java:635)
		at hudson.model.Run.execute(Run.java:1835)
		at hudson.model.FreeStyleBuild.run(FreeStyleBuild.java:43)
		at hudson.model.ResourceController.execute(ResourceController.java:97)
		at hudson.model.Executor.run(Executor.java:429)
Caused: hudson.FilePath$TunneledInterruptedException
	at hudson.FilePath$FileCallableWrapper.call(FilePath.java:3088)
	at hudson.remoting.UserRequest.perform(UserRequest.java:212)
	at hudson.remoting.UserRequest.perform(UserRequest.java:54)
	at hudson.remoting.Request$2.run(Request.java:369)
	at hudson.remoting.InterceptingExecutorService$1.call(InterceptingExecutorService.java:72)
	at java.util.concurrent.FutureTask.run(FutureTask.java:266)
	at java.util.concurrent.ThreadPoolExecutor.runWorker(ThreadPoolExecutor.java:1142)
	at java.util.concurrent.ThreadPoolExecutor$Worker.run(ThreadPoolExecutor.java:617)
	at java.lang.Thread.run(Thread.java:748)
Caused: java.lang.InterruptedException: java.lang.InterruptedException: no matches found within 10000
	at hudson.FilePath.act(FilePath.java:1074)
	at hudson.FilePath.act(FilePath.java:1061)
	at hudson.FilePath.validateAntFileMask(FilePath.java:2705)
	at hudson.tasks.ArtifactArchiver.perform(ArtifactArchiver.java:243)
	at hudson.tasks.BuildStepCompatibilityLayer.perform(BuildStepCompatibilityLayer.java:81)
	at hudson.tasks.BuildStepMonitor$1.perform(BuildStepMonitor.java:20)
	at hudson.model.AbstractBuild$AbstractBuildExecution.perform(AbstractBuild.java:744)
	at hudson.model.AbstractBuild$AbstractBuildExecution.performAllBuildSteps(AbstractBuild.java:690)
	at hudson.model.Build$BuildExecution.post2(Build.java:186)
	at hudson.model.AbstractBuild$AbstractBuildExecution.post(AbstractBuild.java:635)
	at hudson.model.Run.execute(Run.java:1835)
	at hudson.model.FreeStyleBuild.run(FreeStyleBuild.java:43)
	at hudson.model.ResourceController.execute(ResourceController.java:97)
	at hudson.model.Executor.run(Executor.java:429)
No artifacts found that match the file pattern "**/*.events,heapdumps/**,**/hs_err_pid*". Configuration error?
Recording test results
Build step 'Publish JUnit test result report' changed build result to UNSTABLE
Email was triggered for: Unstable (Test Failures)
Sending email for trigger: Unstable (Test Failures)

Mime
View raw message