lucene-dev mailing list archives

Site index · List index
Message view « Date » · « Thread »
Top « Date » · « Thread »
From Apache Jenkins Server <jenk...@builds.apache.org>
Subject [JENKINS] Lucene-Solr-NightlyTests-8.x - Build # 145 - Failure
Date Tue, 09 Jul 2019 14:17:38 GMT
Build: https://builds.apache.org/job/Lucene-Solr-NightlyTests-8.x/145/

1 tests failed.
FAILED:  org.apache.lucene.document.TestXYMultiPolygonShapeQueries.testRandomBig

Error Message:
Java heap space

Stack Trace:
java.lang.OutOfMemoryError: Java heap space
	at __randomizedtesting.SeedInfo.seed([1EF32CB9869EA5C:86B84F44093096DC]:0)
	at org.apache.lucene.store.RAMFile.newBuffer(RAMFile.java:84)
	at org.apache.lucene.store.RAMFile.addBuffer(RAMFile.java:57)
	at org.apache.lucene.store.RAMOutputStream.switchCurrentBuffer(RAMOutputStream.java:168)
	at org.apache.lucene.store.RAMOutputStream.writeBytes(RAMOutputStream.java:154)
	at org.apache.lucene.store.MockIndexOutputWrapper.writeBytes(MockIndexOutputWrapper.java:141)
	at org.apache.lucene.util.bkd.OfflinePointWriter.append(OfflinePointWriter.java:67)
	at org.apache.lucene.util.bkd.BKDRadixSelector.offlinePartition(BKDRadixSelector.java:282)
	at org.apache.lucene.util.bkd.BKDRadixSelector.buildHistogramAndPartition(BKDRadixSelector.java:258)
	at org.apache.lucene.util.bkd.BKDRadixSelector.select(BKDRadixSelector.java:126)
	at org.apache.lucene.util.bkd.BKDWriter.build(BKDWriter.java:1594)
	at org.apache.lucene.util.bkd.BKDWriter.build(BKDWriter.java:1611)
	at org.apache.lucene.util.bkd.BKDWriter.finish(BKDWriter.java:785)
	at org.apache.lucene.codecs.lucene60.Lucene60PointsWriter.writeField(Lucene60PointsWriter.java:129)
	at org.apache.lucene.codecs.PointsWriter.mergeOneField(PointsWriter.java:62)
	at org.apache.lucene.codecs.lucene60.Lucene60PointsWriter.merge(Lucene60PointsWriter.java:219)
	at org.apache.lucene.index.SegmentMerger.mergePoints(SegmentMerger.java:202)
	at org.apache.lucene.index.SegmentMerger.merge(SegmentMerger.java:162)
	at org.apache.lucene.index.IndexWriter.mergeMiddle(IndexWriter.java:4462)
	at org.apache.lucene.index.IndexWriter.merge(IndexWriter.java:4056)
	at org.apache.lucene.index.SerialMergeScheduler.merge(SerialMergeScheduler.java:40)
	at org.apache.lucene.index.IndexWriter.maybeMerge(IndexWriter.java:2157)
	at org.apache.lucene.index.IndexWriter.forceMerge(IndexWriter.java:1990)
	at org.apache.lucene.index.IndexWriter.forceMerge(IndexWriter.java:1939)
	at org.apache.lucene.document.BaseShapeTestCase.indexRandomShapes(BaseShapeTestCase.java:242)
	at org.apache.lucene.document.BaseShapeTestCase.verify(BaseShapeTestCase.java:211)
	at org.apache.lucene.document.BaseShapeTestCase.doTestRandom(BaseShapeTestCase.java:137)
	at org.apache.lucene.document.TestXYMultiPolygonShapeQueries.testRandomBig(TestXYMultiPolygonShapeQueries.java:140)
	at sun.reflect.NativeMethodAccessorImpl.invoke0(Native Method)
	at sun.reflect.NativeMethodAccessorImpl.invoke(NativeMethodAccessorImpl.java:62)
	at sun.reflect.DelegatingMethodAccessorImpl.invoke(DelegatingMethodAccessorImpl.java:43)
	at java.lang.reflect.Method.invoke(Method.java:498)
	at com.carrotsearch.randomizedtesting.RandomizedRunner.invoke(RandomizedRunner.java:1750)




Build Log:
[...truncated 10972 lines...]
   [junit4] Suite: org.apache.lucene.document.TestXYMultiPolygonShapeQueries
   [junit4]   2> NOTE: download the large Jenkins line-docs file by running 'ant get-jenkins-line-docs'
in the lucene directory.
   [junit4]   2> NOTE: reproduce with: ant test  -Dtestcase=TestXYMultiPolygonShapeQueries
-Dtests.method=testRandomBig -Dtests.seed=1EF32CB9869EA5C -Dtests.multiplier=2 -Dtests.nightly=true
-Dtests.slow=true -Dtests.linedocsfile=/home/jenkins/jenkins-slave/workspace/Lucene-Solr-NightlyTests-8.x/test-data/enwiki.random.lines.txt
-Dtests.locale=es-VE -Dtests.timezone=Etc/GMT-3 -Dtests.asserts=true -Dtests.file.encoding=UTF-8
   [junit4] ERROR    161s J1 | TestXYMultiPolygonShapeQueries.testRandomBig <<<
   [junit4]    > Throwable #1: java.lang.OutOfMemoryError: Java heap space
   [junit4]    > 	at __randomizedtesting.SeedInfo.seed([1EF32CB9869EA5C:86B84F44093096DC]:0)
   [junit4]    > 	at org.apache.lucene.store.RAMFile.newBuffer(RAMFile.java:84)
   [junit4]    > 	at org.apache.lucene.store.RAMFile.addBuffer(RAMFile.java:57)
   [junit4]    > 	at org.apache.lucene.store.RAMOutputStream.switchCurrentBuffer(RAMOutputStream.java:168)
   [junit4]    > 	at org.apache.lucene.store.RAMOutputStream.writeBytes(RAMOutputStream.java:154)
   [junit4]    > 	at org.apache.lucene.store.MockIndexOutputWrapper.writeBytes(MockIndexOutputWrapper.java:141)
   [junit4]    > 	at org.apache.lucene.util.bkd.OfflinePointWriter.append(OfflinePointWriter.java:67)
   [junit4]    > 	at org.apache.lucene.util.bkd.BKDRadixSelector.offlinePartition(BKDRadixSelector.java:282)
   [junit4]    > 	at org.apache.lucene.util.bkd.BKDRadixSelector.buildHistogramAndPartition(BKDRadixSelector.java:258)
   [junit4]    > 	at org.apache.lucene.util.bkd.BKDRadixSelector.select(BKDRadixSelector.java:126)
   [junit4]    > 	at org.apache.lucene.util.bkd.BKDWriter.build(BKDWriter.java:1594)
   [junit4]    > 	at org.apache.lucene.util.bkd.BKDWriter.build(BKDWriter.java:1611)
   [junit4]    > 	at org.apache.lucene.util.bkd.BKDWriter.finish(BKDWriter.java:785)
   [junit4]    > 	at org.apache.lucene.codecs.lucene60.Lucene60PointsWriter.writeField(Lucene60PointsWriter.java:129)
   [junit4]    > 	at org.apache.lucene.codecs.PointsWriter.mergeOneField(PointsWriter.java:62)
   [junit4]    > 	at org.apache.lucene.codecs.lucene60.Lucene60PointsWriter.merge(Lucene60PointsWriter.java:219)
   [junit4]    > 	at org.apache.lucene.index.SegmentMerger.mergePoints(SegmentMerger.java:202)
   [junit4]    > 	at org.apache.lucene.index.SegmentMerger.merge(SegmentMerger.java:162)
   [junit4]    > 	at org.apache.lucene.index.IndexWriter.mergeMiddle(IndexWriter.java:4462)
   [junit4]    > 	at org.apache.lucene.index.IndexWriter.merge(IndexWriter.java:4056)
   [junit4]    > 	at org.apache.lucene.index.SerialMergeScheduler.merge(SerialMergeScheduler.java:40)
   [junit4]    > 	at org.apache.lucene.index.IndexWriter.maybeMerge(IndexWriter.java:2157)
   [junit4]    > 	at org.apache.lucene.index.IndexWriter.forceMerge(IndexWriter.java:1990)
   [junit4]    > 	at org.apache.lucene.index.IndexWriter.forceMerge(IndexWriter.java:1939)
   [junit4]    > 	at org.apache.lucene.document.BaseShapeTestCase.indexRandomShapes(BaseShapeTestCase.java:242)
   [junit4]    > 	at org.apache.lucene.document.BaseShapeTestCase.verify(BaseShapeTestCase.java:211)
   [junit4]    > 	at org.apache.lucene.document.BaseShapeTestCase.doTestRandom(BaseShapeTestCase.java:137)
   [junit4]    > 	at org.apache.lucene.document.TestXYMultiPolygonShapeQueries.testRandomBig(TestXYMultiPolygonShapeQueries.java:140)
   [junit4]   2> NOTE: leaving temporary files on disk at: /x1/jenkins/jenkins-slave/workspace/Lucene-Solr-NightlyTests-8.x/checkout/lucene/build/sandbox/test/J1/temp/lucene.document.TestXYMultiPolygonShapeQueries_1EF32CB9869EA5C-001
   [junit4]   2> NOTE: test params are: codec=Lucene80, sim=Asserting(org.apache.lucene.search.similarities.AssertingSimilarity@121c70fb),
locale=es-VE, timezone=Etc/GMT-3
   [junit4]   2> NOTE: Linux 4.4.0-137-generic amd64/Oracle Corporation 1.8.0_191 (64-bit)/cpus=4,threads=1,free=266432504,total=448790528
   [junit4]   2> NOTE: All tests run in this JVM: [TestHalfFloatPoint, TestPayloadSpanUtil,
TestXYMultiPolygonShapeQueries]
   [junit4] Completed [16/36 (1!)] on J1 in 332.08s, 5 tests, 1 error <<< FAILURES!

[...truncated 58 lines...]
   [junit4] JVM J1: stdout was not empty, see: /x1/jenkins/jenkins-slave/workspace/Lucene-Solr-NightlyTests-8.x/checkout/lucene/build/sandbox/test/temp/junit4-J1-20190709_114700_7806435937578892974602.sysout
   [junit4] >>> JVM J1 emitted unexpected output (verbatim) ----
   [junit4] java.lang.OutOfMemoryError: Java heap space
   [junit4] Dumping heap to /x1/jenkins/jenkins-slave/workspace/Lucene-Solr-NightlyTests-8.x/checkout/heapdumps/java_pid30250.hprof
...
   [junit4] Heap dump file created [428487600 bytes in 0.734 secs]
   [junit4] <<< JVM J1: EOF ----

[...truncated 15046 lines...]
BUILD FAILED
/x1/jenkins/jenkins-slave/workspace/Lucene-Solr-NightlyTests-8.x/checkout/build.xml:652: The
following error occurred while executing this line:
/x1/jenkins/jenkins-slave/workspace/Lucene-Solr-NightlyTests-8.x/checkout/build.xml:586: Some
of the tests produced a heap dump, but did not fail. Maybe a suppressed OutOfMemoryError?
Dumps created:
* java_pid30250.hprof

Total time: 310 minutes 28 seconds
Build step 'Invoke Ant' marked build as failure
Archiving artifacts
Recording test results
Email was triggered for: Failure - Any
Sending email for trigger: Failure - Any

Mime
View raw message