lucene-dev mailing list archives

Site index · List index
Message view « Date » · « Thread »
Top « Date » · « Thread »
From Policeman Jenkins Server <jenk...@thetaphi.de>
Subject [JENKINS] Lucene-Solr-master-Linux (64bit/jdk-12.0.1) - Build # 24454 - Unstable!
Date Sat, 27 Jul 2019 04:58:45 GMT
Build: https://jenkins.thetaphi.de/job/Lucene-Solr-master-Linux/24454/
Java: 64bit/jdk-12.0.1 -XX:-UseCompressedOops -XX:+UseSerialGC

7 tests failed.
FAILED:  org.apache.solr.cloud.AliasIntegrationTest.testClusterStateProviderAPI

Error Message:
[testClusterStateProviderAPI] expected:<2> but was:<1>

Stack Trace:
java.lang.AssertionError: [testClusterStateProviderAPI] expected:<2> but was:<1>
	at __randomizedtesting.SeedInfo.seed([DA122FAB54BD28A:1276BED6C6402BC1]:0)
	at org.junit.Assert.fail(Assert.java:88)
	at org.junit.Assert.failNotEquals(Assert.java:834)
	at org.junit.Assert.assertEquals(Assert.java:645)
	at org.apache.solr.cloud.AliasIntegrationTest.testClusterStateProviderAPI(AliasIntegrationTest.java:299)
	at java.base/jdk.internal.reflect.NativeMethodAccessorImpl.invoke0(Native Method)
	at java.base/jdk.internal.reflect.NativeMethodAccessorImpl.invoke(NativeMethodAccessorImpl.java:62)
	at java.base/jdk.internal.reflect.DelegatingMethodAccessorImpl.invoke(DelegatingMethodAccessorImpl.java:43)
	at java.base/java.lang.reflect.Method.invoke(Method.java:567)
	at com.carrotsearch.randomizedtesting.RandomizedRunner.invoke(RandomizedRunner.java:1750)
	at com.carrotsearch.randomizedtesting.RandomizedRunner$8.evaluate(RandomizedRunner.java:938)
	at com.carrotsearch.randomizedtesting.RandomizedRunner$9.evaluate(RandomizedRunner.java:974)
	at com.carrotsearch.randomizedtesting.RandomizedRunner$10.evaluate(RandomizedRunner.java:988)
	at com.carrotsearch.randomizedtesting.rules.SystemPropertiesRestoreRule$1.evaluate(SystemPropertiesRestoreRule.java:57)
	at org.apache.lucene.util.TestRuleSetupTeardownChained$1.evaluate(TestRuleSetupTeardownChained.java:49)
	at org.apache.lucene.util.AbstractBeforeAfterRule$1.evaluate(AbstractBeforeAfterRule.java:45)
	at org.apache.lucene.util.TestRuleThreadAndTestName$1.evaluate(TestRuleThreadAndTestName.java:48)
	at org.apache.lucene.util.TestRuleIgnoreAfterMaxFailures$1.evaluate(TestRuleIgnoreAfterMaxFailures.java:64)
	at org.apache.lucene.util.TestRuleMarkFailure$1.evaluate(TestRuleMarkFailure.java:47)
	at com.carrotsearch.randomizedtesting.rules.StatementAdapter.evaluate(StatementAdapter.java:36)
	at com.carrotsearch.randomizedtesting.ThreadLeakControl$StatementRunner.run(ThreadLeakControl.java:368)
	at com.carrotsearch.randomizedtesting.ThreadLeakControl.forkTimeoutingTask(ThreadLeakControl.java:817)
	at com.carrotsearch.randomizedtesting.ThreadLeakControl$3.evaluate(ThreadLeakControl.java:468)
	at com.carrotsearch.randomizedtesting.RandomizedRunner.runSingleTest(RandomizedRunner.java:947)
	at com.carrotsearch.randomizedtesting.RandomizedRunner$5.evaluate(RandomizedRunner.java:832)
	at com.carrotsearch.randomizedtesting.RandomizedRunner$6.evaluate(RandomizedRunner.java:883)
	at com.carrotsearch.randomizedtesting.RandomizedRunner$7.evaluate(RandomizedRunner.java:894)
	at com.carrotsearch.randomizedtesting.rules.StatementAdapter.evaluate(StatementAdapter.java:36)
	at com.carrotsearch.randomizedtesting.rules.SystemPropertiesRestoreRule$1.evaluate(SystemPropertiesRestoreRule.java:57)
	at org.apache.lucene.util.AbstractBeforeAfterRule$1.evaluate(AbstractBeforeAfterRule.java:45)
	at com.carrotsearch.randomizedtesting.rules.StatementAdapter.evaluate(StatementAdapter.java:36)
	at org.apache.lucene.util.TestRuleStoreClassName$1.evaluate(TestRuleStoreClassName.java:41)
	at com.carrotsearch.randomizedtesting.rules.NoShadowingOrOverridesOnMethodsRule$1.evaluate(NoShadowingOrOverridesOnMethodsRule.java:40)
	at com.carrotsearch.randomizedtesting.rules.NoShadowingOrOverridesOnMethodsRule$1.evaluate(NoShadowingOrOverridesOnMethodsRule.java:40)
	at com.carrotsearch.randomizedtesting.rules.StatementAdapter.evaluate(StatementAdapter.java:36)
	at com.carrotsearch.randomizedtesting.rules.StatementAdapter.evaluate(StatementAdapter.java:36)
	at org.apache.lucene.util.TestRuleAssertionsRequired$1.evaluate(TestRuleAssertionsRequired.java:53)
	at org.apache.lucene.util.TestRuleMarkFailure$1.evaluate(TestRuleMarkFailure.java:47)
	at org.apache.lucene.util.TestRuleIgnoreAfterMaxFailures$1.evaluate(TestRuleIgnoreAfterMaxFailures.java:64)
	at org.apache.lucene.util.TestRuleIgnoreTestSuites$1.evaluate(TestRuleIgnoreTestSuites.java:54)
	at com.carrotsearch.randomizedtesting.rules.StatementAdapter.evaluate(StatementAdapter.java:36)
	at com.carrotsearch.randomizedtesting.ThreadLeakControl$StatementRunner.run(ThreadLeakControl.java:368)
	at java.base/java.lang.Thread.run(Thread.java:835)


FAILED:  org.apache.solr.cloud.rule.RulesTest.doIntegrationTest

Error Message:
Timeout occurred while waiting response from server at: https://127.0.0.1:37885/solr

Stack Trace:
org.apache.solr.client.solrj.SolrServerException: Timeout occurred while waiting response from server at: https://127.0.0.1:37885/solr
	at __randomizedtesting.SeedInfo.seed([DA122FAB54BD28A:E892657BA93F2088]:0)
	at org.apache.solr.client.solrj.impl.HttpSolrClient.executeMethod(HttpSolrClient.java:667)
	at org.apache.solr.client.solrj.impl.HttpSolrClient.request(HttpSolrClient.java:262)
	at org.apache.solr.client.solrj.impl.HttpSolrClient.request(HttpSolrClient.java:245)
	at org.apache.solr.client.solrj.impl.LBSolrClient.doRequest(LBSolrClient.java:368)
	at org.apache.solr.client.solrj.impl.LBSolrClient.request(LBSolrClient.java:296)
	at org.apache.solr.client.solrj.impl.BaseCloudSolrClient.sendRequest(BaseCloudSolrClient.java:1128)
	at org.apache.solr.client.solrj.impl.BaseCloudSolrClient.requestWithRetryOnStaleState(BaseCloudSolrClient.java:897)
	at org.apache.solr.client.solrj.impl.BaseCloudSolrClient.request(BaseCloudSolrClient.java:829)
	at org.apache.solr.client.solrj.SolrRequest.process(SolrRequest.java:211)
	at org.apache.solr.client.solrj.SolrRequest.process(SolrRequest.java:228)
	at org.apache.solr.cloud.MiniSolrCloudCluster.deleteAllCollections(MiniSolrCloudCluster.java:547)
	at org.apache.solr.cloud.rule.RulesTest.removeCollections(RulesTest.java:69)
	at java.base/jdk.internal.reflect.NativeMethodAccessorImpl.invoke0(Native Method)
	at java.base/jdk.internal.reflect.NativeMethodAccessorImpl.invoke(NativeMethodAccessorImpl.java:62)
	at java.base/jdk.internal.reflect.DelegatingMethodAccessorImpl.invoke(DelegatingMethodAccessorImpl.java:43)
	at java.base/java.lang.reflect.Method.invoke(Method.java:567)
	at com.carrotsearch.randomizedtesting.RandomizedRunner.invoke(RandomizedRunner.java:1750)
	at com.carrotsearch.randomizedtesting.RandomizedRunner$10.evaluate(RandomizedRunner.java:996)
	at org.junit.rules.ExpectedException$ExpectedExceptionStatement.evaluate(ExpectedException.java:239)
	at com.carrotsearch.randomizedtesting.rules.SystemPropertiesRestoreRule$1.evaluate(SystemPropertiesRestoreRule.java:57)
	at org.apache.lucene.util.TestRuleSetupTeardownChained$1.evaluate(TestRuleSetupTeardownChained.java:49)
	at org.apache.lucene.util.AbstractBeforeAfterRule$1.evaluate(AbstractBeforeAfterRule.java:45)
	at org.apache.lucene.util.TestRuleThreadAndTestName$1.evaluate(TestRuleThreadAndTestName.java:48)
	at org.apache.lucene.util.TestRuleIgnoreAfterMaxFailures$1.evaluate(TestRuleIgnoreAfterMaxFailures.java:64)
	at org.apache.lucene.util.TestRuleMarkFailure$1.evaluate(TestRuleMarkFailure.java:47)
	at com.carrotsearch.randomizedtesting.rules.StatementAdapter.evaluate(StatementAdapter.java:36)
	at com.carrotsearch.randomizedtesting.ThreadLeakControl$StatementRunner.run(ThreadLeakControl.java:368)
	at com.carrotsearch.randomizedtesting.ThreadLeakControl.forkTimeoutingTask(ThreadLeakControl.java:817)
	at com.carrotsearch.randomizedtesting.ThreadLeakControl$3.evaluate(ThreadLeakControl.java:468)
	at com.carrotsearch.randomizedtesting.RandomizedRunner.runSingleTest(RandomizedRunner.java:947)
	at com.carrotsearch.randomizedtesting.RandomizedRunner$5.evaluate(RandomizedRunner.java:832)
	at com.carrotsearch.randomizedtesting.RandomizedRunner$6.evaluate(RandomizedRunner.java:883)
	at com.carrotsearch.randomizedtesting.RandomizedRunner$7.evaluate(RandomizedRunner.java:894)
	at com.carrotsearch.randomizedtesting.rules.StatementAdapter.evaluate(StatementAdapter.java:36)
	at com.carrotsearch.randomizedtesting.rules.SystemPropertiesRestoreRule$1.evaluate(SystemPropertiesRestoreRule.java:57)
	at org.apache.lucene.util.AbstractBeforeAfterRule$1.evaluate(AbstractBeforeAfterRule.java:45)
	at com.carrotsearch.randomizedtesting.rules.StatementAdapter.evaluate(StatementAdapter.java:36)
	at org.apache.lucene.util.TestRuleStoreClassName$1.evaluate(TestRuleStoreClassName.java:41)
	at com.carrotsearch.randomizedtesting.rules.NoShadowingOrOverridesOnMethodsRule$1.evaluate(NoShadowingOrOverridesOnMethodsRule.java:40)
	at com.carrotsearch.randomizedtesting.rules.NoShadowingOrOverridesOnMethodsRule$1.evaluate(NoShadowingOrOverridesOnMethodsRule.java:40)
	at com.carrotsearch.randomizedtesting.rules.StatementAdapter.evaluate(StatementAdapter.java:36)
	at com.carrotsearch.randomizedtesting.rules.StatementAdapter.evaluate(StatementAdapter.java:36)
	at org.apache.lucene.util.TestRuleAssertionsRequired$1.evaluate(TestRuleAssertionsRequired.java:53)
	at org.apache.lucene.util.TestRuleMarkFailure$1.evaluate(TestRuleMarkFailure.java:47)
	at org.apache.lucene.util.TestRuleIgnoreAfterMaxFailures$1.evaluate(TestRuleIgnoreAfterMaxFailures.java:64)
	at org.apache.lucene.util.TestRuleIgnoreTestSuites$1.evaluate(TestRuleIgnoreTestSuites.java:54)
	at com.carrotsearch.randomizedtesting.rules.StatementAdapter.evaluate(StatementAdapter.java:36)
	at com.carrotsearch.randomizedtesting.ThreadLeakControl$StatementRunner.run(ThreadLeakControl.java:368)
	at java.base/java.lang.Thread.run(Thread.java:835)
Caused by: java.net.SocketTimeoutException: Read timed out
	at java.base/java.net.SocketInputStream.socketRead0(Native Method)
	at java.base/java.net.SocketInputStream.socketRead(SocketInputStream.java:115)
	at java.base/java.net.SocketInputStream.read(SocketInputStream.java:168)
	at java.base/java.net.SocketInputStream.read(SocketInputStream.java:140)
	at java.base/sun.security.ssl.SSLSocketInputRecord.read(SSLSocketInputRecord.java:448)
	at java.base/sun.security.ssl.SSLSocketInputRecord.bytesInCompletePacket(SSLSocketInputRecord.java:68)
	at java.base/sun.security.ssl.SSLSocketImpl.readApplicationRecord(SSLSocketImpl.java:1132)
	at java.base/sun.security.ssl.SSLSocketImpl$AppInputStream.read(SSLSocketImpl.java:828)
	at org.apache.http.impl.io.SessionInputBufferImpl.streamRead(SessionInputBufferImpl.java:137)
	at org.apache.http.impl.io.SessionInputBufferImpl.fillBuffer(SessionInputBufferImpl.java:153)
	at org.apache.http.impl.io.SessionInputBufferImpl.readLine(SessionInputBufferImpl.java:282)
	at org.apache.http.impl.conn.DefaultHttpResponseParser.parseHead(DefaultHttpResponseParser.java:138)
	at org.apache.http.impl.conn.DefaultHttpResponseParser.parseHead(DefaultHttpResponseParser.java:56)
	at org.apache.http.impl.io.AbstractMessageParser.parse(AbstractMessageParser.java:259)
	at org.apache.http.impl.DefaultBHttpClientConnection.receiveResponseHeader(DefaultBHttpClientConnection.java:163)
	at org.apache.http.impl.conn.CPoolProxy.receiveResponseHeader(CPoolProxy.java:165)
	at org.apache.http.protocol.HttpRequestExecutor.doReceiveResponse(HttpRequestExecutor.java:273)
	at org.apache.http.protocol.HttpRequestExecutor.execute(HttpRequestExecutor.java:125)
	at org.apache.http.impl.execchain.MainClientExec.execute(MainClientExec.java:272)
	at org.apache.http.impl.execchain.ProtocolExec.execute(ProtocolExec.java:185)
	at org.apache.http.impl.execchain.RetryExec.execute(RetryExec.java:89)
	at org.apache.http.impl.execchain.RedirectExec.execute(RedirectExec.java:110)
	at org.apache.http.impl.client.InternalHttpClient.doExecute(InternalHttpClient.java:185)
	at org.apache.http.impl.client.CloseableHttpClient.execute(CloseableHttpClient.java:83)
	at org.apache.http.impl.client.CloseableHttpClient.execute(CloseableHttpClient.java:56)
	at org.apache.solr.client.solrj.impl.HttpSolrClient.executeMethod(HttpSolrClient.java:555)
	... 48 more


FAILED:  org.apache.solr.cloud.rule.RulesTest.testInvokeApi

Error Message:
Error from server at https://127.0.0.1:37885/solr: Could not find collection : rulesColl

Stack Trace:
org.apache.solr.client.solrj.impl.HttpSolrClient$RemoteSolrException: Error from server at https://127.0.0.1:37885/solr: Could not find collection : rulesColl
	at __randomizedtesting.SeedInfo.seed([DA122FAB54BD28A:BEB44FC0E1A9ACC0]:0)
	at org.apache.solr.client.solrj.impl.HttpSolrClient.executeMethod(HttpSolrClient.java:656)
	at org.apache.solr.client.solrj.impl.HttpSolrClient.request(HttpSolrClient.java:262)
	at org.apache.solr.client.solrj.impl.HttpSolrClient.request(HttpSolrClient.java:245)
	at org.apache.solr.client.solrj.impl.LBSolrClient.doRequest(LBSolrClient.java:368)
	at org.apache.solr.client.solrj.impl.LBSolrClient.request(LBSolrClient.java:296)
	at org.apache.solr.client.solrj.impl.BaseCloudSolrClient.sendRequest(BaseCloudSolrClient.java:1128)
	at org.apache.solr.client.solrj.impl.BaseCloudSolrClient.requestWithRetryOnStaleState(BaseCloudSolrClient.java:897)
	at org.apache.solr.client.solrj.impl.BaseCloudSolrClient.request(BaseCloudSolrClient.java:829)
	at org.apache.solr.client.solrj.SolrRequest.process(SolrRequest.java:211)
	at org.apache.solr.client.solrj.SolrRequest.process(SolrRequest.java:228)
	at org.apache.solr.cloud.MiniSolrCloudCluster.deleteAllCollections(MiniSolrCloudCluster.java:547)
	at org.apache.solr.cloud.rule.RulesTest.removeCollections(RulesTest.java:69)
	at java.base/jdk.internal.reflect.NativeMethodAccessorImpl.invoke0(Native Method)
	at java.base/jdk.internal.reflect.NativeMethodAccessorImpl.invoke(NativeMethodAccessorImpl.java:62)
	at java.base/jdk.internal.reflect.DelegatingMethodAccessorImpl.invoke(DelegatingMethodAccessorImpl.java:43)
	at java.base/java.lang.reflect.Method.invoke(Method.java:567)
	at com.carrotsearch.randomizedtesting.RandomizedRunner.invoke(RandomizedRunner.java:1750)
	at com.carrotsearch.randomizedtesting.RandomizedRunner$10.evaluate(RandomizedRunner.java:996)
	at org.junit.rules.ExpectedException$ExpectedExceptionStatement.evaluate(ExpectedException.java:239)
	at com.carrotsearch.randomizedtesting.rules.SystemPropertiesRestoreRule$1.evaluate(SystemPropertiesRestoreRule.java:57)
	at org.apache.lucene.util.TestRuleSetupTeardownChained$1.evaluate(TestRuleSetupTeardownChained.java:49)
	at org.apache.lucene.util.AbstractBeforeAfterRule$1.evaluate(AbstractBeforeAfterRule.java:45)
	at org.apache.lucene.util.TestRuleThreadAndTestName$1.evaluate(TestRuleThreadAndTestName.java:48)
	at org.apache.lucene.util.TestRuleIgnoreAfterMaxFailures$1.evaluate(TestRuleIgnoreAfterMaxFailures.java:64)
	at org.apache.lucene.util.TestRuleMarkFailure$1.evaluate(TestRuleMarkFailure.java:47)
	at com.carrotsearch.randomizedtesting.rules.StatementAdapter.evaluate(StatementAdapter.java:36)
	at com.carrotsearch.randomizedtesting.ThreadLeakControl$StatementRunner.run(ThreadLeakControl.java:368)
	at com.carrotsearch.randomizedtesting.ThreadLeakControl.forkTimeoutingTask(ThreadLeakControl.java:817)
	at com.carrotsearch.randomizedtesting.ThreadLeakControl$3.evaluate(ThreadLeakControl.java:468)
	at com.carrotsearch.randomizedtesting.RandomizedRunner.runSingleTest(RandomizedRunner.java:947)
	at com.carrotsearch.randomizedtesting.RandomizedRunner$5.evaluate(RandomizedRunner.java:832)
	at com.carrotsearch.randomizedtesting.RandomizedRunner$6.evaluate(RandomizedRunner.java:883)
	at com.carrotsearch.randomizedtesting.RandomizedRunner$7.evaluate(RandomizedRunner.java:894)
	at com.carrotsearch.randomizedtesting.rules.StatementAdapter.evaluate(StatementAdapter.java:36)
	at com.carrotsearch.randomizedtesting.rules.SystemPropertiesRestoreRule$1.evaluate(SystemPropertiesRestoreRule.java:57)
	at org.apache.lucene.util.AbstractBeforeAfterRule$1.evaluate(AbstractBeforeAfterRule.java:45)
	at com.carrotsearch.randomizedtesting.rules.StatementAdapter.evaluate(StatementAdapter.java:36)
	at org.apache.lucene.util.TestRuleStoreClassName$1.evaluate(TestRuleStoreClassName.java:41)
	at com.carrotsearch.randomizedtesting.rules.NoShadowingOrOverridesOnMethodsRule$1.evaluate(NoShadowingOrOverridesOnMethodsRule.java:40)
	at com.carrotsearch.randomizedtesting.rules.NoShadowingOrOverridesOnMethodsRule$1.evaluate(NoShadowingOrOverridesOnMethodsRule.java:40)
	at com.carrotsearch.randomizedtesting.rules.StatementAdapter.evaluate(StatementAdapter.java:36)
	at com.carrotsearch.randomizedtesting.rules.StatementAdapter.evaluate(StatementAdapter.java:36)
	at org.apache.lucene.util.TestRuleAssertionsRequired$1.evaluate(TestRuleAssertionsRequired.java:53)
	at org.apache.lucene.util.TestRuleMarkFailure$1.evaluate(TestRuleMarkFailure.java:47)
	at org.apache.lucene.util.TestRuleIgnoreAfterMaxFailures$1.evaluate(TestRuleIgnoreAfterMaxFailures.java:64)
	at org.apache.lucene.util.TestRuleIgnoreTestSuites$1.evaluate(TestRuleIgnoreTestSuites.java:54)
	at com.carrotsearch.randomizedtesting.rules.StatementAdapter.evaluate(StatementAdapter.java:36)
	at com.carrotsearch.randomizedtesting.ThreadLeakControl$StatementRunner.run(ThreadLeakControl.java:368)
	at java.base/java.lang.Thread.run(Thread.java:835)


FAILED:  org.apache.solr.cloud.rule.RulesTest.doIntegrationTest

Error Message:
Timeout occurred while waiting response from server at: https://127.0.0.1:45153/solr

Stack Trace:
org.apache.solr.client.solrj.SolrServerException: Timeout occurred while waiting response from server at: https://127.0.0.1:45153/solr
	at __randomizedtesting.SeedInfo.seed([DA122FAB54BD28A:E892657BA93F2088]:0)
	at org.apache.solr.client.solrj.impl.HttpSolrClient.executeMethod(HttpSolrClient.java:667)
	at org.apache.solr.client.solrj.impl.HttpSolrClient.request(HttpSolrClient.java:262)
	at org.apache.solr.client.solrj.impl.HttpSolrClient.request(HttpSolrClient.java:245)
	at org.apache.solr.client.solrj.impl.LBSolrClient.doRequest(LBSolrClient.java:368)
	at org.apache.solr.client.solrj.impl.LBSolrClient.request(LBSolrClient.java:296)
	at org.apache.solr.client.solrj.impl.BaseCloudSolrClient.sendRequest(BaseCloudSolrClient.java:1128)
	at org.apache.solr.client.solrj.impl.BaseCloudSolrClient.requestWithRetryOnStaleState(BaseCloudSolrClient.java:897)
	at org.apache.solr.client.solrj.impl.BaseCloudSolrClient.request(BaseCloudSolrClient.java:829)
	at org.apache.solr.client.solrj.SolrRequest.process(SolrRequest.java:211)
	at org.apache.solr.client.solrj.SolrRequest.process(SolrRequest.java:228)
	at org.apache.solr.cloud.MiniSolrCloudCluster.deleteAllCollections(MiniSolrCloudCluster.java:547)
	at org.apache.solr.cloud.rule.RulesTest.removeCollections(RulesTest.java:69)
	at java.base/jdk.internal.reflect.NativeMethodAccessorImpl.invoke0(Native Method)
	at java.base/jdk.internal.reflect.NativeMethodAccessorImpl.invoke(NativeMethodAccessorImpl.java:62)
	at java.base/jdk.internal.reflect.DelegatingMethodAccessorImpl.invoke(DelegatingMethodAccessorImpl.java:43)
	at java.base/java.lang.reflect.Method.invoke(Method.java:567)
	at com.carrotsearch.randomizedtesting.RandomizedRunner.invoke(RandomizedRunner.java:1750)
	at com.carrotsearch.randomizedtesting.RandomizedRunner$10.evaluate(RandomizedRunner.java:996)
	at org.junit.rules.ExpectedException$ExpectedExceptionStatement.evaluate(ExpectedException.java:239)
	at com.carrotsearch.randomizedtesting.rules.SystemPropertiesRestoreRule$1.evaluate(SystemPropertiesRestoreRule.java:57)
	at org.apache.lucene.util.TestRuleSetupTeardownChained$1.evaluate(TestRuleSetupTeardownChained.java:49)
	at org.apache.lucene.util.AbstractBeforeAfterRule$1.evaluate(AbstractBeforeAfterRule.java:45)
	at org.apache.lucene.util.TestRuleThreadAndTestName$1.evaluate(TestRuleThreadAndTestName.java:48)
	at org.apache.lucene.util.TestRuleIgnoreAfterMaxFailures$1.evaluate(TestRuleIgnoreAfterMaxFailures.java:64)
	at org.apache.lucene.util.TestRuleMarkFailure$1.evaluate(TestRuleMarkFailure.java:47)
	at com.carrotsearch.randomizedtesting.rules.StatementAdapter.evaluate(StatementAdapter.java:36)
	at com.carrotsearch.randomizedtesting.ThreadLeakControl$StatementRunner.run(ThreadLeakControl.java:368)
	at com.carrotsearch.randomizedtesting.ThreadLeakControl.forkTimeoutingTask(ThreadLeakControl.java:817)
	at com.carrotsearch.randomizedtesting.ThreadLeakControl$3.evaluate(ThreadLeakControl.java:468)
	at com.carrotsearch.randomizedtesting.RandomizedRunner.runSingleTest(RandomizedRunner.java:947)
	at com.carrotsearch.randomizedtesting.RandomizedRunner$5.evaluate(RandomizedRunner.java:832)
	at com.carrotsearch.randomizedtesting.RandomizedRunner$6.evaluate(RandomizedRunner.java:883)
	at com.carrotsearch.randomizedtesting.RandomizedRunner$7.evaluate(RandomizedRunner.java:894)
	at com.carrotsearch.randomizedtesting.rules.StatementAdapter.evaluate(StatementAdapter.java:36)
	at com.carrotsearch.randomizedtesting.rules.SystemPropertiesRestoreRule$1.evaluate(SystemPropertiesRestoreRule.java:57)
	at org.apache.lucene.util.AbstractBeforeAfterRule$1.evaluate(AbstractBeforeAfterRule.java:45)
	at com.carrotsearch.randomizedtesting.rules.StatementAdapter.evaluate(StatementAdapter.java:36)
	at org.apache.lucene.util.TestRuleStoreClassName$1.evaluate(TestRuleStoreClassName.java:41)
	at com.carrotsearch.randomizedtesting.rules.NoShadowingOrOverridesOnMethodsRule$1.evaluate(NoShadowingOrOverridesOnMethodsRule.java:40)
	at com.carrotsearch.randomizedtesting.rules.NoShadowingOrOverridesOnMethodsRule$1.evaluate(NoShadowingOrOverridesOnMethodsRule.java:40)
	at com.carrotsearch.randomizedtesting.rules.StatementAdapter.evaluate(StatementAdapter.java:36)
	at com.carrotsearch.randomizedtesting.rules.StatementAdapter.evaluate(StatementAdapter.java:36)
	at org.apache.lucene.util.TestRuleAssertionsRequired$1.evaluate(TestRuleAssertionsRequired.java:53)
	at org.apache.lucene.util.TestRuleMarkFailure$1.evaluate(TestRuleMarkFailure.java:47)
	at org.apache.lucene.util.TestRuleIgnoreAfterMaxFailures$1.evaluate(TestRuleIgnoreAfterMaxFailures.java:64)
	at org.apache.lucene.util.TestRuleIgnoreTestSuites$1.evaluate(TestRuleIgnoreTestSuites.java:54)
	at com.carrotsearch.randomizedtesting.rules.StatementAdapter.evaluate(StatementAdapter.java:36)
	at com.carrotsearch.randomizedtesting.ThreadLeakControl$StatementRunner.run(ThreadLeakControl.java:368)
	at java.base/java.lang.Thread.run(Thread.java:835)
Caused by: java.net.SocketTimeoutException: Read timed out
	at java.base/java.net.SocketInputStream.socketRead0(Native Method)
	at java.base/java.net.SocketInputStream.socketRead(SocketInputStream.java:115)
	at java.base/java.net.SocketInputStream.read(SocketInputStream.java:168)
	at java.base/java.net.SocketInputStream.read(SocketInputStream.java:140)
	at java.base/sun.security.ssl.SSLSocketInputRecord.read(SSLSocketInputRecord.java:448)
	at java.base/sun.security.ssl.SSLSocketInputRecord.bytesInCompletePacket(SSLSocketInputRecord.java:68)
	at java.base/sun.security.ssl.SSLSocketImpl.readApplicationRecord(SSLSocketImpl.java:1132)
	at java.base/sun.security.ssl.SSLSocketImpl$AppInputStream.read(SSLSocketImpl.java:828)
	at org.apache.http.impl.io.SessionInputBufferImpl.streamRead(SessionInputBufferImpl.java:137)
	at org.apache.http.impl.io.SessionInputBufferImpl.fillBuffer(SessionInputBufferImpl.java:153)
	at org.apache.http.impl.io.SessionInputBufferImpl.readLine(SessionInputBufferImpl.java:282)
	at org.apache.http.impl.conn.DefaultHttpResponseParser.parseHead(DefaultHttpResponseParser.java:138)
	at org.apache.http.impl.conn.DefaultHttpResponseParser.parseHead(DefaultHttpResponseParser.java:56)
	at org.apache.http.impl.io.AbstractMessageParser.parse(AbstractMessageParser.java:259)
	at org.apache.http.impl.DefaultBHttpClientConnection.receiveResponseHeader(DefaultBHttpClientConnection.java:163)
	at org.apache.http.impl.conn.CPoolProxy.receiveResponseHeader(CPoolProxy.java:165)
	at org.apache.http.protocol.HttpRequestExecutor.doReceiveResponse(HttpRequestExecutor.java:273)
	at org.apache.http.protocol.HttpRequestExecutor.execute(HttpRequestExecutor.java:125)
	at org.apache.http.impl.execchain.MainClientExec.execute(MainClientExec.java:272)
	at org.apache.http.impl.execchain.ProtocolExec.execute(ProtocolExec.java:185)
	at org.apache.http.impl.execchain.RetryExec.execute(RetryExec.java:89)
	at org.apache.http.impl.execchain.RedirectExec.execute(RedirectExec.java:110)
	at org.apache.http.impl.client.InternalHttpClient.doExecute(InternalHttpClient.java:185)
	at org.apache.http.impl.client.CloseableHttpClient.execute(CloseableHttpClient.java:83)
	at org.apache.http.impl.client.CloseableHttpClient.execute(CloseableHttpClient.java:56)
	at org.apache.solr.client.solrj.impl.HttpSolrClient.executeMethod(HttpSolrClient.java:555)
	... 48 more


FAILED:  org.apache.solr.cloud.rule.RulesTest.testInvokeApi

Error Message:
Error from server at https://127.0.0.1:45153/solr: Could not find collection : rulesColl

Stack Trace:
org.apache.solr.client.solrj.impl.HttpSolrClient$RemoteSolrException: Error from server at https://127.0.0.1:45153/solr: Could not find collection : rulesColl
	at __randomizedtesting.SeedInfo.seed([DA122FAB54BD28A:BEB44FC0E1A9ACC0]:0)
	at org.apache.solr.client.solrj.impl.HttpSolrClient.executeMethod(HttpSolrClient.java:656)
	at org.apache.solr.client.solrj.impl.HttpSolrClient.request(HttpSolrClient.java:262)
	at org.apache.solr.client.solrj.impl.HttpSolrClient.request(HttpSolrClient.java:245)
	at org.apache.solr.client.solrj.impl.LBSolrClient.doRequest(LBSolrClient.java:368)
	at org.apache.solr.client.solrj.impl.LBSolrClient.request(LBSolrClient.java:296)
	at org.apache.solr.client.solrj.impl.BaseCloudSolrClient.sendRequest(BaseCloudSolrClient.java:1128)
	at org.apache.solr.client.solrj.impl.BaseCloudSolrClient.requestWithRetryOnStaleState(BaseCloudSolrClient.java:897)
	at org.apache.solr.client.solrj.impl.BaseCloudSolrClient.request(BaseCloudSolrClient.java:829)
	at org.apache.solr.client.solrj.SolrRequest.process(SolrRequest.java:211)
	at org.apache.solr.client.solrj.SolrRequest.process(SolrRequest.java:228)
	at org.apache.solr.cloud.MiniSolrCloudCluster.deleteAllCollections(MiniSolrCloudCluster.java:547)
	at org.apache.solr.cloud.rule.RulesTest.removeCollections(RulesTest.java:69)
	at java.base/jdk.internal.reflect.NativeMethodAccessorImpl.invoke0(Native Method)
	at java.base/jdk.internal.reflect.NativeMethodAccessorImpl.invoke(NativeMethodAccessorImpl.java:62)
	at java.base/jdk.internal.reflect.DelegatingMethodAccessorImpl.invoke(DelegatingMethodAccessorImpl.java:43)
	at java.base/java.lang.reflect.Method.invoke(Method.java:567)
	at com.carrotsearch.randomizedtesting.RandomizedRunner.invoke(RandomizedRunner.java:1750)
	at com.carrotsearch.randomizedtesting.RandomizedRunner$10.evaluate(RandomizedRunner.java:996)
	at org.junit.rules.ExpectedException$ExpectedExceptionStatement.evaluate(ExpectedException.java:239)
	at com.carrotsearch.randomizedtesting.rules.SystemPropertiesRestoreRule$1.evaluate(SystemPropertiesRestoreRule.java:57)
	at org.apache.lucene.util.TestRuleSetupTeardownChained$1.evaluate(TestRuleSetupTeardownChained.java:49)
	at org.apache.lucene.util.AbstractBeforeAfterRule$1.evaluate(AbstractBeforeAfterRule.java:45)
	at org.apache.lucene.util.TestRuleThreadAndTestName$1.evaluate(TestRuleThreadAndTestName.java:48)
	at org.apache.lucene.util.TestRuleIgnoreAfterMaxFailures$1.evaluate(TestRuleIgnoreAfterMaxFailures.java:64)
	at org.apache.lucene.util.TestRuleMarkFailure$1.evaluate(TestRuleMarkFailure.java:47)
	at com.carrotsearch.randomizedtesting.rules.StatementAdapter.evaluate(StatementAdapter.java:36)
	at com.carrotsearch.randomizedtesting.ThreadLeakControl$StatementRunner.run(ThreadLeakControl.java:368)
	at com.carrotsearch.randomizedtesting.ThreadLeakControl.forkTimeoutingTask(ThreadLeakControl.java:817)
	at com.carrotsearch.randomizedtesting.ThreadLeakControl$3.evaluate(ThreadLeakControl.java:468)
	at com.carrotsearch.randomizedtesting.RandomizedRunner.runSingleTest(RandomizedRunner.java:947)
	at com.carrotsearch.randomizedtesting.RandomizedRunner$5.evaluate(RandomizedRunner.java:832)
	at com.carrotsearch.randomizedtesting.RandomizedRunner$6.evaluate(RandomizedRunner.java:883)
	at com.carrotsearch.randomizedtesting.RandomizedRunner$7.evaluate(RandomizedRunner.java:894)
	at com.carrotsearch.randomizedtesting.rules.StatementAdapter.evaluate(StatementAdapter.java:36)
	at com.carrotsearch.randomizedtesting.rules.SystemPropertiesRestoreRule$1.evaluate(SystemPropertiesRestoreRule.java:57)
	at org.apache.lucene.util.AbstractBeforeAfterRule$1.evaluate(AbstractBeforeAfterRule.java:45)
	at com.carrotsearch.randomizedtesting.rules.StatementAdapter.evaluate(StatementAdapter.java:36)
	at org.apache.lucene.util.TestRuleStoreClassName$1.evaluate(TestRuleStoreClassName.java:41)
	at com.carrotsearch.randomizedtesting.rules.NoShadowingOrOverridesOnMethodsRule$1.evaluate(NoShadowingOrOverridesOnMethodsRule.java:40)
	at com.carrotsearch.randomizedtesting.rules.NoShadowingOrOverridesOnMethodsRule$1.evaluate(NoShadowingOrOverridesOnMethodsRule.java:40)
	at com.carrotsearch.randomizedtesting.rules.StatementAdapter.evaluate(StatementAdapter.java:36)
	at com.carrotsearch.randomizedtesting.rules.StatementAdapter.evaluate(StatementAdapter.java:36)
	at org.apache.lucene.util.TestRuleAssertionsRequired$1.evaluate(TestRuleAssertionsRequired.java:53)
	at org.apache.lucene.util.TestRuleMarkFailure$1.evaluate(TestRuleMarkFailure.java:47)
	at org.apache.lucene.util.TestRuleIgnoreAfterMaxFailures$1.evaluate(TestRuleIgnoreAfterMaxFailures.java:64)
	at org.apache.lucene.util.TestRuleIgnoreTestSuites$1.evaluate(TestRuleIgnoreTestSuites.java:54)
	at com.carrotsearch.randomizedtesting.rules.StatementAdapter.evaluate(StatementAdapter.java:36)
	at com.carrotsearch.randomizedtesting.ThreadLeakControl$StatementRunner.run(ThreadLeakControl.java:368)
	at java.base/java.lang.Thread.run(Thread.java:835)


FAILED:  org.apache.solr.cloud.rule.RulesTest.doIntegrationTest

Error Message:
Timeout occurred while waiting response from server at: https://127.0.0.1:37189/solr

Stack Trace:
org.apache.solr.client.solrj.SolrServerException: Timeout occurred while waiting response from server at: https://127.0.0.1:37189/solr
	at __randomizedtesting.SeedInfo.seed([DA122FAB54BD28A:E892657BA93F2088]:0)
	at org.apache.solr.client.solrj.impl.HttpSolrClient.executeMethod(HttpSolrClient.java:667)
	at org.apache.solr.client.solrj.impl.HttpSolrClient.request(HttpSolrClient.java:262)
	at org.apache.solr.client.solrj.impl.HttpSolrClient.request(HttpSolrClient.java:245)
	at org.apache.solr.client.solrj.impl.LBSolrClient.doRequest(LBSolrClient.java:368)
	at org.apache.solr.client.solrj.impl.LBSolrClient.request(LBSolrClient.java:296)
	at org.apache.solr.client.solrj.impl.BaseCloudSolrClient.sendRequest(BaseCloudSolrClient.java:1128)
	at org.apache.solr.client.solrj.impl.BaseCloudSolrClient.requestWithRetryOnStaleState(BaseCloudSolrClient.java:897)
	at org.apache.solr.client.solrj.impl.BaseCloudSolrClient.request(BaseCloudSolrClient.java:829)
	at org.apache.solr.client.solrj.SolrRequest.process(SolrRequest.java:211)
	at org.apache.solr.client.solrj.SolrRequest.process(SolrRequest.java:228)
	at org.apache.solr.cloud.MiniSolrCloudCluster.deleteAllCollections(MiniSolrCloudCluster.java:547)
	at org.apache.solr.cloud.rule.RulesTest.removeCollections(RulesTest.java:69)
	at java.base/jdk.internal.reflect.NativeMethodAccessorImpl.invoke0(Native Method)
	at java.base/jdk.internal.reflect.NativeMethodAccessorImpl.invoke(NativeMethodAccessorImpl.java:62)
	at java.base/jdk.internal.reflect.DelegatingMethodAccessorImpl.invoke(DelegatingMethodAccessorImpl.java:43)
	at java.base/java.lang.reflect.Method.invoke(Method.java:567)
	at com.carrotsearch.randomizedtesting.RandomizedRunner.invoke(RandomizedRunner.java:1750)
	at com.carrotsearch.randomizedtesting.RandomizedRunner$10.evaluate(RandomizedRunner.java:996)
	at org.junit.rules.ExpectedException$ExpectedExceptionStatement.evaluate(ExpectedException.java:239)
	at com.carrotsearch.randomizedtesting.rules.SystemPropertiesRestoreRule$1.evaluate(SystemPropertiesRestoreRule.java:57)
	at org.apache.lucene.util.TestRuleSetupTeardownChained$1.evaluate(TestRuleSetupTeardownChained.java:49)
	at org.apache.lucene.util.AbstractBeforeAfterRule$1.evaluate(AbstractBeforeAfterRule.java:45)
	at org.apache.lucene.util.TestRuleThreadAndTestName$1.evaluate(TestRuleThreadAndTestName.java:48)
	at org.apache.lucene.util.TestRuleIgnoreAfterMaxFailures$1.evaluate(TestRuleIgnoreAfterMaxFailures.java:64)
	at org.apache.lucene.util.TestRuleMarkFailure$1.evaluate(TestRuleMarkFailure.java:47)
	at com.carrotsearch.randomizedtesting.rules.StatementAdapter.evaluate(StatementAdapter.java:36)
	at com.carrotsearch.randomizedtesting.ThreadLeakControl$StatementRunner.run(ThreadLeakControl.java:368)
	at com.carrotsearch.randomizedtesting.ThreadLeakControl.forkTimeoutingTask(ThreadLeakControl.java:817)
	at com.carrotsearch.randomizedtesting.ThreadLeakControl$3.evaluate(ThreadLeakControl.java:468)
	at com.carrotsearch.randomizedtesting.RandomizedRunner.runSingleTest(RandomizedRunner.java:947)
	at com.carrotsearch.randomizedtesting.RandomizedRunner$5.evaluate(RandomizedRunner.java:832)
	at com.carrotsearch.randomizedtesting.RandomizedRunner$6.evaluate(RandomizedRunner.java:883)
	at com.carrotsearch.randomizedtesting.RandomizedRunner$7.evaluate(RandomizedRunner.java:894)
	at com.carrotsearch.randomizedtesting.rules.StatementAdapter.evaluate(StatementAdapter.java:36)
	at com.carrotsearch.randomizedtesting.rules.SystemPropertiesRestoreRule$1.evaluate(SystemPropertiesRestoreRule.java:57)
	at org.apache.lucene.util.AbstractBeforeAfterRule$1.evaluate(AbstractBeforeAfterRule.java:45)
	at com.carrotsearch.randomizedtesting.rules.StatementAdapter.evaluate(StatementAdapter.java:36)
	at org.apache.lucene.util.TestRuleStoreClassName$1.evaluate(TestRuleStoreClassName.java:41)
	at com.carrotsearch.randomizedtesting.rules.NoShadowingOrOverridesOnMethodsRule$1.evaluate(NoShadowingOrOverridesOnMethodsRule.java:40)
	at com.carrotsearch.randomizedtesting.rules.NoShadowingOrOverridesOnMethodsRule$1.evaluate(NoShadowingOrOverridesOnMethodsRule.java:40)
	at com.carrotsearch.randomizedtesting.rules.StatementAdapter.evaluate(StatementAdapter.java:36)
	at com.carrotsearch.randomizedtesting.rules.StatementAdapter.evaluate(StatementAdapter.java:36)
	at org.apache.lucene.util.TestRuleAssertionsRequired$1.evaluate(TestRuleAssertionsRequired.java:53)
	at org.apache.lucene.util.TestRuleMarkFailure$1.evaluate(TestRuleMarkFailure.java:47)
	at org.apache.lucene.util.TestRuleIgnoreAfterMaxFailures$1.evaluate(TestRuleIgnoreAfterMaxFailures.java:64)
	at org.apache.lucene.util.TestRuleIgnoreTestSuites$1.evaluate(TestRuleIgnoreTestSuites.java:54)
	at com.carrotsearch.randomizedtesting.rules.StatementAdapter.evaluate(StatementAdapter.java:36)
	at com.carrotsearch.randomizedtesting.ThreadLeakControl$StatementRunner.run(ThreadLeakControl.java:368)
	at java.base/java.lang.Thread.run(Thread.java:835)
Caused by: java.net.SocketTimeoutException: Read timed out
	at java.base/java.net.SocketInputStream.socketRead0(Native Method)
	at java.base/java.net.SocketInputStream.socketRead(SocketInputStream.java:115)
	at java.base/java.net.SocketInputStream.read(SocketInputStream.java:168)
	at java.base/java.net.SocketInputStream.read(SocketInputStream.java:140)
	at java.base/sun.security.ssl.SSLSocketInputRecord.read(SSLSocketInputRecord.java:448)
	at java.base/sun.security.ssl.SSLSocketInputRecord.bytesInCompletePacket(SSLSocketInputRecord.java:68)
	at java.base/sun.security.ssl.SSLSocketImpl.readApplicationRecord(SSLSocketImpl.java:1132)
	at java.base/sun.security.ssl.SSLSocketImpl$AppInputStream.read(SSLSocketImpl.java:828)
	at org.apache.http.impl.io.SessionInputBufferImpl.streamRead(SessionInputBufferImpl.java:137)
	at org.apache.http.impl.io.SessionInputBufferImpl.fillBuffer(SessionInputBufferImpl.java:153)
	at org.apache.http.impl.io.SessionInputBufferImpl.readLine(SessionInputBufferImpl.java:282)
	at org.apache.http.impl.conn.DefaultHttpResponseParser.parseHead(DefaultHttpResponseParser.java:138)
	at org.apache.http.impl.conn.DefaultHttpResponseParser.parseHead(DefaultHttpResponseParser.java:56)
	at org.apache.http.impl.io.AbstractMessageParser.parse(AbstractMessageParser.java:259)
	at org.apache.http.impl.DefaultBHttpClientConnection.receiveResponseHeader(DefaultBHttpClientConnection.java:163)
	at org.apache.http.impl.conn.CPoolProxy.receiveResponseHeader(CPoolProxy.java:165)
	at org.apache.http.protocol.HttpRequestExecutor.doReceiveResponse(HttpRequestExecutor.java:273)
	at org.apache.http.protocol.HttpRequestExecutor.execute(HttpRequestExecutor.java:125)
	at org.apache.http.impl.execchain.MainClientExec.execute(MainClientExec.java:272)
	at org.apache.http.impl.execchain.ProtocolExec.execute(ProtocolExec.java:185)
	at org.apache.http.impl.execchain.RetryExec.execute(RetryExec.java:89)
	at org.apache.http.impl.execchain.RedirectExec.execute(RedirectExec.java:110)
	at org.apache.http.impl.client.InternalHttpClient.doExecute(InternalHttpClient.java:185)
	at org.apache.http.impl.client.CloseableHttpClient.execute(CloseableHttpClient.java:83)
	at org.apache.http.impl.client.CloseableHttpClient.execute(CloseableHttpClient.java:56)
	at org.apache.solr.client.solrj.impl.HttpSolrClient.executeMethod(HttpSolrClient.java:555)
	... 48 more


FAILED:  org.apache.solr.cloud.rule.RulesTest.testInvokeApi

Error Message:
Error from server at https://127.0.0.1:37189/solr: Could not find collection : rulesColl

Stack Trace:
org.apache.solr.client.solrj.impl.HttpSolrClient$RemoteSolrException: Error from server at https://127.0.0.1:37189/solr: Could not find collection : rulesColl
	at __randomizedtesting.SeedInfo.seed([DA122FAB54BD28A:BEB44FC0E1A9ACC0]:0)
	at org.apache.solr.client.solrj.impl.HttpSolrClient.executeMethod(HttpSolrClient.java:656)
	at org.apache.solr.client.solrj.impl.HttpSolrClient.request(HttpSolrClient.java:262)
	at org.apache.solr.client.solrj.impl.HttpSolrClient.request(HttpSolrClient.java:245)
	at org.apache.solr.client.solrj.impl.LBSolrClient.doRequest(LBSolrClient.java:368)
	at org.apache.solr.client.solrj.impl.LBSolrClient.request(LBSolrClient.java:296)
	at org.apache.solr.client.solrj.impl.BaseCloudSolrClient.sendRequest(BaseCloudSolrClient.java:1128)
	at org.apache.solr.client.solrj.impl.BaseCloudSolrClient.requestWithRetryOnStaleState(BaseCloudSolrClient.java:897)
	at org.apache.solr.client.solrj.impl.BaseCloudSolrClient.request(BaseCloudSolrClient.java:829)
	at org.apache.solr.client.solrj.SolrRequest.process(SolrRequest.java:211)
	at org.apache.solr.client.solrj.SolrRequest.process(SolrRequest.java:228)
	at org.apache.solr.cloud.MiniSolrCloudCluster.deleteAllCollections(MiniSolrCloudCluster.java:547)
	at org.apache.solr.cloud.rule.RulesTest.removeCollections(RulesTest.java:69)
	at java.base/jdk.internal.reflect.NativeMethodAccessorImpl.invoke0(Native Method)
	at java.base/jdk.internal.reflect.NativeMethodAccessorImpl.invoke(NativeMethodAccessorImpl.java:62)
	at java.base/jdk.internal.reflect.DelegatingMethodAccessorImpl.invoke(DelegatingMethodAccessorImpl.java:43)
	at java.base/java.lang.reflect.Method.invoke(Method.java:567)
	at com.carrotsearch.randomizedtesting.RandomizedRunner.invoke(RandomizedRunner.java:1750)
	at com.carrotsearch.randomizedtesting.RandomizedRunner$10.evaluate(RandomizedRunner.java:996)
	at org.junit.rules.ExpectedException$ExpectedExceptionStatement.evaluate(ExpectedException.java:239)
	at com.carrotsearch.randomizedtesting.rules.SystemPropertiesRestoreRule$1.evaluate(SystemPropertiesRestoreRule.java:57)
	at org.apache.lucene.util.TestRuleSetupTeardownChained$1.evaluate(TestRuleSetupTeardownChained.java:49)
	at org.apache.lucene.util.AbstractBeforeAfterRule$1.evaluate(AbstractBeforeAfterRule.java:45)
	at org.apache.lucene.util.TestRuleThreadAndTestName$1.evaluate(TestRuleThreadAndTestName.java:48)
	at org.apache.lucene.util.TestRuleIgnoreAfterMaxFailures$1.evaluate(TestRuleIgnoreAfterMaxFailures.java:64)
	at org.apache.lucene.util.TestRuleMarkFailure$1.evaluate(TestRuleMarkFailure.java:47)
	at com.carrotsearch.randomizedtesting.rules.StatementAdapter.evaluate(StatementAdapter.java:36)
	at com.carrotsearch.randomizedtesting.ThreadLeakControl$StatementRunner.run(ThreadLeakControl.java:368)
	at com.carrotsearch.randomizedtesting.ThreadLeakControl.forkTimeoutingTask(ThreadLeakControl.java:817)
	at com.carrotsearch.randomizedtesting.ThreadLeakControl$3.evaluate(ThreadLeakControl.java:468)
	at com.carrotsearch.randomizedtesting.RandomizedRunner.runSingleTest(RandomizedRunner.java:947)
	at com.carrotsearch.randomizedtesting.RandomizedRunner$5.evaluate(RandomizedRunner.java:832)
	at com.carrotsearch.randomizedtesting.RandomizedRunner$6.evaluate(RandomizedRunner.java:883)
	at com.carrotsearch.randomizedtesting.RandomizedRunner$7.evaluate(RandomizedRunner.java:894)
	at com.carrotsearch.randomizedtesting.rules.StatementAdapter.evaluate(StatementAdapter.java:36)
	at com.carrotsearch.randomizedtesting.rules.SystemPropertiesRestoreRule$1.evaluate(SystemPropertiesRestoreRule.java:57)
	at org.apache.lucene.util.AbstractBeforeAfterRule$1.evaluate(AbstractBeforeAfterRule.java:45)
	at com.carrotsearch.randomizedtesting.rules.StatementAdapter.evaluate(StatementAdapter.java:36)
	at org.apache.lucene.util.TestRuleStoreClassName$1.evaluate(TestRuleStoreClassName.java:41)
	at com.carrotsearch.randomizedtesting.rules.NoShadowingOrOverridesOnMethodsRule$1.evaluate(NoShadowingOrOverridesOnMethodsRule.java:40)
	at com.carrotsearch.randomizedtesting.rules.NoShadowingOrOverridesOnMethodsRule$1.evaluate(NoShadowingOrOverridesOnMethodsRule.java:40)
	at com.carrotsearch.randomizedtesting.rules.StatementAdapter.evaluate(StatementAdapter.java:36)
	at com.carrotsearch.randomizedtesting.rules.StatementAdapter.evaluate(StatementAdapter.java:36)
	at org.apache.lucene.util.TestRuleAssertionsRequired$1.evaluate(TestRuleAssertionsRequired.java:53)
	at org.apache.lucene.util.TestRuleMarkFailure$1.evaluate(TestRuleMarkFailure.java:47)
	at org.apache.lucene.util.TestRuleIgnoreAfterMaxFailures$1.evaluate(TestRuleIgnoreAfterMaxFailures.java:64)
	at org.apache.lucene.util.TestRuleIgnoreTestSuites$1.evaluate(TestRuleIgnoreTestSuites.java:54)
	at com.carrotsearch.randomizedtesting.rules.StatementAdapter.evaluate(StatementAdapter.java:36)
	at com.carrotsearch.randomizedtesting.ThreadLeakControl$StatementRunner.run(ThreadLeakControl.java:368)
	at java.base/java.lang.Thread.run(Thread.java:835)




Build Log:
[...truncated 14093 lines...]
   [junit4] Suite: org.apache.solr.cloud.AliasIntegrationTest
   [junit4]   2> Creating dataDir: /home/jenkins/workspace/Lucene-Solr-master-Linux/solr/build/solr-core/test/J2/temp/solr.cloud.AliasIntegrationTest_DA122FAB54BD28A-001/init-core-data-001
   [junit4]   2> 1031408 INFO  (SUITE-AliasIntegrationTest-seed#[DA122FAB54BD28A]-worker) [     ] o.a.s.SolrTestCaseJ4 Using TrieFields (NUMERIC_POINTS_SYSPROP=false) w/NUMERIC_DOCVALUES_SYSPROP=false
   [junit4]   2> 1031408 INFO  (SUITE-AliasIntegrationTest-seed#[DA122FAB54BD28A]-worker) [     ] o.a.s.SolrTestCaseJ4 Randomized ssl (true) and clientAuth (true) via: @org.apache.solr.util.RandomizeSSL(reason="", value=0.0/0.0, ssl=0.0/0.0, clientAuth=0.0/0.0)
   [junit4]   2> 1031409 INFO  (SUITE-AliasIntegrationTest-seed#[DA122FAB54BD28A]-worker) [     ] o.a.s.SolrTestCaseJ4 SecureRandom sanity checks: test.solr.allowed.securerandom=null & java.security.egd=file:/dev/./urandom
   [junit4]   2> 1031409 INFO  (SUITE-AliasIntegrationTest-seed#[DA122FAB54BD28A]-worker) [     ] o.a.s.c.MiniSolrCloudCluster Starting cluster of 2 servers in /home/jenkins/workspace/Lucene-Solr-master-Linux/solr/build/solr-core/test/J2/temp/solr.cloud.AliasIntegrationTest_DA122FAB54BD28A-001/tempDir-001
   [junit4]   2> 1031409 INFO  (SUITE-AliasIntegrationTest-seed#[DA122FAB54BD28A]-worker) [     ] o.a.s.c.ZkTestServer STARTING ZK TEST SERVER
   [junit4]   2> 1031410 INFO  (ZkTestServer Run Thread) [     ] o.a.s.c.ZkTestServer client port:0.0.0.0/0.0.0.0:0
   [junit4]   2> 1031410 INFO  (ZkTestServer Run Thread) [     ] o.a.s.c.ZkTestServer Starting server
   [junit4]   2> 1031510 INFO  (SUITE-AliasIntegrationTest-seed#[DA122FAB54BD28A]-worker) [     ] o.a.s.c.ZkTestServer start zk server on port:38795
   [junit4]   2> 1031510 INFO  (SUITE-AliasIntegrationTest-seed#[DA122FAB54BD28A]-worker) [     ] o.a.s.c.ZkTestServer parse host and port list: 127.0.0.1:38795
   [junit4]   2> 1031510 INFO  (SUITE-AliasIntegrationTest-seed#[DA122FAB54BD28A]-worker) [     ] o.a.s.c.ZkTestServer connecting to 127.0.0.1 38795
   [junit4]   2> 1031511 INFO  (SUITE-AliasIntegrationTest-seed#[DA122FAB54BD28A]-worker) [     ] o.a.s.c.c.ConnectionManager Waiting for client to connect to ZooKeeper
   [junit4]   2> 1031512 INFO  (zkConnectionManagerCallback-10499-thread-1) [     ] o.a.s.c.c.ConnectionManager zkClient has connected
   [junit4]   2> 1031512 INFO  (SUITE-AliasIntegrationTest-seed#[DA122FAB54BD28A]-worker) [     ] o.a.s.c.c.ConnectionManager Client is connected to ZooKeeper
   [junit4]   2> 1031514 INFO  (SUITE-AliasIntegrationTest-seed#[DA122FAB54BD28A]-worker) [     ] o.a.s.c.c.ConnectionManager Waiting for client to connect to ZooKeeper
   [junit4]   2> 1031515 INFO  (zkConnectionManagerCallback-10501-thread-1) [     ] o.a.s.c.c.ConnectionManager zkClient has connected
   [junit4]   2> 1031515 INFO  (SUITE-AliasIntegrationTest-seed#[DA122FAB54BD28A]-worker) [     ] o.a.s.c.c.ConnectionManager Client is connected to ZooKeeper
   [junit4]   2> 1031515 INFO  (SUITE-AliasIntegrationTest-seed#[DA122FAB54BD28A]-worker) [     ] o.a.s.c.c.ConnectionManager Waiting for client to connect to ZooKeeper
   [junit4]   2> 1031516 INFO  (zkConnectionManagerCallback-10503-thread-1) [     ] o.a.s.c.c.ConnectionManager zkClient has connected
   [junit4]   2> 1031516 INFO  (SUITE-AliasIntegrationTest-seed#[DA122FAB54BD28A]-worker) [     ] o.a.s.c.c.ConnectionManager Client is connected to ZooKeeper
   [junit4]   2> 1031620 WARN  (jetty-launcher-10504-thread-1) [     ] o.e.j.s.AbstractConnector Ignoring deprecated socket close linger time
   [junit4]   2> 1031620 WARN  (jetty-launcher-10504-thread-2) [     ] o.e.j.s.AbstractConnector Ignoring deprecated socket close linger time
   [junit4]   2> 1031620 INFO  (jetty-launcher-10504-thread-1) [     ] o.a.s.c.s.e.JettySolrRunner Start Jetty (original configured port=0)
   [junit4]   2> 1031620 INFO  (jetty-launcher-10504-thread-2) [     ] o.a.s.c.s.e.JettySolrRunner Start Jetty (original configured port=0)
   [junit4]   2> 1031620 INFO  (jetty-launcher-10504-thread-2) [     ] o.a.s.c.s.e.JettySolrRunner Trying to start Jetty on port 0 try number 1 ...
   [junit4]   2> 1031620 INFO  (jetty-launcher-10504-thread-1) [     ] o.a.s.c.s.e.JettySolrRunner Trying to start Jetty on port 0 try number 1 ...
   [junit4]   2> 1031620 INFO  (jetty-launcher-10504-thread-1) [     ] o.e.j.s.Server jetty-9.4.19.v20190610; built: 2019-06-10T16:30:51.723Z; git: afcf563148970e98786327af5e07c261fda175d3; jvm 12.0.1+12
   [junit4]   2> 1031620 INFO  (jetty-launcher-10504-thread-2) [     ] o.e.j.s.Server jetty-9.4.19.v20190610; built: 2019-06-10T16:30:51.723Z; git: afcf563148970e98786327af5e07c261fda175d3; jvm 12.0.1+12
   [junit4]   2> 1031621 INFO  (jetty-launcher-10504-thread-2) [     ] o.e.j.s.session DefaultSessionIdManager workerName=node0
   [junit4]   2> 1031621 INFO  (jetty-launcher-10504-thread-2) [     ] o.e.j.s.session No SessionScavenger set, using defaults
   [junit4]   2> 1031621 INFO  (jetty-launcher-10504-thread-2) [     ] o.e.j.s.session node0 Scavenging every 600000ms
   [junit4]   2> 1031621 INFO  (jetty-launcher-10504-thread-2) [     ] o.e.j.s.h.ContextHandler Started o.e.j.s.ServletContextHandler@8959fa2{/solr,null,AVAILABLE}
   [junit4]   2> 1031621 INFO  (jetty-launcher-10504-thread-1) [     ] o.e.j.s.session DefaultSessionIdManager workerName=node0
   [junit4]   2> 1031621 INFO  (jetty-launcher-10504-thread-1) [     ] o.e.j.s.session No SessionScavenger set, using defaults
   [junit4]   2> 1031621 INFO  (jetty-launcher-10504-thread-1) [     ] o.e.j.s.session node0 Scavenging every 600000ms
   [junit4]   2> 1031621 INFO  (jetty-launcher-10504-thread-1) [     ] o.e.j.s.h.ContextHandler Started o.e.j.s.ServletContextHandler@35ce30c3{/solr,null,AVAILABLE}
   [junit4]   2> 1031622 INFO  (jetty-launcher-10504-thread-2) [     ] o.e.j.s.AbstractConnector Started ServerConnector@37667c57{ssl,[ssl, alpn, http/1.1, h2]}{127.0.0.1:35997}
   [junit4]   2> 1031622 INFO  (jetty-launcher-10504-thread-2) [     ] o.e.j.s.Server Started @1031676ms
   [junit4]   2> 1031622 INFO  (jetty-launcher-10504-thread-2) [     ] o.a.s.c.s.e.JettySolrRunner Jetty properties: {hostContext=/solr, hostPort=35997}
   [junit4]   2> 1031622 INFO  (jetty-launcher-10504-thread-1) [     ] o.e.j.s.AbstractConnector Started ServerConnector@4948c9b0{ssl,[ssl, alpn, http/1.1, h2]}{127.0.0.1:43013}
   [junit4]   2> 1031622 INFO  (jetty-launcher-10504-thread-1) [     ] o.e.j.s.Server Started @1031676ms
   [junit4]   2> 1031622 INFO  (jetty-launcher-10504-thread-1) [     ] o.a.s.c.s.e.JettySolrRunner Jetty properties: {hostContext=/solr, hostPort=43013}
   [junit4]   2> 1031622 ERROR (jetty-launcher-10504-thread-2) [     ] o.a.s.u.StartupLoggingUtils Missing Java Option solr.log.dir. Logging may be missing or incomplete.
   [junit4]   2> 1031622 INFO  (jetty-launcher-10504-thread-2) [     ] o.a.s.s.SolrDispatchFilter Using logger factory org.apache.logging.slf4j.Log4jLoggerFactory
   [junit4]   2> 1031622 ERROR (jetty-launcher-10504-thread-1) [     ] o.a.s.u.StartupLoggingUtils Missing Java Option solr.log.dir. Logging may be missing or incomplete.
   [junit4]   2> 1031622 INFO  (jetty-launcher-10504-thread-1) [     ] o.a.s.s.SolrDispatchFilter Using logger factory org.apache.logging.slf4j.Log4jLoggerFactory
   [junit4]   2> 1031622 INFO  (jetty-launcher-10504-thread-2) [     ] o.a.s.s.SolrDispatchFilter  ___      _       Welcome to Apache Solr™ version 9.0.0
   [junit4]   2> 1031622 INFO  (jetty-launcher-10504-thread-1) [     ] o.a.s.s.SolrDispatchFilter  ___      _       Welcome to Apache Solr™ version 9.0.0
   [junit4]   2> 1031622 INFO  (jetty-launcher-10504-thread-2) [     ] o.a.s.s.SolrDispatchFilter / __| ___| |_ _   Starting in cloud mode on port null
   [junit4]   2> 1031622 INFO  (jetty-launcher-10504-thread-2) [     ] o.a.s.s.SolrDispatchFilter \__ \/ _ \ | '_|  Install dir: null
   [junit4]   2> 1031622 INFO  (jetty-launcher-10504-thread-1) [     ] o.a.s.s.SolrDispatchFilter / __| ___| |_ _   Starting in cloud mode on port null
   [junit4]   2> 1031622 INFO  (jetty-launcher-10504-thread-2) [     ] o.a.s.s.SolrDispatchFilter |___/\___/_|_|    Start time: 2019-07-27T04:18:49.724405Z
   [junit4]   2> 1031622 INFO  (jetty-launcher-10504-thread-1) [     ] o.a.s.s.SolrDispatchFilter \__ \/ _ \ | '_|  Install dir: null
   [junit4]   2> 1031622 INFO  (jetty-launcher-10504-thread-1) [     ] o.a.s.s.SolrDispatchFilter |___/\___/_|_|    Start time: 2019-07-27T04:18:49.724412Z
   [junit4]   2> 1031622 INFO  (jetty-launcher-10504-thread-2) [     ] o.a.s.c.c.ConnectionManager Waiting for client to connect to ZooKeeper
   [junit4]   2> 1031623 INFO  (jetty-launcher-10504-thread-1) [     ] o.a.s.c.c.ConnectionManager Waiting for client to connect to ZooKeeper
   [junit4]   2> 1031623 INFO  (zkConnectionManagerCallback-10507-thread-1) [     ] o.a.s.c.c.ConnectionManager zkClient has connected
   [junit4]   2> 1031623 INFO  (jetty-launcher-10504-thread-2) [     ] o.a.s.c.c.ConnectionManager Client is connected to ZooKeeper
   [junit4]   2> 1031623 INFO  (zkConnectionManagerCallback-10508-thread-1) [     ] o.a.s.c.c.ConnectionManager zkClient has connected
   [junit4]   2> 1031623 INFO  (jetty-launcher-10504-thread-1) [     ] o.a.s.c.c.ConnectionManager Client is connected to ZooKeeper
   [junit4]   2> 1031624 INFO  (jetty-launcher-10504-thread-1) [     ] o.a.s.s.SolrDispatchFilter solr.xml found in ZooKeeper. Loading...
   [junit4]   2> 1031624 INFO  (jetty-launcher-10504-thread-2) [     ] o.a.s.s.SolrDispatchFilter solr.xml found in ZooKeeper. Loading...
   [junit4]   2> 1031807 INFO  (jetty-launcher-10504-thread-2) [     ] o.a.s.h.c.HttpShardHandlerFactory Host whitelist initialized: WhitelistHostChecker [whitelistHosts=null, whitelistHostCheckingEnabled=true]
   [junit4]   2> 1031807 WARN  (jetty-launcher-10504-thread-2) [     ] o.e.j.u.s.S.config Trusting all certificates configured for Client@1e1a3b6a[provider=null,keyStore=null,trustStore=null]
   [junit4]   2> 1031807 WARN  (jetty-launcher-10504-thread-2) [     ] o.e.j.u.s.S.config No Client EndPointIdentificationAlgorithm configured for Client@1e1a3b6a[provider=null,keyStore=null,trustStore=null]
   [junit4]   2> 1031809 WARN  (jetty-launcher-10504-thread-2) [     ] o.e.j.u.s.S.config Trusting all certificates configured for Client@2218243a[provider=null,keyStore=null,trustStore=null]
   [junit4]   2> 1031809 WARN  (jetty-launcher-10504-thread-2) [     ] o.e.j.u.s.S.config No Client EndPointIdentificationAlgorithm configured for Client@2218243a[provider=null,keyStore=null,trustStore=null]
   [junit4]   2> 1031810 INFO  (jetty-launcher-10504-thread-2) [     ] o.a.s.c.ZkContainer Zookeeper client=127.0.0.1:38795/solr
   [junit4]   2> 1031811 INFO  (jetty-launcher-10504-thread-2) [     ] o.a.s.c.c.ConnectionManager Waiting for client to connect to ZooKeeper
   [junit4]   2> 1031811 INFO  (zkConnectionManagerCallback-10515-thread-1) [     ] o.a.s.c.c.ConnectionManager zkClient has connected
   [junit4]   2> 1031811 INFO  (jetty-launcher-10504-thread-2) [     ] o.a.s.c.c.ConnectionManager Client is connected to ZooKeeper
   [junit4]   2> 1031928 INFO  (jetty-launcher-10504-thread-2) [n:127.0.0.1:35997_solr     ] o.a.s.c.c.ConnectionManager Waiting for client to connect to ZooKeeper
   [junit4]   2> 1031929 INFO  (zkConnectionManagerCallback-10518-thread-1) [     ] o.a.s.c.c.ConnectionManager zkClient has connected
   [junit4]   2> 1031929 INFO  (jetty-launcher-10504-thread-2) [n:127.0.0.1:35997_solr     ] o.a.s.c.c.ConnectionManager Client is connected to ZooKeeper
   [junit4]   2> 1031956 INFO  (jetty-launcher-10504-thread-1) [     ] o.a.s.h.c.HttpShardHandlerFactory Host whitelist initialized: WhitelistHostChecker [whitelistHosts=null, whitelistHostCheckingEnabled=true]
   [junit4]   2> 1031956 WARN  (jetty-launcher-10504-thread-1) [     ] o.e.j.u.s.S.config Trusting all certificates configured for Client@7052c21e[provider=null,keyStore=null,trustStore=null]
   [junit4]   2> 1031956 WARN  (jetty-launcher-10504-thread-1) [     ] o.e.j.u.s.S.config No Client EndPointIdentificationAlgorithm configured for Client@7052c21e[provider=null,keyStore=null,trustStore=null]
   [junit4]   2> 1031959 WARN  (jetty-launcher-10504-thread-1) [     ] o.e.j.u.s.S.config Trusting all certificates configured for Client@18c55bea[provider=null,keyStore=null,trustStore=null]
   [junit4]   2> 1031959 WARN  (jetty-launcher-10504-thread-1) [     ] o.e.j.u.s.S.config No Client EndPointIdentificationAlgorithm configured for Client@18c55bea[provider=null,keyStore=null,trustStore=null]
   [junit4]   2> 1031959 INFO  (jetty-launcher-10504-thread-1) [     ] o.a.s.c.ZkContainer Zookeeper client=127.0.0.1:38795/solr
   [junit4]   2> 1031960 INFO  (jetty-launcher-10504-thread-1) [     ] o.a.s.c.c.ConnectionManager Waiting for client to connect to ZooKeeper
   [junit4]   2> 1031960 INFO  (zkConnectionManagerCallback-10526-thread-1) [     ] o.a.s.c.c.ConnectionManager zkClient has connected
   [junit4]   2> 1031960 INFO  (jetty-launcher-10504-thread-1) [     ] o.a.s.c.c.ConnectionManager Client is connected to ZooKeeper
   [junit4]   2> 1031961 INFO  (jetty-launcher-10504-thread-2) [n:127.0.0.1:35997_solr     ] o.a.s.c.OverseerElectionContext I am going to be the leader 127.0.0.1:35997_solr
   [junit4]   2> 1031961 INFO  (jetty-launcher-10504-thread-2) [n:127.0.0.1:35997_solr     ] o.a.s.c.Overseer Overseer (id=72070013688610822-127.0.0.1:35997_solr-n_0000000000) starting
   [junit4]   2> 1031963 INFO  (jetty-launcher-10504-thread-2) [n:127.0.0.1:35997_solr     ] o.a.s.c.c.ConnectionManager Waiting for client to connect to ZooKeeper
   [junit4]   2> 1031964 INFO  (zkConnectionManagerCallback-10531-thread-1) [     ] o.a.s.c.c.ConnectionManager zkClient has connected
   [junit4]   2> 1031964 INFO  (jetty-launcher-10504-thread-2) [n:127.0.0.1:35997_solr     ] o.a.s.c.c.ConnectionManager Client is connected to ZooKeeper
   [junit4]   2> 1031965 INFO  (jetty-launcher-10504-thread-2) [n:127.0.0.1:35997_solr     ] o.a.s.c.s.i.ZkClientClusterStateProvider Cluster at 127.0.0.1:38795/solr ready
   [junit4]   2> 1031965 INFO  (OverseerStateUpdate-72070013688610822-127.0.0.1:35997_solr-n_0000000000) [n:127.0.0.1:35997_solr     ] o.a.s.c.Overseer Starting to work on the main queue : 127.0.0.1:35997_solr
   [junit4]   2> 1031965 INFO  (jetty-launcher-10504-thread-2) [n:127.0.0.1:35997_solr     ] o.a.s.c.ZkController Register node as live in ZooKeeper:/live_nodes/127.0.0.1:35997_solr
   [junit4]   2> 1031966 INFO  (zkCallback-10517-thread-1) [     ] o.a.s.c.c.ZkStateReader Updated live nodes from ZooKeeper... (0) -> (1)
   [junit4]   2> 1031966 INFO  (zkCallback-10530-thread-1) [     ] o.a.s.c.c.ZkStateReader Updated live nodes from ZooKeeper... (0) -> (1)
   [junit4]   2> 1031966 INFO  (jetty-launcher-10504-thread-2) [n:127.0.0.1:35997_solr     ] o.a.s.c.LibListener clusterprops.json changed , version 0
   [junit4]   2> 1031976 INFO  (jetty-launcher-10504-thread-2) [n:127.0.0.1:35997_solr     ] o.a.s.h.a.MetricsHistoryHandler No .system collection, keeping metrics history in memory.
   [junit4]   2> 1031988 INFO  (jetty-launcher-10504-thread-2) [n:127.0.0.1:35997_solr     ] o.a.s.m.r.SolrJmxReporter JMX monitoring for 'solr_35997.solr.node' (registry 'solr.node') enabled at server: com.sun.jmx.mbeanserver.JmxMBeanServer@187e5769
   [junit4]   2> 1031994 INFO  (jetty-launcher-10504-thread-2) [n:127.0.0.1:35997_solr     ] o.a.s.m.r.SolrJmxReporter JMX monitoring for 'solr_35997.solr.jvm' (registry 'solr.jvm') enabled at server: com.sun.jmx.mbeanserver.JmxMBeanServer@187e5769
   [junit4]   2> 1031994 INFO  (jetty-launcher-10504-thread-2) [n:127.0.0.1:35997_solr     ] o.a.s.m.r.SolrJmxReporter JMX monitoring for 'solr_35997.solr.jetty' (registry 'solr.jetty') enabled at server: com.sun.jmx.mbeanserver.JmxMBeanServer@187e5769
   [junit4]   2> 1031995 INFO  (jetty-launcher-10504-thread-2) [n:127.0.0.1:35997_solr     ] o.a.s.c.CorePropertiesLocator Found 0 core definitions underneath /home/jenkins/workspace/Lucene-Solr-master-Linux/solr/build/solr-core/test/J2/temp/solr.cloud.AliasIntegrationTest_DA122FAB54BD28A-001/tempDir-001/node2/.
   [junit4]   2> 1032062 INFO  (jetty-launcher-10504-thread-1) [n:127.0.0.1:43013_solr     ] o.a.s.c.c.ConnectionManager Waiting for client to connect to ZooKeeper
   [junit4]   2> 1032063 INFO  (zkConnectionManagerCallback-10534-thread-1) [     ] o.a.s.c.c.ConnectionManager zkClient has connected
   [junit4]   2> 1032063 INFO  (jetty-launcher-10504-thread-1) [n:127.0.0.1:43013_solr     ] o.a.s.c.c.ConnectionManager Client is connected to ZooKeeper
   [junit4]   2> 1032066 INFO  (jetty-launcher-10504-thread-1) [n:127.0.0.1:43013_solr     ] o.a.s.c.c.ZkStateReader Updated live nodes from ZooKeeper... (0) -> (1)
   [junit4]   2> 1032067 INFO  (jetty-launcher-10504-thread-1) [n:127.0.0.1:43013_solr     ] o.a.s.c.ZkController Publish node=127.0.0.1:43013_solr as DOWN
   [junit4]   2> 1032068 INFO  (jetty-launcher-10504-thread-1) [n:127.0.0.1:43013_solr     ] o.a.s.c.TransientSolrCoreCacheDefault Allocating transient cache for 2147483647 transient cores
   [junit4]   2> 1032068 INFO  (jetty-launcher-10504-thread-1) [n:127.0.0.1:43013_solr     ] o.a.s.c.ZkController Register node as live in ZooKeeper:/live_nodes/127.0.0.1:43013_solr
   [junit4]   2> 1032068 INFO  (zkCallback-10517-thread-1) [     ] o.a.s.c.c.ZkStateReader Updated live nodes from ZooKeeper... (1) -> (2)
   [junit4]   2> 1032068 INFO  (zkCallback-10530-thread-1) [     ] o.a.s.c.c.ZkStateReader Updated live nodes from ZooKeeper... (1) -> (2)
   [junit4]   2> 1032068 INFO  (zkCallback-10533-thread-1) [     ] o.a.s.c.c.ZkStateReader Updated live nodes from ZooKeeper... (1) -> (2)
   [junit4]   2> 1032069 INFO  (jetty-launcher-10504-thread-1) [n:127.0.0.1:43013_solr     ] o.a.s.c.c.ConnectionManager Waiting for client to connect to ZooKeeper
   [junit4]   2> 1032069 INFO  (zkConnectionManagerCallback-10541-thread-1) [     ] o.a.s.c.c.ConnectionManager zkClient has connected
   [junit4]   2> 1032069 INFO  (jetty-launcher-10504-thread-1) [n:127.0.0.1:43013_solr     ] o.a.s.c.c.ConnectionManager Client is connected to ZooKeeper
   [junit4]   2> 1032070 INFO  (jetty-launcher-10504-thread-1) [n:127.0.0.1:43013_solr     ] o.a.s.c.c.ZkStateReader Updated live nodes from ZooKeeper... (0) -> (2)
   [junit4]   2> 1032070 INFO  (jetty-launcher-10504-thread-1) [n:127.0.0.1:43013_solr     ] o.a.s.c.s.i.ZkClientClusterStateProvider Cluster at 127.0.0.1:38795/solr ready
   [junit4]   2> 1032070 INFO  (jetty-launcher-10504-thread-1) [n:127.0.0.1:43013_solr     ] o.a.s.c.LibListener clusterprops.json changed , version 0
   [junit4]   2> 1032079 INFO  (jetty-launcher-10504-thread-1) [n:127.0.0.1:43013_solr     ] o.a.s.h.a.MetricsHistoryHandler No .system collection, keeping metrics history in memory.
   [junit4]   2> 1032090 INFO  (jetty-launcher-10504-thread-1) [n:127.0.0.1:43013_solr     ] o.a.s.m.r.SolrJmxReporter JMX monitoring for 'solr_43013.solr.node' (registry 'solr.node') enabled at server: com.sun.jmx.mbeanserver.JmxMBeanServer@187e5769
   [junit4]   2> 1032096 INFO  (jetty-launcher-10504-thread-1) [n:127.0.0.1:43013_solr     ] o.a.s.m.r.SolrJmxReporter JMX monitoring for 'solr_43013.solr.jvm' (registry 'solr.jvm') enabled at server: com.sun.jmx.mbeanserver.JmxMBeanServer@187e5769
   [junit4]   2> 1032096 INFO  (jetty-launcher-10504-thread-1) [n:127.0.0.1:43013_solr     ] o.a.s.m.r.SolrJmxReporter JMX monitoring for 'solr_43013.solr.jetty' (registry 'solr.jetty') enabled at server: com.sun.jmx.mbeanserver.JmxMBeanServer@187e5769
   [junit4]   2> 1032097 INFO  (jetty-launcher-10504-thread-1) [n:127.0.0.1:43013_solr     ] o.a.s.c.CorePropertiesLocator Found 0 core definitions underneath /home/jenkins/workspace/Lucene-Solr-master-Linux/solr/build/solr-core/test/J2/temp/solr.cloud.AliasIntegrationTest_DA122FAB54BD28A-001/tempDir-001/node1/.
   [junit4]   2> 1032111 INFO  (SUITE-AliasIntegrationTest-seed#[DA122FAB54BD28A]-worker) [     ] o.a.s.c.c.ConnectionManager Waiting for client to connect to ZooKeeper
   [junit4]   2> 1032112 INFO  (zkConnectionManagerCallback-10547-thread-1) [     ] o.a.s.c.c.ConnectionManager zkClient has connected
   [junit4]   2> 1032112 INFO  (SUITE-AliasIntegrationTest-seed#[DA122FAB54BD28A]-worker) [     ] o.a.s.c.c.ConnectionManager Client is connected to ZooKeeper
   [junit4]   2> 1032113 INFO  (SUITE-AliasIntegrationTest-seed#[DA122FAB54BD28A]-worker) [     ] o.a.s.c.c.ZkStateReader Updated live nodes from ZooKeeper... (0) -> (2)
   [junit4]   2> 1032113 INFO  (SUITE-AliasIntegrationTest-seed#[DA122FAB54BD28A]-worker) [     ] o.a.s.c.s.i.ZkClientClusterStateProvider Cluster at 127.0.0.1:38795/solr ready
   [junit4]   2> 1032125 INFO  (TEST-AliasIntegrationTest.testModifyPropertiesV1-seed#[DA122FAB54BD28A]) [     ] o.a.s.SolrTestCaseJ4 ###Starting testModifyPropertiesV1
   [junit4]   2> 1032143 INFO  (qtp2023524111-33029) [n:127.0.0.1:35997_solr     ] o.a.s.h.a.CollectionsHandler Invoked Collection Action :create with params collection.configName=conf&name=collection1meta&nrtReplicas=1&action=CREATE&numShards=2&wt=javabin&version=2 and sendToOCPQueue=true
   [junit4]   2> 1032144 INFO  (OverseerThreadFactory-7929-thread-1-processing-n:127.0.0.1:35997_solr) [n:127.0.0.1:35997_solr     ] o.a.s.c.a.c.CreateCollectionCmd Create collection collection1meta
   [junit4]   2> 1032251 INFO  (OverseerStateUpdate-72070013688610822-127.0.0.1:35997_solr-n_0000000000) [n:127.0.0.1:35997_solr     ] o.a.s.c.o.SliceMutator createReplica() {
   [junit4]   2>   "operation":"ADDREPLICA",
   [junit4]   2>   "collection":"collection1meta",
   [junit4]   2>   "shard":"shard1",
   [junit4]   2>   "core":"collection1meta_shard1_replica_n1",
   [junit4]   2>   "state":"down",
   [junit4]   2>   "base_url":"https://127.0.0.1:43013/solr",
   [junit4]   2>   "type":"NRT",
   [junit4]   2>   "waitForFinalState":"false"} 
   [junit4]   2> 1032252 INFO  (OverseerStateUpdate-72070013688610822-127.0.0.1:35997_solr-n_0000000000) [n:127.0.0.1:35997_solr     ] o.a.s.c.o.SliceMutator createReplica() {
   [junit4]   2>   "operation":"ADDREPLICA",
   [junit4]   2>   "collection":"collection1meta",
   [junit4]   2>   "shard":"shard2",
   [junit4]   2>   "core":"collection1meta_shard2_replica_n2",
   [junit4]   2>   "state":"down",
   [junit4]   2>   "base_url":"https://127.0.0.1:35997/solr",
   [junit4]   2>   "type":"NRT",
   [junit4]   2>   "waitForFinalState":"false"} 
   [junit4]   2> 1032459 INFO  (qtp2023524111-33028) [n:127.0.0.1:35997_solr    x:collection1meta_shard2_replica_n2 ] o.a.s.h.a.CoreAdminOperation core create command qt=/admin/cores&coreNodeName=core_node4&collection.configName=conf&newCollection=true&name=collection1meta_shard2_replica_n2&action=CREATE&numShards=2&collection=collection1meta&shard=shard2&wt=javabin&version=2&replicaType=NRT
   [junit4]   2> 1032460 INFO  (qtp2023524111-33028) [n:127.0.0.1:35997_solr    x:collection1meta_shard2_replica_n2 ] o.a.s.c.TransientSolrCoreCacheDefault Allocating transient cache for 2147483647 transient cores
   [junit4]   2> 1032463 INFO  (qtp112344365-33034) [n:127.0.0.1:43013_solr    x:collection1meta_shard1_replica_n1 ] o.a.s.h.a.CoreAdminOperation core create command qt=/admin/cores&coreNodeName=core_node3&collection.configName=conf&newCollection=true&name=collection1meta_shard1_replica_n1&action=CREATE&numShards=2&collection=collection1meta&shard=shard1&wt=javabin&version=2&replicaType=NRT
   [junit4]   2> 1033467 INFO  (qtp2023524111-33028) [n:127.0.0.1:35997_solr c:collection1meta s:shard2 r:core_node4 x:collection1meta_shard2_replica_n2 ] o.a.s.c.SolrConfig Using Lucene MatchVersion: 9.0.0
   [junit4]   2> 1033469 INFO  (qtp112344365-33034) [n:127.0.0.1:43013_solr c:collection1meta s:shard1 r:core_node3 x:collection1meta_shard1_replica_n1 ] o.a.s.c.SolrConfig Using Lucene MatchVersion: 9.0.0
   [junit4]   2> 1033473 INFO  (qtp2023524111-33028) [n:127.0.0.1:35997_solr c:collection1meta s:shard2 r:core_node4 x:collection1meta_shard2_replica_n2 ] o.a.s.s.IndexSchema [collection1meta_shard2_replica_n2] Schema name=minimal
   [junit4]   2> 1033474 INFO  (qtp2023524111-33028) [n:127.0.0.1:35997_solr c:collection1meta s:shard2 r:core_node4 x:collection1meta_shard2_replica_n2 ] o.a.s.s.IndexSchema Loaded schema minimal/1.1 with uniqueid field id
   [junit4]   2> 1033474 INFO  (qtp2023524111-33028) [n:127.0.0.1:35997_solr c:collection1meta s:shard2 r:core_node4 x:collection1meta_shard2_replica_n2 ] o.a.s.c.CoreContainer Creating SolrCore 'collection1meta_shard2_replica_n2' using configuration from collection collection1meta, trusted=true
   [junit4]   2> 1033475 INFO  (qtp2023524111-33028) [n:127.0.0.1:35997_solr c:collection1meta s:shard2 r:core_node4 x:collection1meta_shard2_replica_n2 ] o.a.s.m.r.SolrJmxReporter JMX monitoring for 'solr_35997.solr.core.collection1meta.shard2.replica_n2' (registry 'solr.core.collection1meta.shard2.replica_n2') enabled at server: com.sun.jmx.mbeanserver.JmxMBeanServer@187e5769
   [junit4]   2> 1033475 INFO  (qtp2023524111-33028) [n:127.0.0.1:35997_solr c:collection1meta s:shard2 r:core_node4 x:collection1meta_shard2_replica_n2 ] o.a.s.c.SolrCore [[collection1meta_shard2_replica_n2] ] Opening new SolrCore at [/home/jenkins/workspace/Lucene-Solr-master-Linux/solr/build/solr-core/test/J2/temp/solr.cloud.AliasIntegrationTest_DA122FAB54BD28A-001/tempDir-001/node2/collection1meta_shard2_replica_n2], dataDir=[/home/jenkins/workspace/Lucene-Solr-master-Linux/solr/build/solr-core/test/J2/temp/solr.cloud.AliasIntegrationTest_DA122FAB54BD28A-001/tempDir-001/node2/./collection1meta_shard2_replica_n2/data/]
   [junit4]   2> 1033475 INFO  (qtp112344365-33034) [n:127.0.0.1:43013_solr c:collection1meta s:shard1 r:core_node3 x:collection1meta_shard1_replica_n1 ] o.a.s.s.IndexSchema [collection1meta_shard1_replica_n1] Schema name=minimal
   [junit4]   2> 1033476 INFO  (qtp112344365-33034) [n:127.0.0.1:43013_solr c:collection1meta s:shard1 r:core_node3 x:collection1meta_shard1_replica_n1 ] o.a.s.s.IndexSchema Loaded schema minimal/1.1 with uniqueid field id
   [junit4]   2> 1033476 INFO  (qtp112344365-33034) [n:127.0.0.1:43013_solr c:collection1meta s:shard1 r:core_node3 x:collection1meta_shard1_replica_n1 ] o.a.s.c.CoreContainer Creating SolrCore 'collection1meta_shard1_replica_n1' using configuration from collection collection1meta, trusted=true
   [junit4]   2> 1033477 INFO  (qtp112344365-33034) [n:127.0.0.1:43013_solr c:collection1meta s:shard1 r:core_node3 x:collection1meta_shard1_replica_n1 ] o.a.s.m.r.SolrJmxReporter JMX monitoring for 'solr_43013.solr.core.collection1meta.shard1.replica_n1' (registry 'solr.core.collection1meta.shard1.replica_n1') enabled at server: com.sun.jmx.mbeanserver.JmxMBeanServer@187e5769
   [junit4]   2> 1033477 INFO  (qtp112344365-33034) [n:127.0.0.1:43013_solr c:collection1meta s:shard1 r:core_node3 x:collection1meta_shard1_replica_n1 ] o.a.s.c.SolrCore [[collection1meta_shard1_replica_n1] ] Opening new SolrCore at [/home/jenkins/workspace/Lucene-Solr-master-Linux/solr/build/solr-core/test/J2/temp/solr.cloud.AliasIntegrationTest_DA122FAB54BD28A-001/tempDir-001/node1/collection1meta_shard1_replica_n1], dataDir=[/home/jenkins/workspace/Lucene-Solr-master-Linux/solr/build/solr-core/test/J2/temp/solr.cloud.AliasIntegrationTest_DA122FAB54BD28A-001/tempDir-001/node1/./collection1meta_shard1_replica_n1/data/]
   [junit4]   2> 1033514 INFO  (qtp2023524111-33028) [n:127.0.0.1:35997_solr c:collection1meta s:shard2 r:core_node4 x:collection1meta_shard2_replica_n2 ] o.a.s.u.UpdateHandler Using UpdateLog implementation: org.apache.solr.update.UpdateLog
   [junit4]   2> 1033514 INFO  (qtp2023524111-33028) [n:127.0.0.1:35997_solr c:collection1meta s:shard2 r:core_node4 x:collection1meta_shard2_replica_n2 ] o.a.s.u.UpdateLog Initializing UpdateLog: dataDir=null defaultSyncLevel=FLUSH numRecordsToKeep=100 maxNumLogsToKeep=10 numVersionBuckets=65536
   [junit4]   2> 1033514 INFO  (qtp112344365-33034) [n:127.0.0.1:43013_solr c:collection1meta s:shard1 r:core_node3 x:collection1meta_shard1_replica_n1 ] o.a.s.u.UpdateHandler Using UpdateLog implementation: org.apache.solr.update.UpdateLog
   [junit4]   2> 1033514 INFO  (qtp112344365-33034) [n:127.0.0.1:43013_solr c:collection1meta s:shard1 r:core_node3 x:collection1meta_shard1_replica_n1 ] o.a.s.u.UpdateLog Initializing UpdateLog: dataDir=null defaultSyncLevel=FLUSH numRecordsToKeep=100 maxNumLogsToKeep=10 numVersionBuckets=65536
   [junit4]   2> 1033515 INFO  (qtp2023524111-33028) [n:127.0.0.1:35997_solr c:collection1meta s:shard2 r:core_node4 x:collection1meta_shard2_replica_n2 ] o.a.s.u.CommitTracker Hard AutoCommit: disabled
   [junit4]   2> 1033515 INFO  (qtp2023524111-33028) [n:127.0.0.1:35997_solr c:collection1meta s:shard2 r:core_node4 x:collection1meta_shard2_replica_n2 ] o.a.s.u.CommitTracker Soft AutoCommit: disabled
   [junit4]   2> 1033515 INFO  (qtp112344365-33034) [n:127.0.0.1:43013_solr c:collection1meta s:shard1 r:core_node3 x:collection1meta_shard1_replica_n1 ] o.a.s.u.CommitTracker Hard AutoCommit: disabled
   [junit4]   2> 1033515 INFO  (qtp112344365-33034) [n:127.0.0.1:43013_solr c:collection1meta s:shard1 r:core_node3 x:collection1meta_shard1_replica_n1 ] o.a.s.u.CommitTracker Soft AutoCommit: disabled
   [junit4]   2> 1033515 INFO  (qtp2023524111-33028) [n:127.0.0.1:35997_solr c:collection1meta s:shard2 r:core_node4 x:collection1meta_shard2_replica_n2 ] o.a.s.s.SolrIndexSearcher Opening [Searcher@2cca6d75[collection1meta_shard2_replica_n2] main]
   [junit4]   2> 1033516 INFO  (qtp112344365-33034) [n:127.0.0.1:43013_solr c:collection1meta s:shard1 r:core_node3 x:collection1meta_shard1_replica_n1 ] o.a.s.s.SolrIndexSearcher Opening [Searcher@3e0946aa[collection1meta_shard1_replica_n1] main]
   [junit4]   2> 1033517 INFO  (qtp2023524111-33028) [n:127.0.0.1:35997_solr c:collection1meta s:shard2 r:core_node4 x:collection1meta_shard2_replica_n2 ] o.a.s.r.ManagedResourceStorage Configured ZooKeeperStorageIO with znodeBase: /configs/conf
   [junit4]   2> 1033517 INFO  (qtp112344365-33034) [n:127.0.0.1:43013_solr c:collection1meta s:shard1 r:core_node3 x:collection1meta_shard1_replica_n1 ] o.a.s.r.ManagedResourceStorage Configured ZooKeeperStorageIO with znodeBase: /configs/conf
   [junit4]   2> 1033517 INFO  (qtp112344365-33034) [n:127.0.0.1:43013_solr c:collection1meta s:shard1 r:core_node3 x:collection1meta_shard1_replica_n1 ] o.a.s.r.ManagedResourceStorage Loaded null at path _rest_managed.json using ZooKeeperStorageIO:path=/configs/conf
   [junit4]   2> 1033517 INFO  (qtp2023524111-33028) [n:127.0.0.1:35997_solr c:collection1meta s:shard2 r:core_node4 x:collection1meta_shard2_replica_n2 ] o.a.s.r.ManagedResourceStorage Loaded null at path _rest_managed.json using ZooKeeperStorageIO:path=/configs/conf
   [junit4]   2> 1033517 INFO  (qtp112344365-33034) [n:127.0.0.1:43013_solr c:collection1meta s:shard1 r:core_node3 x:collection1meta_shard1_replica_n1 ] o.a.s.h.ReplicationHandler Commits will be reserved for 10000ms.
   [junit4]   2> 1033517 INFO  (qtp2023524111-33028) [n:127.0.0.1:35997_solr c:collection1meta s:shard2 r:core_node4 x:collection1meta_shard2_replica_n2 ] o.a.s.h.ReplicationHandler Commits will be reserved for 10000ms.
   [junit4]   2> 1033517 INFO  (qtp112344365-33034) [n:127.0.0.1:43013_solr c:collection1meta s:shard1 r:core_node3 x:collection1meta_shard1_replica_n1 ] o.a.s.u.UpdateLog Could not find max version in index or recent updates, using new clock 1640183765788524544
   [junit4]   2> 1033517 INFO  (qtp2023524111-33028) [n:127.0.0.1:35997_solr c:collection1meta s:shard2 r:core_node4 x:collection1meta_shard2_replica_n2 ] o.a.s.u.UpdateLog Could not find max version in index or recent updates, using new clock 1640183765788524544
   [junit4]   2> 1033519 INFO  (searcherExecutor-7939-thread-1-processing-n:127.0.0.1:43013_solr x:collection1meta_shard1_replica_n1 c:collection1meta s:shard1 r:core_node3) [n:127.0.0.1:43013_solr c:collection1meta s:shard1 r:core_node3 x:collection1meta_shard1_replica_n1 ] o.a.s.c.SolrCore [collection1meta_shard1_replica_n1] Registered new searcher Searcher@3e0946aa[collection1meta_shard1_replica_n1] main{ExitableDirectoryReader(UninvertingDirectoryReader())}
   [junit4]   2> 1033519 INFO  (searcherExecutor-7938-thread-1-processing-n:127.0.0.1:35997_solr x:collection1meta_shard2_replica_n2 c:collection1meta s:shard2 r:core_node4) [n:127.0.0.1:35997_solr c:collection1meta s:shard2 r:core_node4 x:collection1meta_shard2_replica_n2 ] o.a.s.c.SolrCore [collection1meta_shard2_replica_n2] Registered new searcher Searcher@2cca6d75[collection1meta_shard2_replica_n2] main{ExitableDirectoryReader(UninvertingDirectoryReader())}
   [junit4]   2> 1033520 INFO  (qtp112344365-33034) [n:127.0.0.1:43013_solr c:collection1meta s:shard1 r:core_node3 x:collection1meta_shard1_replica_n1 ] o.a.s.c.ZkShardTerms Successful update of terms at /collections/collection1meta/terms/shard1 to Terms{values={core_node3=0}, version=0}
   [junit4]   2> 1033520 INFO  (qtp2023524111-33028) [n:127.0.0.1:35997_solr c:collection1meta s:shard2 r:core_node4 x:collection1meta_shard2_replica_n2 ] o.a.s.c.ZkShardTerms Successful update of terms at /collections/collection1meta/terms/shard2 to Terms{values={core_node4=0}, version=0}
   [junit4]   2> 1033520 INFO  (qtp2023524111-33028) [n:127.0.0.1:35997_solr c:collection1meta s:shard2 r:core_node4 x:collection1meta_shard2_replica_n2 ] o.a.s.c.ShardLeaderElectionContextBase make sure parent is created /collections/collection1meta/leaders/shard2
   [junit4]   2> 1033520 INFO  (qtp112344365-33034) [n:127.0.0.1:43013_solr c:collection1meta s:shard1 r:core_node3 x:collection1meta_shard1_replica_n1 ] o.a.s.c.ShardLeaderElectionContextBase make sure parent is created /collections/collection1meta/leaders/shard1
   [junit4]   2> 1033521 INFO  (qtp112344365-33034) [n:127.0.0.1:43013_solr c:collection1meta s:shard1 r:core_node3 x:collection1meta_shard1_replica_n1 ] o.a.s.c.ShardLeaderElectionContext Enough replicas found to continue.
   [junit4]   2> 1033521 INFO  (qtp112344365-33034) [n:127.0.0.1:43013_solr c:collection1meta s:shard1 r:core_node3 x:collection1meta_shard1_replica_n1 ] o.a.s.c.ShardLeaderElectionContext I may be the new leader - try and sync
   [junit4]   2> 1033521 INFO  (qtp112344365-33034) [n:127.0.0.1:43013_solr c:collection1meta s:shard1 r:core_node3 x:collection1meta_shard1_replica_n1 ] o.a.s.c.SyncStrategy Sync replicas to https://127.0.0.1:43013/solr/collection1meta_shard1_replica_n1/
   [junit4]   2> 1033521 INFO  (qtp2023524111-33028) [n:127.0.0.1:35997_solr c:collection1meta s:shard2 r:core_node4 x:collection1meta_shard2_replica_n2 ] o.a.s.c.ShardLeaderElectionContext Enough replicas found to continue.
   [junit4]   2> 1033521 INFO  (qtp2023524111-33028) [n:127.0.0.1:35997_solr c:collection1meta s:shard2 r:core_node4 x:collection1meta_shard2_replica_n2 ] o.a.s.c.ShardLeaderElectionContext I may be the new leader - try and sync
   [junit4]   2> 1033521 INFO  (qtp2023524111-33028) [n:127.0.0.1:35997_solr c:collection1meta s:shard2 r:core_node4 x:collection1meta_shard2_replica_n2 ] o.a.s.c.SyncStrategy Sync replicas to https://127.0.0.1:35997/solr/collection1meta_shard2_replica_n2/
   [junit4]   2> 1033521 INFO  (qtp112344365-33034) [n:127.0.0.1:43013_solr c:collection1meta s:shard1 r:core_node3 x:collection1meta_shard1_replica_n1 ] o.a.s.c.SyncStrategy Sync Success - now sync replicas to me
   [junit4]   2> 1033521 INFO  (qtp2023524111-33028) [n:127.0.0.1:35997_solr c:collection1meta s:shard2 r:core_node4 x:collection1meta_shard2_replica_n2 ] o.a.s.c.SyncStrategy Sync Success - now sync replicas to me
   [junit4]   2> 1033521 INFO  (qtp112344365-33034) [n:127.0.0.1:43013_solr c:collection1meta s:shard1 r:core_node3 x:collection1meta_shard1_replica_n1 ] o.a.s.c.SyncStrategy https://127.0.0.1:43013/solr/collection1meta_shard1_replica_n1/ has no replicas
   [junit4]   2> 1033521 INFO  (qtp112344365-33034) [n:127.0.0.1:43013_solr c:collection1meta s:shard1 r:core_node3 x:collection1meta_shard1_replica_n1 ] o.a.s.c.ShardLeaderElectionContextBase Creating leader registration node /collections/collection1meta/leaders/shard1/leader after winning as /collections/collection1meta/leader_elect/shard1/election/72070013688610825-core_node3-n_0000000000
   [junit4]   2> 1033521 INFO  (qtp2023524111-33028) [n:127.0.0.1:35997_solr c:collection1meta s:shard2 r:core_node4 x:collection1meta_shard2_replica_n2 ] o.a.s.c.SyncStrategy https://127.0.0.1:35997/solr/collection1meta_shard2_replica_n2/ has no replicas
   [junit4]   2> 1033521 INFO  (qtp2023524111-33028) [n:127.0.0.1:35997_solr c:collection1meta s:shard2 r:core_node4 x:collection1meta_shard2_replica_n2 ] o.a.s.c.ShardLeaderElectionContextBase Creating leader registration node /collections/collection1meta/leaders/shard2/leader after winning as /collections/collection1meta/leader_elect/shard2/election/72070013688610822-core_node4-n_0000000000
   [junit4]   2> 1033522 INFO  (qtp112344365-33034) [n:127.0.0.1:43013_solr c:collection1meta s:shard1 r:core_node3 x:collection1meta_shard1_replica_n1 ] o.a.s.c.ShardLeaderElectionContext I am the new leader: https://127.0.0.1:43013/solr/collection1meta_shard1_replica_n1/ shard1
   [junit4]   2> 1033522 INFO  (qtp2023524111-33028) [n:127.0.0.1:35997_solr c:collection1meta s:shard2 r:core_node4 x:collection1meta_shard2_replica_n2 ] o.a.s.c.ShardLeaderElectionContext I am the new leader: https://127.0.0.1:35997/solr/collection1meta_shard2_replica_n2/ shard2
   [junit4]   2> 1033623 INFO  (zkCallback-10517-thread-1) [     ] o.a.s.c.c.ZkStateReader A cluster state change: [WatchedEvent state:SyncConnected type:NodeDataChanged path:/collections/collection1meta/state.json] for collection [collection1meta] has occurred - updating... (live nodes size: [2])
   [junit4]   2> 1033623 INFO  (zkCallback-10533-thread-1) [     ] o.a.s.c.c.ZkStateReader A cluster state change: [WatchedEvent state:SyncConnected type:NodeDataChanged path:/collections/collection1meta/state.json] for collection [collection1meta] has occurred - updating... (live nodes size: [2])
   [junit4]   2> 1033623 INFO  (zkCallback-10533-thread-2) [     ] o.a.s.c.c.ZkStateReader A cluster state change: [WatchedEvent state:SyncConnected type:NodeDataChanged path:/collections/collection1meta/state.json] for collection [collection1meta] has occurred - updating... (live nodes size: [2])
   [junit4]   2> 1033623 INFO  (zkCallback-10517-thread-2) [     ] o.a.s.c.c.ZkStateReader A cluster state change: [WatchedEvent state:SyncConnected type:NodeDataChanged path:/collections/collection1meta/state.json] for collection [collection1meta] has occurred - updating... (live nodes size: [2])
   [junit4]   2> 1033624 INFO  (qtp2023524111-33028) [n:127.0.0.1:35997_solr c:collection1meta s:shard2 r:core_node4 x:collection1meta_shard2_replica_n2 ] o.a.s.c.ZkController I am the leader, no recovery necessary
   [junit4]   2> 1033624 INFO  (qtp112344365-33034) [n:127.0.0.1:43013_solr c:collection1meta s:shard1 r:core_node3 x:collection1meta_shard1_replica_n1 ] o.a.s.c.ZkController I am the leader, no recovery necessary
   [junit4]   2> 1033660 INFO  (qtp2023524111-33028) [n:127.0.0.1:35997_solr c:collection1meta s:shard2 r:core_node4 x:collection1meta_shard2_replica_n2 ] o.a.s.s.HttpSolrCall [admin] webapp=null path=/admin/cores params={qt=/admin/cores&coreNodeName=core_node4&collection.configName=conf&newCollection=true&name=collection1meta_shard2_replica_n2&action=CREATE&numShards=2&collection=collection1meta&shard=shard2&wt=javabin&version=2&replicaType=NRT} status=0 QTime=1200
   [junit4]   2> 1033660 INFO  (qtp112344365-33034) [n:127.0.0.1:43013_solr c:collection1meta s:shard1 r:core_node3 x:collection1meta_shard1_replica_n1 ] o.a.s.s.HttpSolrCall [admin] webapp=null path=/admin/cores params={qt=/admin/cores&coreNodeName=core_node3&collection.configName=conf&newCollection=true&name=collection1meta_shard1_replica_n1&action=CREATE&numShards=2&collection=collection1meta&shard=shard1&wt=javabin&version=2&replicaType=NRT} status=0 QTime=1196
   [junit4]   2> 1033662 INFO  (qtp2023524111-33029) [n:127.0.0.1:35997_solr     ] o.a.s.h.a.CollectionsHandler Wait for new collection to be active for at most 45 seconds. Check all shard replicas
   [junit4]   2> 1033726 INFO  (zkCallback-10533-thread-2) [     ] o.a.s.c.c.ZkStateReader A cluster state change: [WatchedEvent state:SyncConnected type:NodeDataChanged path:/collections/collection1meta/state.json] for collection [collection1meta] has occurred - updating... (live nodes size: [2])
   [junit4]   2> 1033726 INFO  (zkCallback-10533-thread-1) [     ] o.a.s.c.c.ZkStateReader A cluster state change: [WatchedEvent state:SyncConnected type:NodeDataChanged path:/collections/collection1meta/state.json] for collection [collection1meta] has occurred - updating... (live nodes size: [2])
   [junit4]   2> 1033726 INFO  (zkCallback-10517-thread-2) [     ] o.a.s.c.c.ZkStateReader A cluster state change: [WatchedEvent state:SyncConnected type:NodeDataChanged path:/collections/collection1meta/state.json] for collection [collection1meta] has occurred - updating... (live nodes size: [2])
   [junit4]   2> 1033726 INFO  (zkCallback-10517-thread-1) [     ] o.a.s.c.c.ZkStateReader A cluster state change: [WatchedEvent state:SyncConnected type:NodeDataChanged path:/collections/collection1meta/state.json] for collection [collection1meta] has occurred - updating... (live nodes size: [2])
   [junit4]   2> 1033726 INFO  (zkCallback-10517-thread-3) [     ] o.a.s.c.c.ZkStateReader A cluster state change: [WatchedEvent state:SyncConnected type:NodeDataChanged path:/collections/collection1meta/state.json] for collection [collection1meta] has occurred - updating... (live nodes size: [2])
   [junit4]   2> 1033726 INFO  (zkCallback-10533-thread-3) [     ] o.a.s.c.c.ZkStateReader A cluster state change: [WatchedEvent state:SyncConnected type:NodeDataChanged path:/collections/collection1meta/state.json] for collection [collection1meta] has occurred - updating... (live nodes size: [2])
   [junit4]   2> 1033726 INFO  (qtp2023524111-33029) [n:127.0.0.1:35997_solr     ] o.a.s.s.HttpSolrCall [admin] webapp=null path=/admin/collections params={collection.configName=conf&name=collection1meta&nrtReplicas=1&action=CREATE&numShards=2&wt=javabin&version=2} status=0 QTime=1583
   [junit4]   2> 1033727 INFO  (qtp2023524111-33030) [n:127.0.0.1:35997_solr     ] o.a.s.h.a.CollectionsHandler Invoked Collection Action :create with params collection.configName=conf&name=collection2meta&nrtReplicas=1&action=CREATE&numShards=1&wt=javabin&version=2 and sendToOCPQueue=true
   [junit4]   2> 1033728 INFO  (OverseerThreadFactory-7929-thread-2-processing-n:127.0.0.1:35997_solr) [n:127.0.0.1:35997_solr     ] o.a.s.c.a.c.CreateCollectionCmd Create collection collection2meta
   [junit4]   2> 1033728 INFO  (OverseerCollectionConfigSetProcessor-72070013688610822-127.0.0.1:35997_solr-n_0000000000) [n:127.0.0.1:35997_solr     ] o.a.s.c.OverseerTaskQueue Response ZK path: /overseer/collection-queue-work/qnr-0000000000 doesn't exist.  Requestor may have disconnected from ZooKeeper
   [junit4]   2> 1033934 INFO  (OverseerStateUpdate-72070013688610822-127.0.0.1:35997_solr-n_0000000000) [n:127.0.0.1:35997_solr     ] o.a.s.c.o.SliceMutator createReplica() {
   [junit4]   2>   "operation":"ADDREPLICA",
   [junit4]   2>   "collection":"collection2meta",
   [junit4]   2>   "shard":"shard1",
   [junit4]   2>   "core":"collection2meta_shard1_replica_n1",
   [junit4]   2>   "state":"down",
   [junit4]   2>   "base_url":"https://127.0.0.1:35997/solr",
   [junit4]   2>   "type":"NRT",
   [junit4]   2>   "waitForFinalState":"false"} 
   [junit4]   2> 1034137 INFO  (qtp2023524111-33028) [n:127.0.0.1:35997_solr    x:collection2meta_shard1_replica_n1 ] o.a.s.h.a.CoreAdminOperation core create command qt=/admin/cores&coreNodeName=core_node2&collection.configName=conf&newCollection=true&name=collection2meta_shard1_replica_n1&action=CREATE&numShards=1&collection=collection2meta&shard=shard1&wt=javabin&version=2&replicaType=NRT
   [junit4]   2> 1035146 INFO  (qtp2023524111-33028) [n:127.0.0.1:35997_solr c:collection2meta s:shard1 r:core_node2 x:collection2meta_shard1_replica_n1 ] o.a.s.c.SolrConfig Using Lucene MatchVersion: 9.0.0
   [junit4]   2> 1035150 INFO  (qtp2023524111-33028) [n:127.0.0.1:35997_solr c:collection2meta s:shard1 r:core_node2 x:collection2meta_shard1_replica_n1 ] o.a.s.s.IndexSchema [collection2meta_shard1_replica_n1] Schema name=minimal
   [junit4]   2> 1035151 INFO  (qtp2023524111-33028) [n:127.0.0.1:35997_solr c:collection2meta s:shard1 r:core_node2 x:collection2meta_shard1_replica_n1 ] o.a.s.s.IndexSchema Loaded schema minimal/1.1 with uniqueid field id
   [junit4]   2> 1035151 INFO  (qtp2023524111-33028) [n:127.0.0.1:35997_solr c:collection2meta s:shard1 r:core_node2 x:collection2meta_shard1_replica_n1 ] o.a.s.c.CoreContainer Creating SolrCore 'collection2meta_shard1_replica_n1' using configuration from collection collection2meta, trusted=true
   [junit4]   2> 1035152 INFO  (qtp2023524111-33028) [n:127.0.0.1:35997_solr c:collection2meta s:shard1 r:core_node2 x:collection2meta_shard1_replica_n1 ] o.a.s.m.r.SolrJmxReporter JMX monitoring for 'solr_35997.solr.core.collection2meta.shard1.replica_n1' (registry 'solr.core.collection2meta.shard1.replica_n1') enabled at server: com.sun.jmx.mbeanserver.JmxMBeanServer@187e5769
   [junit4]   2> 1035152 INFO  (qtp2023524111-33028) [n:127.0.0.1:35997_solr c:collection2meta s:shard1 r:core_node2 x:collection2meta_shard1_replica_n1 ] o.a.s.c.SolrCore [[collection2meta_shard1_replica_n1] ] Opening new SolrCore at [/home/jenkins/workspace/Lucene-Solr-master-Linux/solr/build/solr-core/test/J2/temp/solr.cloud.AliasIntegrationTest_DA122FAB54BD28A-001/tempDir-001/node2/collection2meta_shard1_replica_n1], dataDir=[/home/jenkins/workspace/Lucene-Solr-master-Linux/solr/build/solr-core/test/J2/temp/solr.cloud.AliasIntegrationTest_DA122FAB54BD28A-001/tempDir-001/node2/./collection2meta_shard1_replica_n1/data/]
   [junit4]   2> 1035193 INFO  (qtp2023524111-33028) [n:127.0.0.1:35997_solr c:collection2meta s:shard1 r:core_node2 x:collection2meta_shard1_replica_n1 ] o.a.s.u.UpdateHandler Using UpdateLog implementation: org.apache.solr.update.UpdateLog
   [junit4]   2> 1035193 INFO  (qtp2023524111-33028) [n:127.0.0.1:35997_solr c:collection2meta s:shard1 r:core_node2 x:collection2meta_shard1_replica_n1 ] o.a.s.u.UpdateLog Initializing UpdateLog: dataDir=null defaultSyncLevel=FLUSH numRecordsToKeep=100 maxNumLogsToKeep=10 numVersionBuckets=65536
   [junit4]   2> 1035194 INFO  (qtp2023524111-33028) [n:127.0.0.1:35997_solr c:collection2meta s:shard1 r:core_node2 x:collection2meta_shard1_replica_n1 ] o.a.s.u.CommitTracker Hard AutoCommit: disabled
   [junit4]   2> 1035194 INFO  (qtp2023524111-33028) [n:127.0.0.1:35997_solr c:collection2meta s:shard1 r:core_node2 x:collection2meta_shard1_replica_n1 ] o.a.s.u.CommitTracker Soft AutoCommit: disabled
   [junit4]   2> 1035195 INFO  (qtp2023524111-33028) [n:127.0.0.1:35997_solr c:collection2meta s:shard1 r:core_node2 x:collection2meta_shard1_replica_n1 ] o.a.s.s.SolrIndexSearcher Opening [Searcher@11f34bf2[collection2meta_shard1_replica_n1] main]
   [junit4]   2> 1035197 INFO  (qtp2023524111-33028) [n:127.0.0.1:35997_solr c:collection2meta s:shard1 r:core_node2 x:collection2meta_shard1_replica_n1 ] o.a.s.r.ManagedResource

[...truncated too long message...]

eadPool.runJob(QueuedThreadPool.java:781)
   [junit4]   2> 	at org.eclipse.jetty.util.thread.QueuedThreadPool$Runner.run(QueuedThreadPool.java:917)
   [junit4]   2> 	at java.base/java.lang.Thread.run(Thread.java:835)
   [junit4]   2> Caused by: org.apache.solr.common.SolrException: Error while saving shard term for collection: rulesColl
   [junit4]   2> 	at org.apache.solr.cloud.ZkShardTerms.saveTerms(ZkShardTerms.java:307)
   [junit4]   2> 	at org.apache.solr.cloud.ZkShardTerms.removeTerm(ZkShardTerms.java:182)
   [junit4]   2> 	at org.apache.solr.cloud.ZkShardTerms.removeTerm(ZkShardTerms.java:173)
   [junit4]   2> 	at org.apache.solr.cloud.ZkCollectionTerms.remove(ZkCollectionTerms.java:52)
   [junit4]   2> 	at org.apache.solr.cloud.ZkController.unregister(ZkController.java:1643)
   [junit4]   2> 	at org.apache.solr.cloud.ZkController.unregister(ZkController.java:1637)
   [junit4]   2> 	at org.apache.solr.core.CoreContainer.unload(CoreContainer.java:1659)
   [junit4]   2> 	... 39 more
   [junit4]   2> Caused by: org.apache.zookeeper.KeeperException$SessionExpiredException: KeeperErrorCode = Session expired for /collections/rulesColl/terms/shard2
   [junit4]   2> 	at org.apache.zookeeper.KeeperException.create(KeeperException.java:134)
   [junit4]   2> 	at org.apache.zookeeper.KeeperException.create(KeeperException.java:54)
   [junit4]   2> 	at org.apache.zookeeper.ZooKeeper.setData(ZooKeeper.java:2384)
   [junit4]   2> 	at org.apache.solr.common.cloud.SolrZkClient.lambda$setData$6(SolrZkClient.java:349)
   [junit4]   2> 	at org.apache.solr.common.cloud.ZkCmdExecutor.retryOperation(ZkCmdExecutor.java:71)
   [junit4]   2> 	at org.apache.solr.common.cloud.SolrZkClient.setData(SolrZkClient.java:349)
   [junit4]   2> 	at org.apache.solr.cloud.ZkShardTerms.saveTerms(ZkShardTerms.java:297)
   [junit4]   2> 	... 45 more
   [junit4]   2> 
   [junit4]   2> 200658 INFO  (jetty-closer-279-thread-5) [     ] o.e.j.s.AbstractConnector Stopped ServerConnector@413449b3{ssl,[ssl, alpn, http/1.1, h2]}{127.0.0.1:0}
   [junit4]   2> 200658 INFO  (jetty-closer-279-thread-5) [     ] o.e.j.s.h.ContextHandler Stopped o.e.j.s.ServletContextHandler@20fba160{/solr,null,UNAVAILABLE}
   [junit4]   2> 200658 INFO  (jetty-closer-279-thread-5) [     ] o.e.j.s.session node0 Stopped scavenging
   [junit4]   2> 200757 INFO  (jetty-closer-279-thread-1) [     ] o.a.s.c.Overseer Overseer (id=72070153823977481-127.0.0.1:42797_solr-n_0000000000) closing
   [junit4]   2> 200758 INFO  (jetty-closer-279-thread-1) [     ] o.e.j.s.AbstractConnector Stopped ServerConnector@1705a1fb{ssl,[ssl, alpn, http/1.1, h2]}{127.0.0.1:0}
   [junit4]   2> 200758 INFO  (jetty-closer-279-thread-1) [     ] o.e.j.s.h.ContextHandler Stopped o.e.j.s.ServletContextHandler@11bd62e{/solr,null,UNAVAILABLE}
   [junit4]   2> 200758 INFO  (jetty-closer-279-thread-1) [     ] o.e.j.s.session node0 Stopped scavenging
   [junit4]   2> 200859 INFO  (jetty-closer-279-thread-4) [     ] o.e.j.s.AbstractConnector Stopped ServerConnector@4b628f45{ssl,[ssl, alpn, http/1.1, h2]}{127.0.0.1:0}
   [junit4]   2> 200859 INFO  (jetty-closer-279-thread-4) [     ] o.e.j.s.h.ContextHandler Stopped o.e.j.s.ServletContextHandler@3020f76e{/solr,null,UNAVAILABLE}
   [junit4]   2> 200859 INFO  (jetty-closer-279-thread-4) [     ] o.e.j.s.session node0 Stopped scavenging
   [junit4]   2> 200958 INFO  (jetty-closer-279-thread-3) [     ] o.e.j.s.AbstractConnector Stopped ServerConnector@3db12121{ssl,[ssl, alpn, http/1.1, h2]}{127.0.0.1:0}
   [junit4]   2> 200959 INFO  (jetty-closer-279-thread-3) [     ] o.e.j.s.h.ContextHandler Stopped o.e.j.s.ServletContextHandler@5a40ac62{/solr,null,UNAVAILABLE}
   [junit4]   2> 200959 INFO  (jetty-closer-279-thread-3) [     ] o.e.j.s.session node0 Stopped scavenging
   [junit4]   2> 201159 INFO  (jetty-closer-279-thread-2) [     ] o.e.j.s.AbstractConnector Stopped ServerConnector@407afae3{ssl,[ssl, alpn, http/1.1, h2]}{127.0.0.1:0}
   [junit4]   2> 201159 INFO  (jetty-closer-279-thread-2) [     ] o.e.j.s.h.ContextHandler Stopped o.e.j.s.ServletContextHandler@4f9427a1{/solr,null,UNAVAILABLE}
   [junit4]   2> 201159 INFO  (jetty-closer-279-thread-2) [     ] o.e.j.s.session node0 Stopped scavenging
   [junit4]   2> 201159 INFO  (SUITE-RulesTest-seed#[DA122FAB54BD28A]-worker) [     ] o.a.s.c.ZkTestServer Shutting down ZkTestServer.
   [junit4]   2> 201362 WARN  (ZkTestServer Run Thread) [     ] o.a.s.c.ZkTestServer Watch limit violations: 
   [junit4]   2> Maximum concurrent create/delete watches above limit:
   [junit4]   2> 
   [junit4]   2> 	18	/solr/aliases.json
   [junit4]   2> 	15	/solr/collections/rulesColl/terms/shard2
   [junit4]   2> 	11	/solr/configs/conf
   [junit4]   2> 	9	/solr/collections/modifyColl/terms/shard1
   [junit4]   2> 	8	/solr/collections/hostFragment/terms/shard1
   [junit4]   2> 	8	/solr/collections/rulesColl/terms/shard1
   [junit4]   2> 	6	/solr/collections/portRuleColl2/terms/shard1
   [junit4]   2> 	6	/solr/collections/portRuleColl/state.json
   [junit4]   2> 	6	/solr/collections/portRuleColl/terms/shard1
   [junit4]   2> 	5	/solr/security.json
   [junit4]   2> 	5	/solr/collections/modifyColl/state.json
   [junit4]   2> 	4	/solr/collections/rulesColl/state.json
   [junit4]   2> 	4	/solr/collections/hostFragment/state.json
   [junit4]   2> 	2	/solr/collections/portRuleColl2/state.json
   [junit4]   2> 
   [junit4]   2> Maximum concurrent data watches above limit:
   [junit4]   2> 
   [junit4]   2> 	105	/solr/aliases.json
   [junit4]   2> 	90	/solr/collections/rulesColl/state.json
   [junit4]   2> 	24	/solr/collections/modifyColl/state.json
   [junit4]   2> 	21	/solr/collections/portRuleColl/state.json
   [junit4]   2> 	18	/solr/clusterprops.json
   [junit4]   2> 	18	/solr/clusterstate.json
   [junit4]   2> 	16	/solr/collections/hostFragment/state.json
   [junit4]   2> 	12	/solr/collections/portRuleColl2/state.json
   [junit4]   2> 	7	/solr/autoscaling.json
   [junit4]   2> 	2	/solr/overseer_elect/election/72070153823977481-127.0.0.1:42797_solr-n_0000000000
   [junit4]   2> 	2	/solr/overseer_elect/election/72070153823977487-127.0.0.1:42209_solr-n_0000000002
   [junit4]   2> 
   [junit4]   2> Maximum concurrent children watches above limit:
   [junit4]   2> 
   [junit4]   2> 	156	/solr/collections
   [junit4]   2> 	132	/solr/overseer/queue
   [junit4]   2> 	58	/solr/overseer/collection-queue-work
   [junit4]   2> 	51	/solr/live_nodes
   [junit4]   2> 
   [junit4]   2> 201363 INFO  (SUITE-RulesTest-seed#[DA122FAB54BD28A]-worker) [     ] o.a.s.c.ZkTestServer parse host and port list: 127.0.0.1:38951
   [junit4]   2> 201363 INFO  (SUITE-RulesTest-seed#[DA122FAB54BD28A]-worker) [     ] o.a.s.c.ZkTestServer connecting to 127.0.0.1 38951
   [junit4]   2> NOTE: leaving temporary files on disk at: /home/jenkins/workspace/Lucene-Solr-master-Linux/solr/build/solr-core/test/J0/temp/solr.cloud.rule.RulesTest_DA122FAB54BD28A-001
   [junit4]   2> Jul 27, 2019 4:56:47 AM com.carrotsearch.randomizedtesting.ThreadLeakControl checkThreadLeaks
   [junit4]   2> WARNING: Will linger awaiting termination of 1 leaked thread(s).
   [junit4]   2> NOTE: test params are: codec=DummyCompressingStoredFields(storedFieldsFormat=CompressingStoredFieldsFormat(compressionMode=DUMMY, chunkSize=4, maxDocsPerChunk=954, blockSize=6), termVectorsFormat=CompressingTermVectorsFormat(compressionMode=DUMMY, chunkSize=4, blockSize=6)), sim=Asserting(org.apache.lucene.search.similarities.AssertingSimilarity@5024f052), locale=en-KI, timezone=Europe/Dublin
   [junit4]   2> NOTE: Linux 4.18.0-25-generic amd64/AdoptOpenJDK 12.0.1 (64-bit)/cpus=8,threads=1,free=302401960,total=518979584
   [junit4]   2> NOTE: All tests run in this JVM: [AliasIntegrationTest, RulesTest]
   [junit4] Completed [5/10 (3!)] on J0 in 140.09s, 7 tests, 2 errors <<< FAILURES!

[...truncated 72 lines...]
BUILD FAILED
/home/jenkins/workspace/Lucene-Solr-master-Linux/lucene/common-build.xml:1492: The following error occurred while executing this line:
/home/jenkins/workspace/Lucene-Solr-master-Linux/lucene/common-build.xml:1019: There were test failures: 10 suites, 80 tests, 6 errors [seed: DA122FAB54BD28A]

Total time: 4 minutes 38 seconds

[repro] Setting last failure code to 256

[repro] Failures:
[repro]   0/5 failed: org.apache.solr.cloud.AliasIntegrationTest
[repro]   3/5 failed: org.apache.solr.cloud.rule.RulesTest
[repro] Exiting with code 256
+ mv lucene/build lucene/build.repro
+ mv solr/build solr/build.repro
+ mv lucene/build.orig lucene/build
+ mv solr/build.orig solr/build
Archiving artifacts
Setting ANT_1_8_2_HOME=/home/jenkins/tools/hudson.tasks.Ant_AntInstallation/ANT_1.8.2
[WARNINGS] Parsing warnings in console log with parser Java Compiler (javac)
Setting ANT_1_8_2_HOME=/home/jenkins/tools/hudson.tasks.Ant_AntInstallation/ANT_1.8.2
No credentials specified
Setting ANT_1_8_2_HOME=/home/jenkins/tools/hudson.tasks.Ant_AntInstallation/ANT_1.8.2
<Git Blamer> Using GitBlamer to create author and commit information for all warnings.
<Git Blamer> GIT_COMMIT=4050ddc59beeff2be5a862782579ceb8e5775c60, workspace=/home/jenkins/workspace/Lucene-Solr-master-Linux
[WARNINGS] Computing warning deltas based on reference build #24453
Recording test results
Setting ANT_1_8_2_HOME=/home/jenkins/tools/hudson.tasks.Ant_AntInstallation/ANT_1.8.2
Build step 'Publish JUnit test result report' changed build result to UNSTABLE
Email was triggered for: Unstable (Test Failures)
Sending email for trigger: Unstable (Test Failures)
Setting ANT_1_8_2_HOME=/home/jenkins/tools/hudson.tasks.Ant_AntInstallation/ANT_1.8.2
Setting ANT_1_8_2_HOME=/home/jenkins/tools/hudson.tasks.Ant_AntInstallation/ANT_1.8.2
Setting ANT_1_8_2_HOME=/home/jenkins/tools/hudson.tasks.Ant_AntInstallation/ANT_1.8.2
Setting ANT_1_8_2_HOME=/home/jenkins/tools/hudson.tasks.Ant_AntInstallation/ANT_1.8.2
Setting ANT_1_8_2_HOME=/home/jenkins/tools/hudson.tasks.Ant_AntInstallation/ANT_1.8.2
Setting ANT_1_8_2_HOME=/home/jenkins/tools/hudson.tasks.Ant_AntInstallation/ANT_1.8.2

Mime
View raw message