lucene-dev mailing list archives

Site index · List index
Message view « Date » · « Thread »
Top « Date » · « Thread »
From Apache Jenkins Server <jenk...@builds.apache.org>
Subject [JENKINS] Lucene-Solr-NightlyTests-master - Build # 1892 - Failure
Date Sun, 07 Jul 2019 23:59:29 GMT
Build: https://builds.apache.org/job/Lucene-Solr-NightlyTests-master/1892/

2 tests failed.
FAILED:  org.apache.lucene.util.packed.TestPackedInts.testPackedLongValues

Error Message:
Test abandoned because suite timeout was reached.

Stack Trace:
java.lang.Exception: Test abandoned because suite timeout was reached.
	at __randomizedtesting.SeedInfo.seed([A329C88628380E77]:0)


FAILED:  junit.framework.TestSuite.org.apache.lucene.util.packed.TestPackedInts

Error Message:
Suite timeout exceeded (>= 7200000 msec).

Stack Trace:
java.lang.Exception: Suite timeout exceeded (>= 7200000 msec).
	at __randomizedtesting.SeedInfo.seed([A329C88628380E77]:0)




Build Log:
[...truncated 2197 lines...]
   [junit4] Suite: org.apache.lucene.util.packed.TestPackedInts
   [junit4]   2> ????? 07, 2019 2:43:16 ?????? ????? com.carrotsearch.randomizedtesting.ThreadLeakControl$2
evaluate
   [junit4]   2> WARNING: Suite execution timed out: org.apache.lucene.util.packed.TestPackedInts
   [junit4]   2>    1) Thread[id=1637, name=SUITE-TestPackedInts-seed#[A329C88628380E77],
state=RUNNABLE, group=TGRP-TestPackedInts]
   [junit4]   2>         at java.base/java.lang.Thread.getStackTrace(Thread.java:1606)
   [junit4]   2>         at com.carrotsearch.randomizedtesting.ThreadLeakControl$4.run(ThreadLeakControl.java:696)
   [junit4]   2>         at com.carrotsearch.randomizedtesting.ThreadLeakControl$4.run(ThreadLeakControl.java:693)
   [junit4]   2>         at java.base/java.security.AccessController.doPrivileged(Native
Method)
   [junit4]   2>         at com.carrotsearch.randomizedtesting.ThreadLeakControl.getStackTrace(ThreadLeakControl.java:693)
   [junit4]   2>         at com.carrotsearch.randomizedtesting.ThreadLeakControl.getThreadsWithTraces(ThreadLeakControl.java:709)
   [junit4]   2>         at com.carrotsearch.randomizedtesting.ThreadLeakControl.formatThreadStacksFull(ThreadLeakControl.java:689)
   [junit4]   2>         at com.carrotsearch.randomizedtesting.ThreadLeakControl.access$1000(ThreadLeakControl.java:65)
   [junit4]   2>         at com.carrotsearch.randomizedtesting.ThreadLeakControl$2.evaluate(ThreadLeakControl.java:415)
   [junit4]   2>         at com.carrotsearch.randomizedtesting.RandomizedRunner.runSuite(RandomizedRunner.java:708)
   [junit4]   2>         at com.carrotsearch.randomizedtesting.RandomizedRunner.access$200(RandomizedRunner.java:138)
   [junit4]   2>         at com.carrotsearch.randomizedtesting.RandomizedRunner$2.run(RandomizedRunner.java:629)
   [junit4]   2>    2) Thread[id=1, name=main, state=WAITING, group=main]
   [junit4]   2>         at java.base@11.0.1/java.lang.Object.wait(Native Method)
   [junit4]   2>         at java.base@11.0.1/java.lang.Thread.join(Thread.java:1305)
   [junit4]   2>         at java.base@11.0.1/java.lang.Thread.join(Thread.java:1379)
   [junit4]   2>         at app//com.carrotsearch.randomizedtesting.RandomizedRunner.runSuite(RandomizedRunner.java:639)
   [junit4]   2>         at app//com.carrotsearch.randomizedtesting.RandomizedRunner.run(RandomizedRunner.java:496)
   [junit4]   2>         at app//com.carrotsearch.ant.tasks.junit4.slave.SlaveMain.execute(SlaveMain.java:269)
   [junit4]   2>         at app//com.carrotsearch.ant.tasks.junit4.slave.SlaveMain.main(SlaveMain.java:394)
   [junit4]   2>         at app//com.carrotsearch.ant.tasks.junit4.slave.SlaveMainSafe.main(SlaveMainSafe.java:13)
   [junit4]   2>    3) Thread[id=1638, name=TEST-TestPackedInts.testPackedLongValues-seed#[A329C88628380E77],
state=RUNNABLE, group=TGRP-TestPackedInts]
   [junit4]   2>         at java.base@11.0.1/java.security.AccessControlContext.checkPermission(AccessControlContext.java:399)
   [junit4]   2>         at java.base@11.0.1/java.security.AccessController.checkPermission(AccessController.java:895)
   [junit4]   2>         at java.base@11.0.1/java.lang.SecurityManager.checkPermission(SecurityManager.java:322)
   [junit4]   2>         at java.base@11.0.1/java.lang.Class.checkMemberAccess(Class.java:2848)
   [junit4]   2>         at java.base@11.0.1/java.lang.Class.getDeclaredFields(Class.java:2247)
   [junit4]   2>         at app//org.apache.lucene.util.RamUsageEstimator$1.run(RamUsageEstimator.java:562)
   [junit4]   2>         at app//org.apache.lucene.util.RamUsageEstimator$1.run(RamUsageEstimator.java:559)
   [junit4]   2>         at java.base@11.0.1/java.security.AccessController.doPrivileged(Native
Method)
   [junit4]   2>         at app//org.apache.lucene.util.RamUsageEstimator.shallowSizeOfInstance(RamUsageEstimator.java:559)
   [junit4]   2>         at app//org.apache.lucene.util.RamUsageEstimator.shallowSizeOf(RamUsageEstimator.java:536)
   [junit4]   2>         at app//org.apache.lucene.util.RamUsageTester.handleOther(RamUsageTester.java:146)
   [junit4]   2>         at app//org.apache.lucene.util.RamUsageTester.measureObjectSize(RamUsageTester.java:123)
   [junit4]   2>         at app//org.apache.lucene.util.RamUsageTester.sizeOf(RamUsageTester.java:76)
   [junit4]   2>         at app//org.apache.lucene.util.RamUsageTester.sizeOf(RamUsageTester.java:81)
   [junit4]   2>         at app//org.apache.lucene.util.packed.TestPackedInts.testPackedLongValues(TestPackedInts.java:1030)
   [junit4]   2>         at java.base@11.0.1/jdk.internal.reflect.NativeMethodAccessorImpl.invoke0(Native
Method)
   [junit4]   2>         at java.base@11.0.1/jdk.internal.reflect.NativeMethodAccessorImpl.invoke(NativeMethodAccessorImpl.java:62)
   [junit4]   2>         at java.base@11.0.1/jdk.internal.reflect.DelegatingMethodAccessorImpl.invoke(DelegatingMethodAccessorImpl.java:43)
   [junit4]   2>         at java.base@11.0.1/java.lang.reflect.Method.invoke(Method.java:566)
   [junit4]   2>         at app//com.carrotsearch.randomizedtesting.RandomizedRunner.invoke(RandomizedRunner.java:1750)
   [junit4]   2>         at app//com.carrotsearch.randomizedtesting.RandomizedRunner$8.evaluate(RandomizedRunner.java:938)
   [junit4]   2>         at app//com.carrotsearch.randomizedtesting.RandomizedRunner$9.evaluate(RandomizedRunner.java:974)
   [junit4]   2>         at app//com.carrotsearch.randomizedtesting.RandomizedRunner$10.evaluate(RandomizedRunner.java:988)
   [junit4]   2>         at app//org.apache.lucene.util.TestRuleSetupTeardownChained$1.evaluate(TestRuleSetupTeardownChained.java:49)
   [junit4]   2>         at app//org.apache.lucene.util.AbstractBeforeAfterRule$1.evaluate(AbstractBeforeAfterRule.java:45)
   [junit4]   2>         at app//org.apache.lucene.util.TestRuleThreadAndTestName$1.evaluate(TestRuleThreadAndTestName.java:48)
   [junit4]   2>         at app//org.apache.lucene.util.TestRuleIgnoreAfterMaxFailures$1.evaluate(TestRuleIgnoreAfterMaxFailures.java:64)
   [junit4]   2>         at app//org.apache.lucene.util.TestRuleMarkFailure$1.evaluate(TestRuleMarkFailure.java:47)
   [junit4]   2>         at app//com.carrotsearch.randomizedtesting.rules.StatementAdapter.evaluate(StatementAdapter.java:36)
   [junit4]   2>         at app//com.carrotsearch.randomizedtesting.ThreadLeakControl$StatementRunner.run(ThreadLeakControl.java:368)
   [junit4]   2>         at app//com.carrotsearch.randomizedtesting.ThreadLeakControl.forkTimeoutingTask(ThreadLeakControl.java:817)
   [junit4]   2>         at app//com.carrotsearch.randomizedtesting.ThreadLeakControl$3.evaluate(ThreadLeakControl.java:468)
   [junit4]   2>         at app//com.carrotsearch.randomizedtesting.RandomizedRunner.runSingleTest(RandomizedRunner.java:947)
   [junit4]   2>         at app//com.carrotsearch.randomizedtesting.RandomizedRunner$5.evaluate(RandomizedRunner.java:832)
   [junit4]   2>         at app//com.carrotsearch.randomizedtesting.RandomizedRunner$6.evaluate(RandomizedRunner.java:883)
   [junit4]   2>         at app//com.carrotsearch.randomizedtesting.RandomizedRunner$7.evaluate(RandomizedRunner.java:894)
   [junit4]   2>         at app//org.apache.lucene.util.AbstractBeforeAfterRule$1.evaluate(AbstractBeforeAfterRule.java:45)
   [junit4]   2>         at app//com.carrotsearch.randomizedtesting.rules.StatementAdapter.evaluate(StatementAdapter.java:36)
   [junit4]   2>         at app//org.apache.lucene.util.TestRuleStoreClassName$1.evaluate(TestRuleStoreClassName.java:41)
   [junit4]   2>         at app//com.carrotsearch.randomizedtesting.rules.NoShadowingOrOverridesOnMethodsRule$1.evaluate(NoShadowingOrOverridesOnMethodsRule.java:40)
   [junit4]   2>         at app//com.carrotsearch.randomizedtesting.rules.NoShadowingOrOverridesOnMethodsRule$1.evaluate(NoShadowingOrOverridesOnMethodsRule.java:40)
   [junit4]   2>         at app//com.carrotsearch.randomizedtesting.rules.StatementAdapter.evaluate(StatementAdapter.java:36)
   [junit4]   2>         at app//com.carrotsearch.randomizedtesting.rules.StatementAdapter.evaluate(StatementAdapter.java:36)
   [junit4]   2>         at app//org.apache.lucene.util.TestRuleAssertionsRequired$1.evaluate(TestRuleAssertionsRequired.java:53)
   [junit4]   2>         at app//org.apache.lucene.util.TestRuleMarkFailure$1.evaluate(TestRuleMarkFailure.java:47)
   [junit4]   2>         at app//org.apache.lucene.util.TestRuleIgnoreAfterMaxFailures$1.evaluate(TestRuleIgnoreAfterMaxFailures.java:64)
   [junit4]   2>         at app//org.apache.lucene.util.TestRuleIgnoreTestSuites$1.evaluate(TestRuleIgnoreTestSuites.java:54)
   [junit4]   2>         at app//com.carrotsearch.randomizedtesting.rules.StatementAdapter.evaluate(StatementAdapter.java:36)
   [junit4]   2>         at app//com.carrotsearch.randomizedtesting.ThreadLeakControl$StatementRunner.run(ThreadLeakControl.java:368)
   [junit4]   2>         at java.base@11.0.1/java.lang.Thread.run(Thread.java:834)
   [junit4]   2>    4) Thread[id=11, name=JUnit4-serializer-daemon, state=TIMED_WAITING,
group=main]
   [junit4]   2>         at java.base@11.0.1/java.lang.Thread.sleep(Native Method)
   [junit4]   2>         at app//com.carrotsearch.ant.tasks.junit4.events.Serializer$1.run(Serializer.java:50)
   [junit4]   2> NOTE: download the large Jenkins line-docs file by running 'ant get-jenkins-line-docs'
in the lucene directory.
   [junit4]   2> NOTE: reproduce with: ant test  -Dtestcase=TestPackedInts -Dtests.method=testPackedLongValues
-Dtests.seed=A329C88628380E77 -Dtests.multiplier=2 -Dtests.nightly=true -Dtests.slow=true
-Dtests.linedocsfile=/home/jenkins/jenkins-slave/workspace/Lucene-Solr-NightlyTests-master/test-data/enwiki.random.lines.txt
-Dtests.locale=ug-CN -Dtests.timezone=Brazil/Acre -Dtests.asserts=true -Dtests.file.encoding=ISO-8859-1
   [junit4] ERROR   7200s J2 | TestPackedInts.testPackedLongValues <<<
   [junit4]    > Throwable #1: java.lang.Exception: Test abandoned because suite timeout
was reached.
   [junit4]    > 	at __randomizedtesting.SeedInfo.seed([A329C88628380E77]:0)
   [junit4]   2> ????? 07, 2019 2:43:16 ?????? ????? com.carrotsearch.randomizedtesting.ThreadLeakControl
checkThreadLeaks
   [junit4]   2> WARNING: Will linger awaiting termination of 1 leaked thread(s).
   [junit4]   2> ????? 07, 2019 2:43:37 ?????? ????? com.carrotsearch.randomizedtesting.ThreadLeakControl
checkThreadLeaks
   [junit4]   2> SEVERE: 1 thread leaked from SUITE scope at org.apache.lucene.util.packed.TestPackedInts:

   [junit4]   2>    1) Thread[id=1638, name=TEST-TestPackedInts.testPackedLongValues-seed#[A329C88628380E77],
state=RUNNABLE, group=TGRP-TestPackedInts]
   [junit4]   2>         at java.base@11.0.1/java.security.AccessController.getStackAccessControlContext(Native
Method)
   [junit4]   2>         at java.base@11.0.1/java.security.AccessController.checkPermission(AccessController.java:869)
   [junit4]   2>         at java.base@11.0.1/java.lang.SecurityManager.checkPermission(SecurityManager.java:322)
   [junit4]   2>         at java.base@11.0.1/java.lang.Class.checkMemberAccess(Class.java:2848)
   [junit4]   2>         at java.base@11.0.1/java.lang.Class.getDeclaredFields(Class.java:2247)
   [junit4]   2>         at app//org.apache.lucene.util.RamUsageEstimator$1.run(RamUsageEstimator.java:562)
   [junit4]   2>         at app//org.apache.lucene.util.RamUsageEstimator$1.run(RamUsageEstimator.java:559)
   [junit4]   2>         at java.base@11.0.1/java.security.AccessController.doPrivileged(Native
Method)
   [junit4]   2>         at app//org.apache.lucene.util.RamUsageEstimator.shallowSizeOfInstance(RamUsageEstimator.java:559)
   [junit4]   2>         at app//org.apache.lucene.util.RamUsageEstimator.shallowSizeOf(RamUsageEstimator.java:536)
   [junit4]   2>         at app//org.apache.lucene.util.RamUsageTester.handleOther(RamUsageTester.java:146)
   [junit4]   2>         at app//org.apache.lucene.util.RamUsageTester.measureObjectSize(RamUsageTester.java:123)
   [junit4]   2>         at app//org.apache.lucene.util.RamUsageTester.sizeOf(RamUsageTester.java:76)
   [junit4]   2>         at app//org.apache.lucene.util.RamUsageTester.sizeOf(RamUsageTester.java:81)
   [junit4]   2>         at app//org.apache.lucene.util.packed.TestPackedInts.testPackedLongValues(TestPackedInts.java:1030)
   [junit4]   2>         at java.base@11.0.1/jdk.internal.reflect.NativeMethodAccessorImpl.invoke0(Native
Method)
   [junit4]   2>         at java.base@11.0.1/jdk.internal.reflect.NativeMethodAccessorImpl.invoke(NativeMethodAccessorImpl.java:62)
   [junit4]   2>         at java.base@11.0.1/jdk.internal.reflect.DelegatingMethodAccessorImpl.invoke(DelegatingMethodAccessorImpl.java:43)
   [junit4]   2>         at java.base@11.0.1/java.lang.reflect.Method.invoke(Method.java:566)
   [junit4]   2>         at app//com.carrotsearch.randomizedtesting.RandomizedRunner.invoke(RandomizedRunner.java:1750)
   [junit4]   2>         at app//com.carrotsearch.randomizedtesting.RandomizedRunner$8.evaluate(RandomizedRunner.java:938)
   [junit4]   2>         at app//com.carrotsearch.randomizedtesting.RandomizedRunner$9.evaluate(RandomizedRunner.java:974)
   [junit4]   2>         at app//com.carrotsearch.randomizedtesting.RandomizedRunner$10.evaluate(RandomizedRunner.java:988)
   [junit4]   2>         at app//org.apache.lucene.util.TestRuleSetupTeardownChained$1.evaluate(TestRuleSetupTeardownChained.java:49)
   [junit4]   2>         at app//org.apache.lucene.util.AbstractBeforeAfterRule$1.evaluate(AbstractBeforeAfterRule.java:45)
   [junit4]   2>         at app//org.apache.lucene.util.TestRuleThreadAndTestName$1.evaluate(TestRuleThreadAndTestName.java:48)
   [junit4]   2>         at app//org.apache.lucene.util.TestRuleIgnoreAfterMaxFailures$1.evaluate(TestRuleIgnoreAfterMaxFailures.java:64)
   [junit4]   2>         at app//org.apache.lucene.util.TestRuleMarkFailure$1.evaluate(TestRuleMarkFailure.java:47)
   [junit4]   2>         at app//com.carrotsearch.randomizedtesting.rules.StatementAdapter.evaluate(StatementAdapter.java:36)
   [junit4]   2>         at app//com.carrotsearch.randomizedtesting.ThreadLeakControl$StatementRunner.run(ThreadLeakControl.java:368)
   [junit4]   2>         at app//com.carrotsearch.randomizedtesting.ThreadLeakControl.forkTimeoutingTask(ThreadLeakControl.java:817)
   [junit4]   2>         at app//com.carrotsearch.randomizedtesting.ThreadLeakControl$3.evaluate(ThreadLeakControl.java:468)
   [junit4]   2>         at app//com.carrotsearch.randomizedtesting.RandomizedRunner.runSingleTest(RandomizedRunner.java:947)
   [junit4]   2>         at app//com.carrotsearch.randomizedtesting.RandomizedRunner$5.evaluate(RandomizedRunner.java:832)
   [junit4]   2>         at app//com.carrotsearch.randomizedtesting.RandomizedRunner$6.evaluate(RandomizedRunner.java:883)
   [junit4]   2>         at app//com.carrotsearch.randomizedtesting.RandomizedRunner$7.evaluate(RandomizedRunner.java:894)
   [junit4]   2>         at app//org.apache.lucene.util.AbstractBeforeAfterRule$1.evaluate(AbstractBeforeAfterRule.java:45)
   [junit4]   2>         at app//com.carrotsearch.randomizedtesting.rules.StatementAdapter.evaluate(StatementAdapter.java:36)
   [junit4]   2>         at app//org.apache.lucene.util.TestRuleStoreClassName$1.evaluate(TestRuleStoreClassName.java:41)
   [junit4]   2>         at app//com.carrotsearch.randomizedtesting.rules.NoShadowingOrOverridesOnMethodsRule$1.evaluate(NoShadowingOrOverridesOnMethodsRule.java:40)
   [junit4]   2>         at app//com.carrotsearch.randomizedtesting.rules.NoShadowingOrOverridesOnMethodsRule$1.evaluate(NoShadowingOrOverridesOnMethodsRule.java:40)
   [junit4]   2>         at app//com.carrotsearch.randomizedtesting.rules.StatementAdapter.evaluate(StatementAdapter.java:36)
   [junit4]   2>         at app//com.carrotsearch.randomizedtesting.rules.StatementAdapter.evaluate(StatementAdapter.java:36)
   [junit4]   2>         at app//org.apache.lucene.util.TestRuleAssertionsRequired$1.evaluate(TestRuleAssertionsRequired.java:53)
   [junit4]   2>         at app//org.apache.lucene.util.TestRuleMarkFailure$1.evaluate(TestRuleMarkFailure.java:47)
   [junit4]   2>         at app//org.apache.lucene.util.TestRuleIgnoreAfterMaxFailures$1.evaluate(TestRuleIgnoreAfterMaxFailures.java:64)
   [junit4]   2>         at app//org.apache.lucene.util.TestRuleIgnoreTestSuites$1.evaluate(TestRuleIgnoreTestSuites.java:54)
   [junit4]   2>         at app//com.carrotsearch.randomizedtesting.rules.StatementAdapter.evaluate(StatementAdapter.java:36)
   [junit4]   2>         at app//com.carrotsearch.randomizedtesting.ThreadLeakControl$StatementRunner.run(ThreadLeakControl.java:368)
   [junit4]   2>         at java.base@11.0.1/java.lang.Thread.run(Thread.java:834)
   [junit4]   2> ????? 07, 2019 2:43:37 ?????? ????? com.carrotsearch.randomizedtesting.ThreadLeakControl
tryToInterruptAll
   [junit4]   2> INFO: Starting to interrupt leaked threads:
   [junit4]   2>    1) Thread[id=1638, name=TEST-TestPackedInts.testPackedLongValues-seed#[A329C88628380E77],
state=RUNNABLE, group=TGRP-TestPackedInts]
   [junit4]   2> ????? 07, 2019 2:43:39 ?????? ????? com.carrotsearch.randomizedtesting.ThreadLeakControl
tryToInterruptAll
   [junit4]   2> SEVERE: There are still zombie threads that couldn't be terminated:
   [junit4]   2>    1) Thread[id=1638, name=TEST-TestPackedInts.testPackedLongValues-seed#[A329C88628380E77],
state=RUNNABLE, group=TGRP-TestPackedInts]
   [junit4]   2>         at java.base@11.0.1/java.security.AccessController.getStackAccessControlContext(Native
Method)
   [junit4]   2>         at java.base@11.0.1/java.security.AccessController.checkPermission(AccessController.java:869)
   [junit4]   2>         at java.base@11.0.1/java.lang.SecurityManager.checkPermission(SecurityManager.java:322)
   [junit4]   2>         at java.base@11.0.1/java.lang.Class.checkMemberAccess(Class.java:2848)
   [junit4]   2>         at java.base@11.0.1/java.lang.Class.getDeclaredFields(Class.java:2247)
   [junit4]   2>         at app//org.apache.lucene.util.RamUsageEstimator$1.run(RamUsageEstimator.java:562)
   [junit4]   2>         at app//org.apache.lucene.util.RamUsageEstimator$1.run(RamUsageEstimator.java:559)
   [junit4]   2>         at java.base@11.0.1/java.security.AccessController.doPrivileged(Native
Method)
   [junit4]   2>         at app//org.apache.lucene.util.RamUsageEstimator.shallowSizeOfInstance(RamUsageEstimator.java:559)
   [junit4]   2>         at app//org.apache.lucene.util.RamUsageEstimator.shallowSizeOf(RamUsageEstimator.java:536)
   [junit4]   2>         at app//org.apache.lucene.util.RamUsageTester.handleOther(RamUsageTester.java:146)
   [junit4]   2>         at app//org.apache.lucene.util.RamUsageTester.measureObjectSize(RamUsageTester.java:123)
   [junit4]   2>         at app//org.apache.lucene.util.RamUsageTester.sizeOf(RamUsageTester.java:76)
   [junit4]   2>         at app//org.apache.lucene.util.RamUsageTester.sizeOf(RamUsageTester.java:81)
   [junit4]   2>         at app//org.apache.lucene.util.packed.TestPackedInts.testPackedLongValues(TestPackedInts.java:1030)
   [junit4]   2>         at java.base@11.0.1/jdk.internal.reflect.NativeMethodAccessorImpl.invoke0(Native
Method)
   [junit4]   2>         at java.base@11.0.1/jdk.internal.reflect.NativeMethodAccessorImpl.invoke(NativeMethodAccessorImpl.java:62)
   [junit4]   2>         at java.base@11.0.1/jdk.internal.reflect.DelegatingMethodAccessorImpl.invoke(DelegatingMethodAccessorImpl.java:43)
   [junit4]   2>         at java.base@11.0.1/java.lang.reflect.Method.invoke(Method.java:566)
   [junit4]   2>         at app//com.carrotsearch.randomizedtesting.RandomizedRunner.invoke(RandomizedRunner.java:1750)
   [junit4]   2>         at app//com.carrotsearch.randomizedtesting.RandomizedRunner$8.evaluate(RandomizedRunner.java:938)
   [junit4]   2>         at app//com.carrotsearch.randomizedtesting.RandomizedRunner$9.evaluate(RandomizedRunner.java:974)
   [junit4]   2>         at app//com.carrotsearch.randomizedtesting.RandomizedRunner$10.evaluate(RandomizedRunner.java:988)
   [junit4]   2>         at app//org.apache.lucene.util.TestRuleSetupTeardownChained$1.evaluate(TestRuleSetupTeardownChained.java:49)
   [junit4]   2>         at app//org.apache.lucene.util.AbstractBeforeAfterRule$1.evaluate(AbstractBeforeAfterRule.java:45)
   [junit4]   2>         at app//org.apache.lucene.util.TestRuleThreadAndTestName$1.evaluate(TestRuleThreadAndTestName.java:48)
   [junit4]   2>         at app//org.apache.lucene.util.TestRuleIgnoreAfterMaxFailures$1.evaluate(TestRuleIgnoreAfterMaxFailures.java:64)
   [junit4]   2>         at app//org.apache.lucene.util.TestRuleMarkFailure$1.evaluate(TestRuleMarkFailure.java:47)
   [junit4]   2>         at app//com.carrotsearch.randomizedtesting.rules.StatementAdapter.evaluate(StatementAdapter.java:36)
   [junit4]   2>         at app//com.carrotsearch.randomizedtesting.ThreadLeakControl$StatementRunner.run(ThreadLeakControl.java:368)
   [junit4]   2>         at app//com.carrotsearch.randomizedtesting.ThreadLeakControl.forkTimeoutingTask(ThreadLeakControl.java:817)
   [junit4]   2>         at app//com.carrotsearch.randomizedtesting.ThreadLeakControl$3.evaluate(ThreadLeakControl.java:468)
   [junit4]   2>         at app//com.carrotsearch.randomizedtesting.RandomizedRunner.runSingleTest(RandomizedRunner.java:947)
   [junit4]   2>         at app//com.carrotsearch.randomizedtesting.RandomizedRunner$5.evaluate(RandomizedRunner.java:832)
   [junit4]   2>         at app//com.carrotsearch.randomizedtesting.RandomizedRunner$6.evaluate(RandomizedRunner.java:883)
   [junit4]   2>         at app//com.carrotsearch.randomizedtesting.RandomizedRunner$7.evaluate(RandomizedRunner.java:894)
   [junit4]   2>         at app//org.apache.lucene.util.AbstractBeforeAfterRule$1.evaluate(AbstractBeforeAfterRule.java:45)
   [junit4]   2>         at app//com.carrotsearch.randomizedtesting.rules.StatementAdapter.evaluate(StatementAdapter.java:36)
   [junit4]   2>         at app//org.apache.lucene.util.TestRuleStoreClassName$1.evaluate(TestRuleStoreClassName.java:41)
   [junit4]   2>         at app//com.carrotsearch.randomizedtesting.rules.NoShadowingOrOverridesOnMethodsRule$1.evaluate(NoShadowingOrOverridesOnMethodsRule.java:40)
   [junit4]   2>         at app//com.carrotsearch.randomizedtesting.rules.NoShadowingOrOverridesOnMethodsRule$1.evaluate(NoShadowingOrOverridesOnMethodsRule.java:40)
   [junit4]   2>         at app//com.carrotsearch.randomizedtesting.rules.StatementAdapter.evaluate(StatementAdapter.java:36)
   [junit4]   2>         at app//com.carrotsearch.randomizedtesting.rules.StatementAdapter.evaluate(StatementAdapter.java:36)
   [junit4]   2>         at app//org.apache.lucene.util.TestRuleAssertionsRequired$1.evaluate(TestRuleAssertionsRequired.java:53)
   [junit4]   2>         at app//org.apache.lucene.util.TestRuleMarkFailure$1.evaluate(TestRuleMarkFailure.java:47)
   [junit4]   2>         at app//org.apache.lucene.util.TestRuleIgnoreAfterMaxFailures$1.evaluate(TestRuleIgnoreAfterMaxFailures.java:64)
   [junit4]   2>         at app//org.apache.lucene.util.TestRuleIgnoreTestSuites$1.evaluate(TestRuleIgnoreTestSuites.java:54)
   [junit4]   2>         at app//com.carrotsearch.randomizedtesting.rules.StatementAdapter.evaluate(StatementAdapter.java:36)
   [junit4]   2>         at app//com.carrotsearch.randomizedtesting.ThreadLeakControl$StatementRunner.run(ThreadLeakControl.java:368)
   [junit4]   2>         at java.base@11.0.1/java.lang.Thread.run(Thread.java:834)
   [junit4]   2> NOTE: test params are: codec=Asserting(Lucene80): {}, docValues:{}, maxPointsInLeafNode=599,
maxMBSortInHeap=5.9135731436766, sim=Asserting(org.apache.lucene.search.similarities.AssertingSimilarity@bd55ada),
locale=ug-CN, timezone=Brazil/Acre
   [junit4]   2> NOTE: Linux 4.4.0-137-generic amd64/Oracle Corporation 11.0.1 (64-bit)/cpus=4,threads=2,free=182473208,total=402653184
   [junit4]   2> NOTE: All tests run in this JVM: [TestAxiomaticF3EXP, TestAllFilesHaveCodecHeader,
TestLatLonPoint, TestSortRescorer, TestMatchNoDocsQuery, TestCompetitiveFreqNormAccumulator,
TestDeterminism, TestDocIdSetBuilder, TestSegmentCacheables, TestIndexFileDeleter, TestByteBuffersDirectory,
TestIndexSearcher, TestAxiomaticF1LOG, TestTermsEnum2, TestNewestSegment, TestLongRangeFieldQueries,
TestDocValuesQueries, TestSpanSearchEquivalence, TestCharacterUtils, TestTopFieldCollector,
TestFieldCacheRewriteMethod, TestSegmentReader, TestFieldInfos, TestPointValues, TermInSetQueryTest,
TestSameScoresWithThreads, TestPrefixRandom, TestUpgradeIndexMergePolicy, TestStressAdvance,
TestPhraseQuery, TestMixedDocValuesUpdates, TestWildcard, TestMultiLevelSkipList, TestOmitNorms,
TestTragicIndexWriterDeadlock, TestDoubleRange, TestNoMergeScheduler, TestMaxTermFrequency,
TestIOUtils, TestNormsFieldExistsQuery, TestIndexWriterOutOfFileDescriptors, TestSortedSetSortField,
TestParallelLeafReader, TestRangeFieldsDocValuesQuery, TestNativeFSLockFactory, TestCrash,
TestSearchAfter, TestLucene60PointsFormat, TestIndexWriterOnDiskFull, TestMinimize, TestUTF32ToUTF8,
TestIndexWriterMergePolicy, TestFieldUpdatesBuffer, TestSimilarityProvider, Test2BBinaryDocValues,
TestFloatRange, TestDateSort, TestSimpleFSLockFactory, TestBooleanOr, TestFlex, TestReaderWrapperDVTypeCheck,
TestByteArrayDataInput, TestTotalHits, TestSegmentToThreadMapping, TestGeoUtils, TestPendingSoftDeletes,
TestFeatureSort, TestBytesRefArray, TestExternalCodecs, TestPositiveScoresOnlyCollector, TestTimeLimitingCollector,
TestIndexWriterFromReader, TestByteSlices, TestIndexOptions, TestSpansEnum, TestLongDistanceFeatureQuery,
TestIndependenceChiSquared, TestDocValues, TestPackedInts]
   [junit4]   2> NOTE: download the large Jenkins line-docs file by running 'ant get-jenkins-line-docs'
in the lucene directory.
   [junit4]   2> NOTE: reproduce with: ant test  -Dtestcase=TestPackedInts -Dtests.seed=A329C88628380E77
-Dtests.multiplier=2 -Dtests.nightly=true -Dtests.slow=true -Dtests.linedocsfile=/home/jenkins/jenkins-slave/workspace/Lucene-Solr-NightlyTests-master/test-data/enwiki.random.lines.txt
-Dtests.locale=ug-CN -Dtests.timezone=Brazil/Acre -Dtests.asserts=true -Dtests.file.encoding=ISO-8859-1
   [junit4] ERROR   0.00s J2 | TestPackedInts (suite) <<<
   [junit4]    > Throwable #1: java.lang.Exception: Suite timeout exceeded (>= 7200000
msec).
   [junit4]    > 	at __randomizedtesting.SeedInfo.seed([A329C88628380E77]:0)
   [junit4] Completed [514/522 (1!)] on J2 in 7222.82s, 1 test, 2 errors <<< FAILURES!

[...truncated 63078 lines...]
-ecj-javadoc-lint-src:
    [mkdir] Created dir: /tmp/ecj1058740106
 [ecj-lint] Compiling 69 source files to /tmp/ecj1058740106
 [ecj-lint] invalid Class-Path header in manifest of jar file: /x1/jenkins/.ivy2/cache/org.restlet.jee/org.restlet/jars/org.restlet-2.3.0.jar
 [ecj-lint] invalid Class-Path header in manifest of jar file: /x1/jenkins/.ivy2/cache/org.restlet.jee/org.restlet.ext.servlet/jars/org.restlet.ext.servlet-2.3.0.jar
 [ecj-lint] ----------
 [ecj-lint] 1. ERROR in /x1/jenkins/jenkins-slave/workspace/Lucene-Solr-NightlyTests-master/checkout/solr/contrib/dataimporthandler/src/java/org/apache/solr/handler/dataimport/JdbcDataSource.java
(at line 28)
 [ecj-lint] 	import javax.naming.InitialContext;
 [ecj-lint] 	       ^^^^^^^^^^^^^^^^^^^^^^^^^^^
 [ecj-lint] The type javax.naming.InitialContext is not accessible
 [ecj-lint] ----------
 [ecj-lint] 2. ERROR in /x1/jenkins/jenkins-slave/workspace/Lucene-Solr-NightlyTests-master/checkout/solr/contrib/dataimporthandler/src/java/org/apache/solr/handler/dataimport/JdbcDataSource.java
(at line 29)
 [ecj-lint] 	import javax.naming.NamingException;
 [ecj-lint] 	       ^^^^^^^^^^^^^^^^^^^^^^^^^^^^
 [ecj-lint] The type javax.naming.NamingException is not accessible
 [ecj-lint] ----------
 [ecj-lint] 3. ERROR in /x1/jenkins/jenkins-slave/workspace/Lucene-Solr-NightlyTests-master/checkout/solr/contrib/dataimporthandler/src/java/org/apache/solr/handler/dataimport/JdbcDataSource.java
(at line 182)
 [ecj-lint] 	c = getFromJndi(initProps, jndiName);
 [ecj-lint] 	    ^^^^^^^^^^^
 [ecj-lint] The method getFromJndi(Properties, String) from the type new Callable<Connection>(){}
refers to the missing type NamingException
 [ecj-lint] ----------
 [ecj-lint] 4. ERROR in /x1/jenkins/jenkins-slave/workspace/Lucene-Solr-NightlyTests-master/checkout/solr/contrib/dataimporthandler/src/java/org/apache/solr/handler/dataimport/JdbcDataSource.java
(at line 245)
 [ecj-lint] 	private Connection getFromJndi(final Properties initProps, final String jndiName)
throws NamingException,
 [ecj-lint] 	                                                                            
            ^^^^^^^^^^^^^^^
 [ecj-lint] NamingException cannot be resolved to a type
 [ecj-lint] ----------
 [ecj-lint] 5. ERROR in /x1/jenkins/jenkins-slave/workspace/Lucene-Solr-NightlyTests-master/checkout/solr/contrib/dataimporthandler/src/java/org/apache/solr/handler/dataimport/JdbcDataSource.java
(at line 249)
 [ecj-lint] 	InitialContext ctx =  new InitialContext();
 [ecj-lint] 	^^^^^^^^^^^^^^
 [ecj-lint] InitialContext cannot be resolved to a type
 [ecj-lint] ----------
 [ecj-lint] 6. ERROR in /x1/jenkins/jenkins-slave/workspace/Lucene-Solr-NightlyTests-master/checkout/solr/contrib/dataimporthandler/src/java/org/apache/solr/handler/dataimport/JdbcDataSource.java
(at line 249)
 [ecj-lint] 	InitialContext ctx =  new InitialContext();
 [ecj-lint] 	                          ^^^^^^^^^^^^^^
 [ecj-lint] InitialContext cannot be resolved to a type
 [ecj-lint] ----------
 [ecj-lint] 6 problems (6 errors)

BUILD FAILED
/x1/jenkins/jenkins-slave/workspace/Lucene-Solr-NightlyTests-master/checkout/build.xml:652:
The following error occurred while executing this line:
/x1/jenkins/jenkins-slave/workspace/Lucene-Solr-NightlyTests-master/checkout/build.xml:101:
The following error occurred while executing this line:
/x1/jenkins/jenkins-slave/workspace/Lucene-Solr-NightlyTests-master/checkout/solr/build.xml:651:
The following error occurred while executing this line:
/x1/jenkins/jenkins-slave/workspace/Lucene-Solr-NightlyTests-master/checkout/solr/common-build.xml:479:
The following error occurred while executing this line:
/x1/jenkins/jenkins-slave/workspace/Lucene-Solr-NightlyTests-master/checkout/lucene/common-build.xml:2009:
The following error occurred while executing this line:
/x1/jenkins/jenkins-slave/workspace/Lucene-Solr-NightlyTests-master/checkout/lucene/common-build.xml:2048:
Compile failed; see the compiler error output for details.

Total time: 394 minutes 29 seconds
Build step 'Invoke Ant' marked build as failure
Archiving artifacts
Recording test results
Email was triggered for: Failure - Any
Sending email for trigger: Failure - Any

Mime
View raw message