lucene-dev mailing list archives

Site index · List index
Message view « Date » · « Thread »
Top « Date » · « Thread »
From Apache Jenkins Server <jenk...@builds.apache.org>
Subject [JENKINS] Lucene-Solr-NightlyTests-8.1 - Build # 49 - Failure
Date Tue, 02 Jul 2019 04:50:13 GMT
Build: https://builds.apache.org/job/Lucene-Solr-NightlyTests-8.1/49/

8 tests failed.
FAILED:  org.apache.lucene.index.TestIndexWriterThreadsToSegments.testSegmentCountOnFlushRandom

Error Message:
Test abandoned because suite timeout was reached.

Stack Trace:
java.lang.Exception: Test abandoned because suite timeout was reached.
	at __randomizedtesting.SeedInfo.seed([D563D606E1A2C66F]:0)


FAILED:  junit.framework.TestSuite.org.apache.lucene.index.TestIndexWriterThreadsToSegments

Error Message:
Suite timeout exceeded (>= 7200000 msec).

Stack Trace:
java.lang.Exception: Suite timeout exceeded (>= 7200000 msec).
	at __randomizedtesting.SeedInfo.seed([D563D606E1A2C66F]:0)


FAILED:  junit.framework.TestSuite.org.apache.lucene.index.TestIndexWriterThreadsToSegments

Error Message:
Captured an uncaught exception in thread: Thread[id=4748, name=Thread-4262, state=RUNNABLE, group=TGRP-TestIndexWriterThreadsToSegments]

Stack Trace:
com.carrotsearch.randomizedtesting.UncaughtExceptionError: Captured an uncaught exception in thread: Thread[id=4748, name=Thread-4262, state=RUNNABLE, group=TGRP-TestIndexWriterThreadsToSegments]
Caused by: java.lang.RuntimeException: org.apache.lucene.store.AlreadyClosedException: this IndexWriter is closed
	at __randomizedtesting.SeedInfo.seed([D563D606E1A2C66F]:0)
	at org.apache.lucene.index.TestIndexWriterThreadsToSegments$2.run(TestIndexWriterThreadsToSegments.java:220)
Caused by: org.apache.lucene.store.AlreadyClosedException: this IndexWriter is closed
	at org.apache.lucene.index.IndexWriter.ensureOpen(IndexWriter.java:681)
	at org.apache.lucene.index.IndexWriter.ensureOpen(IndexWriter.java:695)
	at org.apache.lucene.index.IndexWriter.updateDocument(IndexWriter.java:1591)
	at org.apache.lucene.index.IndexWriter.addDocument(IndexWriter.java:1213)
	at org.apache.lucene.index.TestIndexWriterThreadsToSegments$2.run(TestIndexWriterThreadsToSegments.java:209)
Caused by: java.lang.OutOfMemoryError: GC overhead limit exceeded
	at __randomizedtesting.SeedInfo.seed([D563D606E1A2C66F]:0)
	at org.apache.lucene.analysis.MockTokenizer.readChar(MockTokenizer.java:237)
	at org.apache.lucene.analysis.MockTokenizer.readCodePoint(MockTokenizer.java:203)
	at org.apache.lucene.analysis.MockTokenizer.incrementToken(MockTokenizer.java:164)
	at org.apache.lucene.analysis.MockTokenFilter.incrementToken(MockTokenFilter.java:80)
	at org.apache.lucene.analysis.MockVariableLengthPayloadFilter.incrementToken(MockVariableLengthPayloadFilter.java:44)
	at org.apache.lucene.index.DefaultIndexingChain$PerField.invert(DefaultIndexingChain.java:812)
	at org.apache.lucene.index.DefaultIndexingChain.processField(DefaultIndexingChain.java:442)
	at org.apache.lucene.index.DefaultIndexingChain.processDocument(DefaultIndexingChain.java:406)
	at org.apache.lucene.index.DocumentsWriterPerThread.updateDocument(DocumentsWriterPerThread.java:250)
	at org.apache.lucene.index.DocumentsWriter.updateDocument(DocumentsWriter.java:494)
	at org.apache.lucene.index.IndexWriter.updateDocument(IndexWriter.java:1594)
	... 2 more


FAILED:  junit.framework.TestSuite.org.apache.lucene.index.TestIndexWriterThreadsToSegments

Error Message:
Captured an uncaught exception in thread: Thread[id=4745, name=Thread-4259, state=RUNNABLE, group=TGRP-TestIndexWriterThreadsToSegments]

Stack Trace:
com.carrotsearch.randomizedtesting.UncaughtExceptionError: Captured an uncaught exception in thread: Thread[id=4745, name=Thread-4259, state=RUNNABLE, group=TGRP-TestIndexWriterThreadsToSegments]
Caused by: java.lang.OutOfMemoryError: GC overhead limit exceeded
	at __randomizedtesting.SeedInfo.seed([D563D606E1A2C66F]:0)
	at org.apache.lucene.analysis.MockTokenizer.readChar(MockTokenizer.java:237)
	at org.apache.lucene.analysis.MockTokenizer.readCodePoint(MockTokenizer.java:203)
	at org.apache.lucene.analysis.MockTokenizer.incrementToken(MockTokenizer.java:164)
	at org.apache.lucene.analysis.MockTokenFilter.incrementToken(MockTokenFilter.java:80)
	at org.apache.lucene.analysis.MockVariableLengthPayloadFilter.incrementToken(MockVariableLengthPayloadFilter.java:44)
	at org.apache.lucene.index.DefaultIndexingChain$PerField.invert(DefaultIndexingChain.java:812)
	at org.apache.lucene.index.DefaultIndexingChain.processField(DefaultIndexingChain.java:442)
	at org.apache.lucene.index.DefaultIndexingChain.processDocument(DefaultIndexingChain.java:406)
	at org.apache.lucene.index.DocumentsWriterPerThread.updateDocument(DocumentsWriterPerThread.java:250)
	at org.apache.lucene.index.DocumentsWriter.updateDocument(DocumentsWriter.java:494)
	at org.apache.lucene.index.IndexWriter.updateDocument(IndexWriter.java:1594)
	at org.apache.lucene.index.IndexWriter.addDocument(IndexWriter.java:1213)
	at org.apache.lucene.index.TestIndexWriterThreadsToSegments$2.run(TestIndexWriterThreadsToSegments.java:209)


FAILED:  junit.framework.TestSuite.org.apache.lucene.index.TestIndexWriterThreadsToSegments

Error Message:
Captured an uncaught exception in thread: Thread[id=4746, name=Thread-4260, state=RUNNABLE, group=TGRP-TestIndexWriterThreadsToSegments]

Stack Trace:
com.carrotsearch.randomizedtesting.UncaughtExceptionError: Captured an uncaught exception in thread: Thread[id=4746, name=Thread-4260, state=RUNNABLE, group=TGRP-TestIndexWriterThreadsToSegments]
Caused by: java.lang.OutOfMemoryError: GC overhead limit exceeded
	at __randomizedtesting.SeedInfo.seed([D563D606E1A2C66F]:0)
	at java.io.BufferedOutputStream.<init>(BufferedOutputStream.java:76)
	at org.apache.lucene.store.OutputStreamIndexOutput.<init>(OutputStreamIndexOutput.java:42)
	at org.apache.lucene.store.FSDirectory$FSIndexOutput.<init>(FSDirectory.java:411)
	at org.apache.lucene.store.FSDirectory$FSIndexOutput.<init>(FSDirectory.java:407)
	at org.apache.lucene.store.FSDirectory.createOutput(FSDirectory.java:255)
	at org.apache.lucene.store.MockDirectoryWrapper.createOutput(MockDirectoryWrapper.java:667)
	at org.apache.lucene.store.LockValidatingDirectoryWrapper.createOutput(LockValidatingDirectoryWrapper.java:44)
	at org.apache.lucene.store.TrackingDirectoryWrapper.createOutput(TrackingDirectoryWrapper.java:43)
	at org.apache.lucene.codecs.compressing.CompressingStoredFieldsWriter.<init>(CompressingStoredFieldsWriter.java:115)
	at org.apache.lucene.codecs.compressing.CompressingStoredFieldsFormat.fieldsWriter(CompressingStoredFieldsFormat.java:128)
	at org.apache.lucene.codecs.lucene50.Lucene50StoredFieldsFormat.fieldsWriter(Lucene50StoredFieldsFormat.java:183)
	at org.apache.lucene.codecs.asserting.AssertingStoredFieldsFormat.fieldsWriter(AssertingStoredFieldsFormat.java:48)
	at org.apache.lucene.index.StoredFieldsConsumer.initStoredFieldsWriter(StoredFieldsConsumer.java:39)
	at org.apache.lucene.index.StoredFieldsConsumer.startDocument(StoredFieldsConsumer.java:46)
	at org.apache.lucene.index.DefaultIndexingChain.startStoredFields(DefaultIndexingChain.java:367)
	at org.apache.lucene.index.DefaultIndexingChain.processDocument(DefaultIndexingChain.java:403)
	at org.apache.lucene.index.DocumentsWriterPerThread.updateDocument(DocumentsWriterPerThread.java:250)
	at org.apache.lucene.index.DocumentsWriter.updateDocument(DocumentsWriter.java:494)
	at org.apache.lucene.index.IndexWriter.updateDocument(IndexWriter.java:1594)
	at org.apache.lucene.index.IndexWriter.addDocument(IndexWriter.java:1213)
	at org.apache.lucene.index.TestIndexWriterThreadsToSegments$2.run(TestIndexWriterThreadsToSegments.java:209)


FAILED:  junit.framework.TestSuite.org.apache.lucene.index.TestIndexWriterThreadsToSegments

Error Message:
Captured an uncaught exception in thread: Thread[id=4744, name=Thread-4258, state=RUNNABLE, group=TGRP-TestIndexWriterThreadsToSegments]

Stack Trace:
com.carrotsearch.randomizedtesting.UncaughtExceptionError: Captured an uncaught exception in thread: Thread[id=4744, name=Thread-4258, state=RUNNABLE, group=TGRP-TestIndexWriterThreadsToSegments]
Caused by: java.lang.RuntimeException: org.apache.lucene.store.AlreadyClosedException: this IndexWriter is closed
	at __randomizedtesting.SeedInfo.seed([D563D606E1A2C66F]:0)
	at org.apache.lucene.index.TestIndexWriterThreadsToSegments$2.run(TestIndexWriterThreadsToSegments.java:220)
Caused by: org.apache.lucene.store.AlreadyClosedException: this IndexWriter is closed
	at org.apache.lucene.index.IndexWriter.ensureOpen(IndexWriter.java:681)
	at org.apache.lucene.index.IndexWriter.ensureOpen(IndexWriter.java:695)
	at org.apache.lucene.index.IndexWriter.updateDocument(IndexWriter.java:1591)
	at org.apache.lucene.index.IndexWriter.addDocument(IndexWriter.java:1213)
	at org.apache.lucene.index.TestIndexWriterThreadsToSegments$2.run(TestIndexWriterThreadsToSegments.java:209)
Caused by: java.lang.OutOfMemoryError: GC overhead limit exceeded
	at __randomizedtesting.SeedInfo.seed([D563D606E1A2C66F]:0)
	at org.apache.lucene.analysis.MockTokenizer.readChar(MockTokenizer.java:237)
	at org.apache.lucene.analysis.MockTokenizer.readCodePoint(MockTokenizer.java:203)
	at org.apache.lucene.analysis.MockTokenizer.incrementToken(MockTokenizer.java:164)
	at org.apache.lucene.analysis.MockTokenFilter.incrementToken(MockTokenFilter.java:80)
	at org.apache.lucene.analysis.MockVariableLengthPayloadFilter.incrementToken(MockVariableLengthPayloadFilter.java:44)
	at org.apache.lucene.index.DefaultIndexingChain$PerField.invert(DefaultIndexingChain.java:812)
	at org.apache.lucene.index.DefaultIndexingChain.processField(DefaultIndexingChain.java:442)
	at org.apache.lucene.index.DefaultIndexingChain.processDocument(DefaultIndexingChain.java:406)
	at org.apache.lucene.index.DocumentsWriterPerThread.updateDocument(DocumentsWriterPerThread.java:250)
	at org.apache.lucene.index.DocumentsWriter.updateDocument(DocumentsWriter.java:494)
	at org.apache.lucene.index.IndexWriter.updateDocument(IndexWriter.java:1594)
	... 2 more


FAILED:  junit.framework.TestSuite.org.apache.lucene.index.TestIndexWriterThreadsToSegments

Error Message:
Captured an uncaught exception in thread: Thread[id=4742, name=Thread-4256, state=RUNNABLE, group=TGRP-TestIndexWriterThreadsToSegments]

Stack Trace:
com.carrotsearch.randomizedtesting.UncaughtExceptionError: Captured an uncaught exception in thread: Thread[id=4742, name=Thread-4256, state=RUNNABLE, group=TGRP-TestIndexWriterThreadsToSegments]
Caused by: java.lang.OutOfMemoryError: GC overhead limit exceeded
	at __randomizedtesting.SeedInfo.seed([D563D606E1A2C66F]:0)
	at sun.nio.fs.UnixPath.encode(UnixPath.java:132)
	at sun.nio.fs.UnixPath.<init>(UnixPath.java:71)
	at sun.nio.fs.UnixFileSystem.getPath(UnixFileSystem.java:281)
	at sun.nio.fs.AbstractPath.resolve(AbstractPath.java:53)
	at org.apache.lucene.mockfile.FilterPath.resolve(FilterPath.java:155)
	at org.apache.lucene.mockfile.FilterPath.resolve(FilterPath.java:155)
	at org.apache.lucene.mockfile.FilterPath.resolve(FilterPath.java:155)
	at org.apache.lucene.mockfile.FilterPath.resolve(FilterPath.java:155)
	at org.apache.lucene.mockfile.FilterPath.resolve(FilterPath.java:155)
	at org.apache.lucene.store.FSDirectory$FSIndexOutput.<init>(FSDirectory.java:411)
	at org.apache.lucene.store.FSDirectory$FSIndexOutput.<init>(FSDirectory.java:407)
	at org.apache.lucene.store.FSDirectory.createOutput(FSDirectory.java:255)
	at org.apache.lucene.store.MockDirectoryWrapper.createOutput(MockDirectoryWrapper.java:667)
	at org.apache.lucene.store.LockValidatingDirectoryWrapper.createOutput(LockValidatingDirectoryWrapper.java:44)
	at org.apache.lucene.store.TrackingDirectoryWrapper.createOutput(TrackingDirectoryWrapper.java:43)
	at org.apache.lucene.codecs.compressing.CompressingStoredFieldsWriter.<init>(CompressingStoredFieldsWriter.java:115)
	at org.apache.lucene.codecs.compressing.CompressingStoredFieldsFormat.fieldsWriter(CompressingStoredFieldsFormat.java:128)
	at org.apache.lucene.codecs.lucene50.Lucene50StoredFieldsFormat.fieldsWriter(Lucene50StoredFieldsFormat.java:183)
	at org.apache.lucene.codecs.asserting.AssertingStoredFieldsFormat.fieldsWriter(AssertingStoredFieldsFormat.java:48)
	at org.apache.lucene.index.StoredFieldsConsumer.initStoredFieldsWriter(StoredFieldsConsumer.java:39)
	at org.apache.lucene.index.StoredFieldsConsumer.startDocument(StoredFieldsConsumer.java:46)
	at org.apache.lucene.index.DefaultIndexingChain.startStoredFields(DefaultIndexingChain.java:367)
	at org.apache.lucene.index.DefaultIndexingChain.processDocument(DefaultIndexingChain.java:403)
	at org.apache.lucene.index.DocumentsWriterPerThread.updateDocument(DocumentsWriterPerThread.java:250)
	at org.apache.lucene.index.DocumentsWriter.updateDocument(DocumentsWriter.java:494)
	at org.apache.lucene.index.IndexWriter.updateDocument(IndexWriter.java:1594)
	at org.apache.lucene.index.IndexWriter.addDocument(IndexWriter.java:1213)
	at org.apache.lucene.index.TestIndexWriterThreadsToSegments$2.run(TestIndexWriterThreadsToSegments.java:209)


FAILED:  junit.framework.TestSuite.org.apache.lucene.index.TestIndexWriterThreadsToSegments

Error Message:
Captured an uncaught exception in thread: Thread[id=4741, name=Thread-4255, state=RUNNABLE, group=TGRP-TestIndexWriterThreadsToSegments]

Stack Trace:
com.carrotsearch.randomizedtesting.UncaughtExceptionError: Captured an uncaught exception in thread: Thread[id=4741, name=Thread-4255, state=RUNNABLE, group=TGRP-TestIndexWriterThreadsToSegments]
Caused by: java.lang.RuntimeException: org.apache.lucene.store.AlreadyClosedException: this IndexWriter is closed
	at __randomizedtesting.SeedInfo.seed([D563D606E1A2C66F]:0)
	at org.apache.lucene.index.TestIndexWriterThreadsToSegments$2.run(TestIndexWriterThreadsToSegments.java:220)
Caused by: org.apache.lucene.store.AlreadyClosedException: this IndexWriter is closed
	at org.apache.lucene.index.IndexWriter.ensureOpen(IndexWriter.java:681)
	at org.apache.lucene.index.IndexWriter.ensureOpen(IndexWriter.java:695)
	at org.apache.lucene.index.IndexWriter.updateDocument(IndexWriter.java:1591)
	at org.apache.lucene.index.IndexWriter.addDocument(IndexWriter.java:1213)
	at org.apache.lucene.index.TestIndexWriterThreadsToSegments$2.run(TestIndexWriterThreadsToSegments.java:209)
Caused by: java.lang.OutOfMemoryError: GC overhead limit exceeded
	at __randomizedtesting.SeedInfo.seed([D563D606E1A2C66F]:0)
	at org.apache.lucene.analysis.MockTokenizer.readChar(MockTokenizer.java:237)
	at org.apache.lucene.analysis.MockTokenizer.readCodePoint(MockTokenizer.java:203)
	at org.apache.lucene.analysis.MockTokenizer.incrementToken(MockTokenizer.java:164)
	at org.apache.lucene.analysis.MockTokenFilter.incrementToken(MockTokenFilter.java:80)
	at org.apache.lucene.analysis.MockVariableLengthPayloadFilter.incrementToken(MockVariableLengthPayloadFilter.java:44)
	at org.apache.lucene.index.DefaultIndexingChain$PerField.invert(DefaultIndexingChain.java:812)
	at org.apache.lucene.index.DefaultIndexingChain.processField(DefaultIndexingChain.java:442)
	at org.apache.lucene.index.DefaultIndexingChain.processDocument(DefaultIndexingChain.java:406)
	at org.apache.lucene.index.DocumentsWriterPerThread.updateDocument(DocumentsWriterPerThread.java:250)
	at org.apache.lucene.index.DocumentsWriter.updateDocument(DocumentsWriter.java:494)
	at org.apache.lucene.index.IndexWriter.updateDocument(IndexWriter.java:1594)
	... 2 more




Build Log:
[...truncated 2488 lines...]
   [junit4] Suite: org.apache.lucene.index.TestIndexWriterThreadsToSegments
   [junit4]   2> Ιουλ 01, 2019 3:41:55 ΜΜ com.carrotsearch.randomizedtesting.RandomizedRunner$QueueUncaughtExceptionsHandler uncaughtException
   [junit4]   2> WARNING: Uncaught exception in thread: Thread[Thread-4260,5,TGRP-TestIndexWriterThreadsToSegments]
   [junit4]   2> java.lang.OutOfMemoryError: GC overhead limit exceeded
   [junit4]   2> 	at __randomizedtesting.SeedInfo.seed([D563D606E1A2C66F]:0)
   [junit4]   2> 	at java.io.BufferedOutputStream.<init>(BufferedOutputStream.java:76)
   [junit4]   2> 	at org.apache.lucene.store.OutputStreamIndexOutput.<init>(OutputStreamIndexOutput.java:42)
   [junit4]   2> 	at org.apache.lucene.store.FSDirectory$FSIndexOutput.<init>(FSDirectory.java:411)
   [junit4]   2> 	at org.apache.lucene.store.FSDirectory$FSIndexOutput.<init>(FSDirectory.java:407)
   [junit4]   2> 	at org.apache.lucene.store.FSDirectory.createOutput(FSDirectory.java:255)
   [junit4]   2> 	at org.apache.lucene.store.MockDirectoryWrapper.createOutput(MockDirectoryWrapper.java:667)
   [junit4]   2> 	at org.apache.lucene.store.LockValidatingDirectoryWrapper.createOutput(LockValidatingDirectoryWrapper.java:44)
   [junit4]   2> 	at org.apache.lucene.store.TrackingDirectoryWrapper.createOutput(TrackingDirectoryWrapper.java:43)
   [junit4]   2> 	at org.apache.lucene.codecs.compressing.CompressingStoredFieldsWriter.<init>(CompressingStoredFieldsWriter.java:115)
   [junit4]   2> 	at org.apache.lucene.codecs.compressing.CompressingStoredFieldsFormat.fieldsWriter(CompressingStoredFieldsFormat.java:128)
   [junit4]   2> 	at org.apache.lucene.codecs.lucene50.Lucene50StoredFieldsFormat.fieldsWriter(Lucene50StoredFieldsFormat.java:183)
   [junit4]   2> 	at org.apache.lucene.codecs.asserting.AssertingStoredFieldsFormat.fieldsWriter(AssertingStoredFieldsFormat.java:48)
   [junit4]   2> 	at org.apache.lucene.index.StoredFieldsConsumer.initStoredFieldsWriter(StoredFieldsConsumer.java:39)
   [junit4]   2> 	at org.apache.lucene.index.StoredFieldsConsumer.startDocument(StoredFieldsConsumer.java:46)
   [junit4]   2> 	at org.apache.lucene.index.DefaultIndexingChain.startStoredFields(DefaultIndexingChain.java:367)
   [junit4]   2> 	at org.apache.lucene.index.DefaultIndexingChain.processDocument(DefaultIndexingChain.java:403)
   [junit4]   2> 	at org.apache.lucene.index.DocumentsWriterPerThread.updateDocument(DocumentsWriterPerThread.java:250)
   [junit4]   2> 	at org.apache.lucene.index.DocumentsWriter.updateDocument(DocumentsWriter.java:494)
   [junit4]   2> 	at org.apache.lucene.index.IndexWriter.updateDocument(IndexWriter.java:1594)
   [junit4]   2> 	at org.apache.lucene.index.IndexWriter.addDocument(IndexWriter.java:1213)
   [junit4]   2> 	at org.apache.lucene.index.TestIndexWriterThreadsToSegments$2.run(TestIndexWriterThreadsToSegments.java:209)
   [junit4]   2> 
   [junit4]   2> Ιουλ 01, 2019 3:41:55 ΜΜ com.carrotsearch.randomizedtesting.RandomizedRunner$QueueUncaughtExceptionsHandler uncaughtException
   [junit4]   2> WARNING: Uncaught exception in thread: Thread[Thread-4255,5,TGRP-TestIndexWriterThreadsToSegments]
   [junit4]   2> java.lang.RuntimeException: org.apache.lucene.store.AlreadyClosedException: this IndexWriter is closed
   [junit4]   2> 	at __randomizedtesting.SeedInfo.seed([D563D606E1A2C66F]:0)
   [junit4]   2> 	at org.apache.lucene.index.TestIndexWriterThreadsToSegments$2.run(TestIndexWriterThreadsToSegments.java:220)
   [junit4]   2> Caused by: org.apache.lucene.store.AlreadyClosedException: this IndexWriter is closed
   [junit4]   2> 	at org.apache.lucene.index.IndexWriter.ensureOpen(IndexWriter.java:681)
   [junit4]   2> 	at org.apache.lucene.index.IndexWriter.ensureOpen(IndexWriter.java:695)
   [junit4]   2> 	at org.apache.lucene.index.IndexWriter.updateDocument(IndexWriter.java:1591)
   [junit4]   2> 	at org.apache.lucene.index.IndexWriter.addDocument(IndexWriter.java:1213)
   [junit4]   2> 	at org.apache.lucene.index.TestIndexWriterThreadsToSegments$2.run(TestIndexWriterThreadsToSegments.java:209)
   [junit4]   2> Caused by: java.lang.OutOfMemoryError: GC overhead limit exceeded
   [junit4]   2> 	at __randomizedtesting.SeedInfo.seed([D563D606E1A2C66F]:0)
   [junit4]   2> 	at org.apache.lucene.analysis.MockTokenizer.readChar(MockTokenizer.java:237)
   [junit4]   2> 	at org.apache.lucene.analysis.MockTokenizer.readCodePoint(MockTokenizer.java:203)
   [junit4]   2> 	at org.apache.lucene.analysis.MockTokenizer.incrementToken(MockTokenizer.java:164)
   [junit4]   2> 	at org.apache.lucene.analysis.MockTokenFilter.incrementToken(MockTokenFilter.java:80)
   [junit4]   2> 	at org.apache.lucene.analysis.MockVariableLengthPayloadFilter.incrementToken(MockVariableLengthPayloadFilter.java:44)
   [junit4]   2> 	at org.apache.lucene.index.DefaultIndexingChain$PerField.invert(DefaultIndexingChain.java:812)
   [junit4]   2> 	at org.apache.lucene.index.DefaultIndexingChain.processField(DefaultIndexingChain.java:442)
   [junit4]   2> 	at org.apache.lucene.index.DefaultIndexingChain.processDocument(DefaultIndexingChain.java:406)
   [junit4]   2> 	at org.apache.lucene.index.DocumentsWriterPerThread.updateDocument(DocumentsWriterPerThread.java:250)
   [junit4]   2> 	at org.apache.lucene.index.DocumentsWriter.updateDocument(DocumentsWriter.java:494)
   [junit4]   2> 	at org.apache.lucene.index.IndexWriter.updateDocument(IndexWriter.java:1594)
   [junit4]   2> 	... 2 more
   [junit4]   2> 
   [junit4]   2> Ιουλ 01, 2019 3:41:55 ΜΜ com.carrotsearch.randomizedtesting.RandomizedRunner$QueueUncaughtExceptionsHandler uncaughtException
   [junit4]   2> WARNING: Uncaught exception in thread: Thread[Thread-4258,5,TGRP-TestIndexWriterThreadsToSegments]
   [junit4]   2> java.lang.RuntimeException: org.apache.lucene.store.AlreadyClosedException: this IndexWriter is closed
   [junit4]   2> 	at __randomizedtesting.SeedInfo.seed([D563D606E1A2C66F]:0)
   [junit4]   2> 	at org.apache.lucene.index.TestIndexWriterThreadsToSegments$2.run(TestIndexWriterThreadsToSegments.java:220)
   [junit4]   2> Caused by: org.apache.lucene.store.AlreadyClosedException: this IndexWriter is closed
   [junit4]   2> 	at org.apache.lucene.index.IndexWriter.ensureOpen(IndexWriter.java:681)
   [junit4]   2> 	at org.apache.lucene.index.IndexWriter.ensureOpen(IndexWriter.java:695)
   [junit4]   2> 	at org.apache.lucene.index.IndexWriter.updateDocument(IndexWriter.java:1591)
   [junit4]   2> 	at org.apache.lucene.index.IndexWriter.addDocument(IndexWriter.java:1213)
   [junit4]   2> 	at org.apache.lucene.index.TestIndexWriterThreadsToSegments$2.run(TestIndexWriterThreadsToSegments.java:209)
   [junit4]   2> Caused by: java.lang.OutOfMemoryError: GC overhead limit exceeded
   [junit4]   2> 	at __randomizedtesting.SeedInfo.seed([D563D606E1A2C66F]:0)
   [junit4]   2> 	at org.apache.lucene.analysis.MockTokenizer.readChar(MockTokenizer.java:237)
   [junit4]   2> 	at org.apache.lucene.analysis.MockTokenizer.readCodePoint(MockTokenizer.java:203)
   [junit4]   2> 	at org.apache.lucene.analysis.MockTokenizer.incrementToken(MockTokenizer.java:164)
   [junit4]   2> 	at org.apache.lucene.analysis.MockTokenFilter.incrementToken(MockTokenFilter.java:80)
   [junit4]   2> 	at org.apache.lucene.analysis.MockVariableLengthPayloadFilter.incrementToken(MockVariableLengthPayloadFilter.java:44)
   [junit4]   2> 	at org.apache.lucene.index.DefaultIndexingChain$PerField.invert(DefaultIndexingChain.java:812)
   [junit4]   2> 	at org.apache.lucene.index.DefaultIndexingChain.processField(DefaultIndexingChain.java:442)
   [junit4]   2> 	at org.apache.lucene.index.DefaultIndexingChain.processDocument(DefaultIndexingChain.java:406)
   [junit4]   2> 	at org.apache.lucene.index.DocumentsWriterPerThread.updateDocument(DocumentsWriterPerThread.java:250)
   [junit4]   2> 	at org.apache.lucene.index.DocumentsWriter.updateDocument(DocumentsWriter.java:494)
   [junit4]   2> 	at org.apache.lucene.index.IndexWriter.updateDocument(IndexWriter.java:1594)
   [junit4]   2> 	... 2 more
   [junit4]   2> 
   [junit4]   2> Ιουλ 01, 2019 3:41:55 ΜΜ com.carrotsearch.randomizedtesting.RandomizedRunner$QueueUncaughtExceptionsHandler uncaughtException
   [junit4]   2> WARNING: Uncaught exception in thread: Thread[Thread-4256,5,TGRP-TestIndexWriterThreadsToSegments]
   [junit4]   2> java.lang.OutOfMemoryError: GC overhead limit exceeded
   [junit4]   2> 	at __randomizedtesting.SeedInfo.seed([D563D606E1A2C66F]:0)
   [junit4]   2> 	at sun.nio.fs.UnixPath.encode(UnixPath.java:132)
   [junit4]   2> 	at sun.nio.fs.UnixPath.<init>(UnixPath.java:71)
   [junit4]   2> 	at sun.nio.fs.UnixFileSystem.getPath(UnixFileSystem.java:281)
   [junit4]   2> 	at sun.nio.fs.AbstractPath.resolve(AbstractPath.java:53)
   [junit4]   2> 	at org.apache.lucene.mockfile.FilterPath.resolve(FilterPath.java:155)
   [junit4]   2> 	at org.apache.lucene.mockfile.FilterPath.resolve(FilterPath.java:155)
   [junit4]   2> 	at org.apache.lucene.mockfile.FilterPath.resolve(FilterPath.java:155)
   [junit4]   2> 	at org.apache.lucene.mockfile.FilterPath.resolve(FilterPath.java:155)
   [junit4]   2> 	at org.apache.lucene.mockfile.FilterPath.resolve(FilterPath.java:155)
   [junit4]   2> 	at org.apache.lucene.store.FSDirectory$FSIndexOutput.<init>(FSDirectory.java:411)
   [junit4]   2> 	at org.apache.lucene.store.FSDirectory$FSIndexOutput.<init>(FSDirectory.java:407)
   [junit4]   2> 	at org.apache.lucene.store.FSDirectory.createOutput(FSDirectory.java:255)
   [junit4]   2> 	at org.apache.lucene.store.MockDirectoryWrapper.createOutput(MockDirectoryWrapper.java:667)
   [junit4]   2> 	at org.apache.lucene.store.LockValidatingDirectoryWrapper.createOutput(LockValidatingDirectoryWrapper.java:44)
   [junit4]   2> 	at org.apache.lucene.store.TrackingDirectoryWrapper.createOutput(TrackingDirectoryWrapper.java:43)
   [junit4]   2> 	at org.apache.lucene.codecs.compressing.CompressingStoredFieldsWriter.<init>(CompressingStoredFieldsWriter.java:115)
   [junit4]   2> 	at org.apache.lucene.codecs.compressing.CompressingStoredFieldsFormat.fieldsWriter(CompressingStoredFieldsFormat.java:128)
   [junit4]   2> 	at org.apache.lucene.codecs.lucene50.Lucene50StoredFieldsFormat.fieldsWriter(Lucene50StoredFieldsFormat.java:183)
   [junit4]   2> 	at org.apache.lucene.codecs.asserting.AssertingStoredFieldsFormat.fieldsWriter(AssertingStoredFieldsFormat.java:48)
   [junit4]   2> 	at org.apache.lucene.index.StoredFieldsConsumer.initStoredFieldsWriter(StoredFieldsConsumer.java:39)
   [junit4]   2> 	at org.apache.lucene.index.StoredFieldsConsumer.startDocument(StoredFieldsConsumer.java:46)
   [junit4]   2> 	at org.apache.lucene.index.DefaultIndexingChain.startStoredFields(DefaultIndexingChain.java:367)
   [junit4]   2> 	at org.apache.lucene.index.DefaultIndexingChain.processDocument(DefaultIndexingChain.java:403)
   [junit4]   2> 	at org.apache.lucene.index.DocumentsWriterPerThread.updateDocument(DocumentsWriterPerThread.java:250)
   [junit4]   2> 	at org.apache.lucene.index.DocumentsWriter.updateDocument(DocumentsWriter.java:494)
   [junit4]   2> 	at org.apache.lucene.index.IndexWriter.updateDocument(IndexWriter.java:1594)
   [junit4]   2> 	at org.apache.lucene.index.IndexWriter.addDocument(IndexWriter.java:1213)
   [junit4]   2> 	at org.apache.lucene.index.TestIndexWriterThreadsToSegments$2.run(TestIndexWriterThreadsToSegments.java:209)
   [junit4]   2> 
   [junit4]   2> Ιουλ 01, 2019 3:41:55 ΜΜ com.carrotsearch.randomizedtesting.RandomizedRunner$QueueUncaughtExceptionsHandler uncaughtException
   [junit4]   2> WARNING: Uncaught exception in thread: Thread[Thread-4262,5,TGRP-TestIndexWriterThreadsToSegments]
   [junit4]   2> java.lang.RuntimeException: org.apache.lucene.store.AlreadyClosedException: this IndexWriter is closed
   [junit4]   2> 	at __randomizedtesting.SeedInfo.seed([D563D606E1A2C66F]:0)
   [junit4]   2> 	at org.apache.lucene.index.TestIndexWriterThreadsToSegments$2.run(TestIndexWriterThreadsToSegments.java:220)
   [junit4]   2> Caused by: org.apache.lucene.store.AlreadyClosedException: this IndexWriter is closed
   [junit4]   2> 	at org.apache.lucene.index.IndexWriter.ensureOpen(IndexWriter.java:681)
   [junit4]   2> 	at org.apache.lucene.index.IndexWriter.ensureOpen(IndexWriter.java:695)
   [junit4]   2> 	at org.apache.lucene.index.IndexWriter.updateDocument(IndexWriter.java:1591)
   [junit4]   2> 	at org.apache.lucene.index.IndexWriter.addDocument(IndexWriter.java:1213)
   [junit4]   2> 	at org.apache.lucene.index.TestIndexWriterThreadsToSegments$2.run(TestIndexWriterThreadsToSegments.java:209)
   [junit4]   2> Caused by: java.lang.OutOfMemoryError: GC overhead limit exceeded
   [junit4]   2> 	at __randomizedtesting.SeedInfo.seed([D563D606E1A2C66F]:0)
   [junit4]   2> 	at org.apache.lucene.analysis.MockTokenizer.readChar(MockTokenizer.java:237)
   [junit4]   2> 	at org.apache.lucene.analysis.MockTokenizer.readCodePoint(MockTokenizer.java:203)
   [junit4]   2> 	at org.apache.lucene.analysis.MockTokenizer.incrementToken(MockTokenizer.java:164)
   [junit4]   2> 	at org.apache.lucene.analysis.MockTokenFilter.incrementToken(MockTokenFilter.java:80)
   [junit4]   2> 	at org.apache.lucene.analysis.MockVariableLengthPayloadFilter.incrementToken(MockVariableLengthPayloadFilter.java:44)
   [junit4]   2> 	at org.apache.lucene.index.DefaultIndexingChain$PerField.invert(DefaultIndexingChain.java:812)
   [junit4]   2> 	at org.apache.lucene.index.DefaultIndexingChain.processField(DefaultIndexingChain.java:442)
   [junit4]   2> 	at org.apache.lucene.index.DefaultIndexingChain.processDocument(DefaultIndexingChain.java:406)
   [junit4]   2> 	at org.apache.lucene.index.DocumentsWriterPerThread.updateDocument(DocumentsWriterPerThread.java:250)
   [junit4]   2> 	at org.apache.lucene.index.DocumentsWriter.updateDocument(DocumentsWriter.java:494)
   [junit4]   2> 	at org.apache.lucene.index.IndexWriter.updateDocument(IndexWriter.java:1594)
   [junit4]   2> 	... 2 more
   [junit4]   2> 
   [junit4]   2> Ιουλ 01, 2019 3:41:55 ΜΜ com.carrotsearch.randomizedtesting.RandomizedRunner$QueueUncaughtExceptionsHandler uncaughtException
   [junit4]   2> WARNING: Uncaught exception in thread: Thread[Thread-4259,5,TGRP-TestIndexWriterThreadsToSegments]
   [junit4]   2> java.lang.OutOfMemoryError: GC overhead limit exceeded
   [junit4]   2> 	at __randomizedtesting.SeedInfo.seed([D563D606E1A2C66F]:0)
   [junit4]   2> 	at org.apache.lucene.analysis.MockTokenizer.readChar(MockTokenizer.java:237)
   [junit4]   2> 	at org.apache.lucene.analysis.MockTokenizer.readCodePoint(MockTokenizer.java:203)
   [junit4]   2> 	at org.apache.lucene.analysis.MockTokenizer.incrementToken(MockTokenizer.java:164)
   [junit4]   2> 	at org.apache.lucene.analysis.MockTokenFilter.incrementToken(MockTokenFilter.java:80)
   [junit4]   2> 	at org.apache.lucene.analysis.MockVariableLengthPayloadFilter.incrementToken(MockVariableLengthPayloadFilter.java:44)
   [junit4]   2> 	at org.apache.lucene.index.DefaultIndexingChain$PerField.invert(DefaultIndexingChain.java:812)
   [junit4]   2> 	at org.apache.lucene.index.DefaultIndexingChain.processField(DefaultIndexingChain.java:442)
   [junit4]   2> 	at org.apache.lucene.index.DefaultIndexingChain.processDocument(DefaultIndexingChain.java:406)
   [junit4]   2> 	at org.apache.lucene.index.DocumentsWriterPerThread.updateDocument(DocumentsWriterPerThread.java:250)
   [junit4]   2> 	at org.apache.lucene.index.DocumentsWriter.updateDocument(DocumentsWriter.java:494)
   [junit4]   2> 	at org.apache.lucene.index.IndexWriter.updateDocument(IndexWriter.java:1594)
   [junit4]   2> 	at org.apache.lucene.index.IndexWriter.addDocument(IndexWriter.java:1213)
   [junit4]   2> 	at org.apache.lucene.index.TestIndexWriterThreadsToSegments$2.run(TestIndexWriterThreadsToSegments.java:209)
   [junit4]   2> 
   [junit4]   2> Ιουλ 01, 2019 5:32:10 ΜΜ com.carrotsearch.randomizedtesting.ThreadLeakControl$2 evaluate
   [junit4]   2> WARNING: Suite execution timed out: org.apache.lucene.index.TestIndexWriterThreadsToSegments
   [junit4]   2>    1) Thread[id=4749, name=Thread-4263, state=WAITING, group=TGRP-TestIndexWriterThreadsToSegments]
   [junit4]   2>         at sun.misc.Unsafe.park(Native Method)
   [junit4]   2>         at java.util.concurrent.locks.LockSupport.park(LockSupport.java:175)
   [junit4]   2>         at java.util.concurrent.locks.AbstractQueuedSynchronizer$ConditionObject.await(AbstractQueuedSynchronizer.java:2039)
   [junit4]   2>         at java.util.concurrent.CyclicBarrier.dowait(CyclicBarrier.java:234)
   [junit4]   2>         at java.util.concurrent.CyclicBarrier.await(CyclicBarrier.java:362)
   [junit4]   2>         at org.apache.lucene.index.TestIndexWriterThreadsToSegments$2.run(TestIndexWriterThreadsToSegments.java:217)
   [junit4]   2>    2) Thread[id=4729, name=SUITE-TestIndexWriterThreadsToSegments-seed#[D563D606E1A2C66F], state=RUNNABLE, group=TGRP-TestIndexWriterThreadsToSegments]
   [junit4]   2>         at java.lang.Thread.getStackTrace(Thread.java:1559)
   [junit4]   2>         at com.carrotsearch.randomizedtesting.ThreadLeakControl$4.run(ThreadLeakControl.java:696)
   [junit4]   2>         at com.carrotsearch.randomizedtesting.ThreadLeakControl$4.run(ThreadLeakControl.java:693)
   [junit4]   2>         at java.security.AccessController.doPrivileged(Native Method)
   [junit4]   2>         at com.carrotsearch.randomizedtesting.ThreadLeakControl.getStackTrace(ThreadLeakControl.java:693)
   [junit4]   2>         at com.carrotsearch.randomizedtesting.ThreadLeakControl.getThreadsWithTraces(ThreadLeakControl.java:709)
   [junit4]   2>         at com.carrotsearch.randomizedtesting.ThreadLeakControl.formatThreadStacksFull(ThreadLeakControl.java:689)
   [junit4]   2>         at com.carrotsearch.randomizedtesting.ThreadLeakControl.access$1000(ThreadLeakControl.java:65)
   [junit4]   2>         at com.carrotsearch.randomizedtesting.ThreadLeakControl$2.evaluate(ThreadLeakControl.java:415)
   [junit4]   2>         at com.carrotsearch.randomizedtesting.RandomizedRunner.runSuite(RandomizedRunner.java:708)
   [junit4]   2>         at com.carrotsearch.randomizedtesting.RandomizedRunner.access$200(RandomizedRunner.java:138)
   [junit4]   2>         at com.carrotsearch.randomizedtesting.RandomizedRunner$2.run(RandomizedRunner.java:629)
   [junit4]   2>    3) Thread[id=1, name=main, state=WAITING, group=main]
   [junit4]   2>         at java.lang.Object.wait(Native Method)
   [junit4]   2>         at java.lang.Thread.join(Thread.java:1252)
   [junit4]   2>         at java.lang.Thread.join(Thread.java:1326)
   [junit4]   2>         at com.carrotsearch.randomizedtesting.RandomizedRunner.runSuite(RandomizedRunner.java:639)
   [junit4]   2>         at com.carrotsearch.randomizedtesting.RandomizedRunner.run(RandomizedRunner.java:496)
   [junit4]   2>         at com.carrotsearch.ant.tasks.junit4.slave.SlaveMain.execute(SlaveMain.java:269)
   [junit4]   2>         at com.carrotsearch.ant.tasks.junit4.slave.SlaveMain.main(SlaveMain.java:394)
   [junit4]   2>         at com.carrotsearch.ant.tasks.junit4.slave.SlaveMainSafe.main(SlaveMainSafe.java:13)
   [junit4]   2>    4) Thread[id=4747, name=Thread-4261, state=WAITING, group=TGRP-TestIndexWriterThreadsToSegments]
   [junit4]   2>         at sun.misc.Unsafe.park(Native Method)
   [junit4]   2>         at java.util.concurrent.locks.LockSupport.park(LockSupport.java:175)
   [junit4]   2>         at java.util.concurrent.locks.AbstractQueuedSynchronizer$ConditionObject.await(AbstractQueuedSynchronizer.java:2039)
   [junit4]   2>         at java.util.concurrent.CyclicBarrier.dowait(CyclicBarrier.java:234)
   [junit4]   2>         at java.util.concurrent.CyclicBarrier.await(CyclicBarrier.java:362)
   [junit4]   2>         at org.apache.lucene.index.TestIndexWriterThreadsToSegments$2.run(TestIndexWriterThreadsToSegments.java:217)
   [junit4]   2>    5) Thread[id=9, name=JUnit4-serializer-daemon, state=TIMED_WAITING, group=main]
   [junit4]   2>         at java.lang.Thread.sleep(Native Method)
   [junit4]   2>         at com.carrotsearch.ant.tasks.junit4.events.Serializer$1.run(Serializer.java:50)
   [junit4]   2>    6) Thread[id=4740, name=Thread-4254, state=WAITING, group=TGRP-TestIndexWriterThreadsToSegments]
   [junit4]   2>         at sun.misc.Unsafe.park(Native Method)
   [junit4]   2>         at java.util.concurrent.locks.LockSupport.park(LockSupport.java:175)
   [junit4]   2>         at java.util.concurrent.locks.AbstractQueuedSynchronizer$ConditionObject.await(AbstractQueuedSynchronizer.java:2039)
   [junit4]   2>         at java.util.concurrent.CyclicBarrier.dowait(CyclicBarrier.java:234)
   [junit4]   2>         at java.util.concurrent.CyclicBarrier.await(CyclicBarrier.java:362)
   [junit4]   2>         at org.apache.lucene.index.TestIndexWriterThreadsToSegments$2.run(TestIndexWriterThreadsToSegments.java:217)
   [junit4]   2>    7) Thread[id=4730, name=TEST-TestIndexWriterThreadsToSegments.testSegmentCountOnFlushRandom-seed#[D563D606E1A2C66F], state=WAITING, group=TGRP-TestIndexWriterThreadsToSegments]
   [junit4]   2>         at java.lang.Object.wait(Native Method)
   [junit4]   2>         at java.lang.Thread.join(Thread.java:1252)
   [junit4]   2>         at java.lang.Thread.join(Thread.java:1326)
   [junit4]   2>         at org.apache.lucene.index.TestIndexWriterThreadsToSegments.testSegmentCountOnFlushRandom(TestIndexWriterThreadsToSegments.java:228)
   [junit4]   2>         at sun.reflect.NativeMethodAccessorImpl.invoke0(Native Method)
   [junit4]   2>         at sun.reflect.NativeMethodAccessorImpl.invoke(NativeMethodAccessorImpl.java:62)
   [junit4]   2>         at sun.reflect.DelegatingMethodAccessorImpl.invoke(DelegatingMethodAccessorImpl.java:43)
   [junit4]   2>         at java.lang.reflect.Method.invoke(Method.java:498)
   [junit4]   2>         at com.carrotsearch.randomizedtesting.RandomizedRunner.invoke(RandomizedRunner.java:1750)
   [junit4]   2>         at com.carrotsearch.randomizedtesting.RandomizedRunner$8.evaluate(RandomizedRunner.java:938)
   [junit4]   2>         at com.carrotsearch.randomizedtesting.RandomizedRunner$9.evaluate(RandomizedRunner.java:974)
   [junit4]   2>         at com.carrotsearch.randomizedtesting.RandomizedRunner$10.evaluate(RandomizedRunner.java:988)
   [junit4]   2>         at org.apache.lucene.util.TestRuleSetupTeardownChained$1.evaluate(TestRuleSetupTeardownChained.java:49)
   [junit4]   2>         at org.apache.lucene.util.AbstractBeforeAfterRule$1.evaluate(AbstractBeforeAfterRule.java:45)
   [junit4]   2>         at org.apache.lucene.util.TestRuleThreadAndTestName$1.evaluate(TestRuleThreadAndTestName.java:48)
   [junit4]   2>         at org.apache.lucene.util.TestRuleIgnoreAfterMaxFailures$1.evaluate(TestRuleIgnoreAfterMaxFailures.java:64)
   [junit4]   2>         at org.apache.lucene.util.TestRuleMarkFailure$1.evaluate(TestRuleMarkFailure.java:47)
   [junit4]   2>         at com.carrotsearch.randomizedtesting.rules.StatementAdapter.evaluate(StatementAdapter.java:36)
   [junit4]   2>         at com.carrotsearch.randomizedtesting.ThreadLeakControl$StatementRunner.run(ThreadLeakControl.java:368)
   [junit4]   2>         at com.carrotsearch.randomizedtesting.ThreadLeakControl.forkTimeoutingTask(ThreadLeakControl.java:817)
   [junit4]   2>         at com.carrotsearch.randomizedtesting.ThreadLeakControl$3.evaluate(ThreadLeakControl.java:468)
   [junit4]   2>         at com.carrotsearch.randomizedtesting.RandomizedRunner.runSingleTest(RandomizedRunner.java:947)
   [junit4]   2>         at com.carrotsearch.randomizedtesting.RandomizedRunner$5.evaluate(RandomizedRunner.java:832)
   [junit4]   2>         at com.carrotsearch.randomizedtesting.RandomizedRunner$6.evaluate(RandomizedRunner.java:883)
   [junit4]   2>         at com.carrotsearch.randomizedtesting.RandomizedRunner$7.evaluate(RandomizedRunner.java:894)
   [junit4]   2>         at org.apache.lucene.util.AbstractBeforeAfterRule$1.evaluate(AbstractBeforeAfterRule.java:45)
   [junit4]   2>         at com.carrotsearch.randomizedtesting.rules.StatementAdapter.evaluate(StatementAdapter.java:36)
   [junit4]   2>         at org.apache.lucene.util.TestRuleStoreClassName$1.evaluate(TestRuleStoreClassName.java:41)
   [junit4]   2>         at com.carrotsearch.randomizedtesting.rules.NoShadowingOrOverridesOnMethodsRule$1.evaluate(NoShadowingOrOverridesOnMethodsRule.java:40)
   [junit4]   2>         at com.carrotsearch.randomizedtesting.rules.NoShadowingOrOverridesOnMethodsRule$1.evaluate(NoShadowingOrOverridesOnMethodsRule.java:40)
   [junit4]   2>         at com.carrotsearch.randomizedtesting.rules.StatementAdapter.evaluate(StatementAdapter.java:36)
   [junit4]   2>         at com.carrotsearch.randomizedtesting.rules.StatementAdapter.evaluate(StatementAdapter.java:36)
   [junit4]   2>         at com.carrotsearch.randomizedtesting.rules.StatementAdapter.evaluate(StatementAdapter.java:36)
   [junit4]   2>         at org.apache.lucene.util.TestRuleAssertionsRequired$1.evaluate(TestRuleAssertionsRequired.java:53)
   [junit4]   2>         at org.apache.lucene.util.TestRuleMarkFailure$1.evaluate(TestRuleMarkFailure.java:47)
   [junit4]   2>         at org.apache.lucene.util.TestRuleIgnoreAfterMaxFailures$1.evaluate(TestRuleIgnoreAfterMaxFailures.java:64)
   [junit4]   2>         at org.apache.lucene.util.TestRuleIgnoreTestSuites$1.evaluate(TestRuleIgnoreTestSuites.java:54)
   [junit4]   2>         at com.carrotsearch.randomizedtesting.rules.StatementAdapter.evaluate(StatementAdapter.java:36)
   [junit4]   2>         at com.carrotsearch.randomizedtesting.ThreadLeakControl$StatementRunner.run(ThreadLeakControl.java:368)
   [junit4]   2>         at java.lang.Thread.run(Thread.java:748)
   [junit4]   2>    8) Thread[id=4743, name=Thread-4257, state=WAITING, group=TGRP-TestIndexWriterThreadsToSegments]
   [junit4]   2>         at sun.misc.Unsafe.park(Native Method)
   [junit4]   2>         at java.util.concurrent.locks.LockSupport.park(LockSupport.java:175)
   [junit4]   2>         at java.util.concurrent.locks.AbstractQueuedSynchronizer$ConditionObject.await(AbstractQueuedSynchronizer.java:2039)
   [junit4]   2>         at java.util.concurrent.CyclicBarrier.dowait(CyclicBarrier.java:234)
   [junit4]   2>         at java.util.concurrent.CyclicBarrier.await(CyclicBarrier.java:362)
   [junit4]   2>         at org.apache.lucene.index.TestIndexWriterThreadsToSegments$2.run(TestIndexWriterThreadsToSegments.java:217)
   [junit4]   2> NOTE: download the large Jenkins line-docs file by running 'ant get-jenkins-line-docs' in the lucene directory.
   [junit4]   2> NOTE: reproduce with: ant test  -Dtestcase=TestIndexWriterThreadsToSegments -Dtests.method=testSegmentCountOnFlushRandom -Dtests.seed=D563D606E1A2C66F -Dtests.multiplier=2 -Dtests.nightly=true -Dtests.slow=true -Dtests.linedocsfile=/home/jenkins/jenkins-slave/workspace/Lucene-Solr-NightlyTests-8.1/test-data/enwiki.random.lines.txt -Dtests.locale=el-CY -Dtests.timezone=America/North_Dakota/Beulah -Dtests.asserts=true -Dtests.file.encoding=UTF-8
   [junit4] ERROR   7198s J2 | TestIndexWriterThreadsToSegments.testSegmentCountOnFlushRandom <<<
   [junit4]    > Throwable #1: java.lang.Exception: Test abandoned because suite timeout was reached.
   [junit4]    > 	at __randomizedtesting.SeedInfo.seed([D563D606E1A2C66F]:0)
   [junit4]   2> Ιουλ 01, 2019 5:32:10 ΜΜ com.carrotsearch.randomizedtesting.ThreadLeakControl checkThreadLeaks
   [junit4]   2> WARNING: Will linger awaiting termination of 5 leaked thread(s).
   [junit4]   2> Ιουλ 01, 2019 5:32:30 ΜΜ com.carrotsearch.randomizedtesting.ThreadLeakControl checkThreadLeaks
   [junit4]   2> SEVERE: 5 threads leaked from SUITE scope at org.apache.lucene.index.TestIndexWriterThreadsToSegments: 
   [junit4]   2>    1) Thread[id=4749, name=Thread-4263, state=WAITING, group=TGRP-TestIndexWriterThreadsToSegments]
   [junit4]   2>         at sun.misc.Unsafe.park(Native Method)
   [junit4]   2>         at java.util.concurrent.locks.LockSupport.park(LockSupport.java:175)
   [junit4]   2>         at java.util.concurrent.locks.AbstractQueuedSynchronizer$ConditionObject.await(AbstractQueuedSynchronizer.java:2039)
   [junit4]   2>         at java.util.concurrent.CyclicBarrier.dowait(CyclicBarrier.java:234)
   [junit4]   2>         at java.util.concurrent.CyclicBarrier.await(CyclicBarrier.java:362)
   [junit4]   2>         at org.apache.lucene.index.TestIndexWriterThreadsToSegments$2.run(TestIndexWriterThreadsToSegments.java:217)
   [junit4]   2>    2) Thread[id=4747, name=Thread-4261, state=WAITING, group=TGRP-TestIndexWriterThreadsToSegments]
   [junit4]   2>         at sun.misc.Unsafe.park(Native Method)
   [junit4]   2>         at java.util.concurrent.locks.LockSupport.park(LockSupport.java:175)
   [junit4]   2>         at java.util.concurrent.locks.AbstractQueuedSynchronizer$ConditionObject.await(AbstractQueuedSynchronizer.java:2039)
   [junit4]   2>         at java.util.concurrent.CyclicBarrier.dowait(CyclicBarrier.java:234)
   [junit4]   2>         at java.util.concurrent.CyclicBarrier.await(CyclicBarrier.java:362)
   [junit4]   2>         at org.apache.lucene.index.TestIndexWriterThreadsToSegments$2.run(TestIndexWriterThreadsToSegments.java:217)
   [junit4]   2>    3) Thread[id=4740, name=Thread-4254, state=WAITING, group=TGRP-TestIndexWriterThreadsToSegments]
   [junit4]   2>         at sun.misc.Unsafe.park(Native Method)
   [junit4]   2>         at java.util.concurrent.locks.LockSupport.park(LockSupport.java:175)
   [junit4]   2>         at java.util.concurrent.locks.AbstractQueuedSynchronizer$ConditionObject.await(AbstractQueuedSynchronizer.java:2039)
   [junit4]   2>         at java.util.concurrent.CyclicBarrier.dowait(CyclicBarrier.java:234)
   [junit4]   2>         at java.util.concurrent.CyclicBarrier.await(CyclicBarrier.java:362)
   [junit4]   2>         at org.apache.lucene.index.TestIndexWriterThreadsToSegments$2.run(TestIndexWriterThreadsToSegments.java:217)
   [junit4]   2>    4) Thread[id=4730, name=TEST-TestIndexWriterThreadsToSegments.testSegmentCountOnFlushRandom-seed#[D563D606E1A2C66F], state=WAITING, group=TGRP-TestIndexWriterThreadsToSegments]
   [junit4]   2>         at java.lang.Object.wait(Native Method)
   [junit4]   2>         at java.lang.Thread.join(Thread.java:1252)
   [junit4]   2>         at java.lang.Thread.join(Thread.java:1326)
   [junit4]   2>         at org.apache.lucene.index.TestIndexWriterThreadsToSegments.testSegmentCountOnFlushRandom(TestIndexWriterThreadsToSegments.java:228)
   [junit4]   2>         at sun.reflect.NativeMethodAccessorImpl.invoke0(Native Method)
   [junit4]   2>         at sun.reflect.NativeMethodAccessorImpl.invoke(NativeMethodAccessorImpl.java:62)
   [junit4]   2>         at sun.reflect.DelegatingMethodAccessorImpl.invoke(DelegatingMethodAccessorImpl.java:43)
   [junit4]   2>         at java.lang.reflect.Method.invoke(Method.java:498)
   [junit4]   2>         at com.carrotsearch.randomizedtesting.RandomizedRunner.invoke(RandomizedRunner.java:1750)
   [junit4]   2>         at com.carrotsearch.randomizedtesting.RandomizedRunner$8.evaluate(RandomizedRunner.java:938)
   [junit4]   2>         at com.carrotsearch.randomizedtesting.RandomizedRunner$9.evaluate(RandomizedRunner.java:974)
   [junit4]   2>         at com.carrotsearch.randomizedtesting.RandomizedRunner$10.evaluate(RandomizedRunner.java:988)
   [junit4]   2>         at org.apache.lucene.util.TestRuleSetupTeardownChained$1.evaluate(TestRuleSetupTeardownChained.java:49)
   [junit4]   2>         at org.apache.lucene.util.AbstractBeforeAfterRule$1.evaluate(AbstractBeforeAfterRule.java:45)
   [junit4]   2>         at org.apache.lucene.util.TestRuleThreadAndTestName$1.evaluate(TestRuleThreadAndTestName.java:48)
   [junit4]   2>         at org.apache.lucene.util.TestRuleIgnoreAfterMaxFailures$1.evaluate(TestRuleIgnoreAfterMaxFailures.java:64)
   [junit4]   2>         at org.apache.lucene.util.TestRuleMarkFailure$1.evaluate(TestRuleMarkFailure.java:47)
   [junit4]   2>         at com.carrotsearch.randomizedtesting.rules.StatementAdapter.evaluate(StatementAdapter.java:36)
   [junit4]   2>         at com.carrotsearch.randomizedtesting.ThreadLeakControl$StatementRunner.run(ThreadLeakControl.java:368)
   [junit4]   2>         at com.carrotsearch.randomizedtesting.ThreadLeakControl.forkTimeoutingTask(ThreadLeakControl.java:817)
   [junit4]   2>         at com.carrotsearch.randomizedtesting.ThreadLeakControl$3.evaluate(ThreadLeakControl.java:468)
   [junit4]   2>         at com.carrotsearch.randomizedtesting.RandomizedRunner.runSingleTest(RandomizedRunner.java:947)
   [junit4]   2>         at com.carrotsearch.randomizedtesting.RandomizedRunner$5.evaluate(RandomizedRunner.java:832)
   [junit4]   2>         at com.carrotsearch.randomizedtesting.RandomizedRunner$6.evaluate(RandomizedRunner.java:883)
   [junit4]   2>         at com.carrotsearch.randomizedtesting.RandomizedRunner$7.evaluate(RandomizedRunner.java:894)
   [junit4]   2>         at org.apache.lucene.util.AbstractBeforeAfterRule$1.evaluate(AbstractBeforeAfterRule.java:45)
   [junit4]   2>         at com.carrotsearch.randomizedtesting.rules.StatementAdapter.evaluate(StatementAdapter.java:36)
   [junit4]   2>         at org.apache.lucene.util.TestRuleStoreClassName$1.evaluate(TestRuleStoreClassName.java:41)
   [junit4]   2>         at com.carrotsearch.randomizedtesting.rules.NoShadowingOrOverridesOnMethodsRule$1.evaluate(NoShadowingOrOverridesOnMethodsRule.java:40)
   [junit4]   2>         at com.carrotsearch.randomizedtesting.rules.NoShadowingOrOverridesOnMethodsRule$1.evaluate(NoShadowingOrOverridesOnMethodsRule.java:40)
   [junit4]   2>         at com.carrotsearch.randomizedtesting.rules.StatementAdapter.evaluate(StatementAdapter.java:36)
   [junit4]   2>         at com.carrotsearch.randomizedtesting.rules.StatementAdapter.evaluate(StatementAdapter.java:36)
   [junit4]   2>         at com.carrotsearch.randomizedtesting.rules.StatementAdapter.evaluate(StatementAdapter.java:36)
   [junit4]   2>         at org.apache.lucene.util.TestRuleAssertionsRequired$1.evaluate(TestRuleAssertionsRequired.java:53)
   [junit4]   2>         at org.apache.lucene.util.TestRuleMarkFailure$1.evaluate(TestRuleMarkFailure.java:47)
   [junit4]   2>         at org.apache.lucene.util.TestRuleIgnoreAfterMaxFailures$1.evaluate(TestRuleIgnoreAfterMaxFailures.java:64)
   [junit4]   2>         at org.apache.lucene.util.TestRuleIgnoreTestSuites$1.evaluate(TestRuleIgnoreTestSuites.java:54)
   [junit4]   2>         at com.carrotsearch.randomizedtesting.rules.StatementAdapter.evaluate(StatementAdapter.java:36)
   [junit4]   2>         at com.carrotsearch.randomizedtesting.ThreadLeakControl$StatementRunner.run(ThreadLeakControl.java:368)
   [junit4]   2>         at java.lang.Thread.run(Thread.java:748)
   [junit4]   2>    5) Thread[id=4743, name=Thread-4257, state=WAITING, group=TGRP-TestIndexWriterThreadsToSegments]
   [junit4]   2>         at sun.misc.Unsafe.park(Native Method)
   [junit4]   2>         at java.util.concurrent.locks.LockSupport.park(LockSupport.java:175)
   [junit4]   2>         at java.util.concurrent.locks.AbstractQueuedSynchronizer$ConditionObject.await(AbstractQueuedSynchronizer.java:2039)
   [junit4]   2>         at java.util.concurrent.CyclicBarrier.dowait(CyclicBarrier.java:234)
   [junit4]   2>         at java.util.concurrent.CyclicBarrier.await(CyclicBarrier.java:362)
   [junit4]   2>         at org.apache.lucene.index.TestIndexWriterThreadsToSegments$2.run(TestIndexWriterThreadsToSegments.java:217)
   [junit4]   2> Ιουλ 01, 2019 5:32:30 ΜΜ com.carrotsearch.randomizedtesting.ThreadLeakControl tryToInterruptAll
   [junit4]   2> INFO: Starting to interrupt leaked threads:
   [junit4]   2>    1) Thread[id=4749, name=Thread-4263, state=WAITING, group=TGRP-TestIndexWriterThreadsToSegments]
   [junit4]   2>    2) Thread[id=4747, name=Thread-4261, state=WAITING, group=TGRP-TestIndexWriterThreadsToSegments]
   [junit4]   2>    3) Thread[id=4740, name=Thread-4254, state=WAITING, group=TGRP-TestIndexWriterThreadsToSegments]
   [junit4]   2>    4) Thread[id=4730, name=TEST-TestIndexWriterThreadsToSegments.testSegmentCountOnFlushRandom-seed#[D563D606E1A2C66F], state=WAITING, group=TGRP-TestIndexWriterThreadsToSegments]
   [junit4]   2>    5) Thread[id=4743, name=Thread-4257, state=WAITING, group=TGRP-TestIndexWriterThreadsToSegments]
   [junit4]   2> NOTE: leaving temporary files on disk at: /home/jenkins/jenkins-slave/workspace/Lucene-Solr-NightlyTests-8.1/checkout/lucene/build/core/test/J2/temp/lucene.index.TestIndexWriterThreadsToSegments_D563D606E1A2C66F-001
   [junit4]   2> Jul 01, 2019 10:32:31 PM com.carrotsearch.randomizedtesting.ThreadLeakControl tryToInterruptAll
   [junit4]   2> INFO: All leaked threads terminated.
   [junit4]   2> NOTE: test params are: codec=Asserting(Lucene80): {field=PostingsFormat(name=Direct)}, docValues:{}, maxPointsInLeafNode=1189, maxMBSortInHeap=6.365393374498929, sim=Asserting(org.apache.lucene.search.similarities.AssertingSimilarity@7be20d81), locale=el-CY, timezone=America/North_Dakota/Beulah
   [junit4]   2> NOTE: Linux 4.4.0-112-generic amd64/Oracle Corporation 1.8.0_191 (64-bit)/cpus=4,threads=1,free=16185688,total=520617984
   [junit4]   2> NOTE: All tests run in this JVM: [TestBlockPostingsFormat3, TestSimpleFSLockFactory, TestSimpleExplanationsWithFillerDocs, TestIndexWriterCommit, TestBasicModelIn, TestTragicIndexWriterDeadlock, TestBytesRefAttImpl, TestFixedBitSet, TestSpanNearQuery, TestSloppyPhraseQuery2, TestRollingUpdates, TestBinaryTerms, TestTimSorter, TestLucene50StoredFieldsFormatMergeInstance, TestConjunctionDISI, TestNIOFSDirectory, TestPhrasePrefixQuery, TestPagedBytes, TestNumericDocValuesUpdates, TestHighCompressionMode, TestAllFilesHaveChecksumFooter, TestLatLonDocValuesQueries, TestSortedSetSortField, TestRAMDirectory, TestNRTReaderCleanup, TestClassicSimilarity, TestPrefixCodedTerms, TestPolygon2D, TestSpanExplanationsOfNonMatches, TestSameScoresWithThreads, TestWildcard, TestForTooMuchCloning, TestDemoParallelLeafReader, TestSegmentMerger, Test2BPostings, TestLMDirichletSimilarity, TestTryDelete, TestAxiomaticF1LOG, TestLatLonPointDistanceSort, TestSpansEnum, TestMutableValues, TestTermsEnum2, TestAutomatonQueryUnicode, TestFutureArrays, Test2BSortedDocValuesOrds, TestTermVectors, TestFilterDirectory, TestIndexManyDocuments, TestIndexableField, TestBM25Similarity, TestSimpleAttributeImpl, TestSegmentCacheables, TestMultiFields, TestIndexWriterForceMerge, TestVersion, TestIndexWriterNRTIsCurrent, TestSpanSearchEquivalence, TestMultiPhraseQuery, TestIndependenceChiSquared, TestRadixSelector, Test2BNumericDocValues, TestMinShouldMatch2, TestInPlaceMergeSorter, TestCustomNorms, TestExitableDirectoryReader, TestCharArrayMap, TestLongRangeFieldQueries, TestByteArrayDataInput, TestDoc, TestMathUtil, TestNeverDelete, TestIndexWriterOnVMError, TestSloppyMath, TestToken, TestSpanCollection, TestDocValuesIndexing, TestSortRescorer, TestSPIClassIterator, TestBoolean2, TestLucene50LiveDocsFormat, TestConstantScoreScorer, TestDocValuesQueries, TestIndexSorting, TestCharsRefBuilder, TestStressIndexing2, TestConsistentFieldNumbers, TestAttributeSource, TestIndexWriterDeleteByQuery, TestIndexWriterFromReader, TestIndexWriterLockRelease, TestIndexWriterMaxDocs, TestIndexWriterOutOfFileDescriptors, TestIndexWriterReader, TestIndexWriterThreadsToSegments]
   [junit4]   2> NOTE: download the large Jenkins line-docs file by running 'ant get-jenkins-line-docs' in the lucene directory.
   [junit4]   2> NOTE: reproduce with: ant test  -Dtestcase=TestIndexWriterThreadsToSegments -Dtests.seed=D563D606E1A2C66F -Dtests.multiplier=2 -Dtests.nightly=true -Dtests.slow=true -Dtests.linedocsfile=/home/jenkins/jenkins-slave/workspace/Lucene-Solr-NightlyTests-8.1/test-data/enwiki.random.lines.txt -Dtests.locale=el-CY -Dtests.timezone=America/North_Dakota/Beulah -Dtests.asserts=true -Dtests.file.encoding=UTF-8
   [junit4] ERROR   0.00s J2 | TestIndexWriterThreadsToSegments (suite) <<<
   [junit4]    > Throwable #1: java.lang.Exception: Suite timeout exceeded (>= 7200000 msec).
   [junit4]    > 	at __randomizedtesting.SeedInfo.seed([D563D606E1A2C66F]:0)Throwable #2: com.carrotsearch.randomizedtesting.UncaughtExceptionError: Captured an uncaught exception in thread: Thread[id=4748, name=Thread-4262, state=RUNNABLE, group=TGRP-TestIndexWriterThreadsToSegments]
   [junit4]    > Caused by: java.lang.RuntimeException: org.apache.lucene.store.AlreadyClosedException: this IndexWriter is closed
   [junit4]    > 	at __randomizedtesting.SeedInfo.seed([D563D606E1A2C66F]:0)
   [junit4]    > 	at org.apache.lucene.index.TestIndexWriterThreadsToSegments$2.run(TestIndexWriterThreadsToSegments.java:220)
   [junit4]    > Caused by: org.apache.lucene.store.AlreadyClosedException: this IndexWriter is closed
   [junit4]    > 	at org.apache.lucene.index.IndexWriter.ensureOpen(IndexWriter.java:681)
   [junit4]    > 	at org.apache.lucene.index.IndexWriter.ensureOpen(IndexWriter.java:695)
   [junit4]    > 	at org.apache.lucene.index.IndexWriter.updateDocument(IndexWriter.java:1591)
   [junit4]    > 	at org.apache.lucene.index.IndexWriter.addDocument(IndexWriter.java:1213)
   [junit4]    > 	at org.apache.lucene.index.TestIndexWriterThreadsToSegments$2.run(TestIndexWriterThreadsToSegments.java:209)
   [junit4]    > Caused by: java.lang.OutOfMemoryError: GC overhead limit exceeded
   [junit4]    > 	at __randomizedtesting.SeedInfo.seed([D563D606E1A2C66F]:0)
   [junit4]    > 	at org.apache.lucene.analysis.MockTokenizer.readChar(MockTokenizer.java:237)
   [junit4]    > 	at org.apache.lucene.analysis.MockTokenizer.readCodePoint(MockTokenizer.java:203)
   [junit4]    > 	at org.apache.lucene.analysis.MockTokenizer.incrementToken(MockTokenizer.java:164)
   [junit4]    > 	at org.apache.lucene.analysis.MockTokenFilter.incrementToken(MockTokenFilter.java:80)
   [junit4]    > 	at org.apache.lucene.analysis.MockVariableLengthPayloadFilter.incrementToken(MockVariableLengthPayloadFilter.java:44)
   [junit4]    > 	at org.apache.lucene.index.DefaultIndexingChain$PerField.invert(DefaultIndexingChain.java:812)
   [junit4]    > 	at org.apache.lucene.index.DefaultIndexingChain.processField(DefaultIndexingChain.java:442)
   [junit4]    > 	at org.apache.lucene.index.DefaultIndexingChain.processDocument(DefaultIndexingChain.java:406)
   [junit4]    > 	at org.apache.lucene.index.DocumentsWriterPerThread.updateDocument(DocumentsWriterPerThread.java:250)
   [junit4]    > 	at org.apache.lucene.index.DocumentsWriter.updateDocument(DocumentsWriter.java:494)
   [junit4]    > 	at org.apache.lucene.index.IndexWriter.updateDocument(IndexWriter.java:1594)
   [junit4]    > 	... 2 moreThrowable #3: com.carrotsearch.randomizedtesting.UncaughtExceptionError: Captured an uncaught exception in thread: Thread[id=4745, name=Thread-4259, state=RUNNABLE, group=TGRP-TestIndexWriterThreadsToSegments]
   [junit4]    > Caused by: java.lang.OutOfMemoryError: GC overhead limit exceeded
   [junit4]    > 	at __randomizedtesting.SeedInfo.seed([D563D606E1A2C66F]:0)
   [junit4]    > 	at org.apache.lucene.analysis.MockTokenizer.readChar(MockTokenizer.java:237)
   [junit4]    > 	at org.apache.lucene.analysis.MockTokenizer.readCodePoint(MockTokenizer.java:203)
   [junit4]    > 	at org.apache.lucene.analysis.MockTokenizer.incrementToken(MockTokenizer.java:164)
   [junit4]    > 	at org.apache.lucene.analysis.MockTokenFilter.incrementToken(MockTokenFilter.java:80)
   [junit4]    > 	at org.apache.lucene.analysis.MockVariableLengthPayloadFilter.incrementToken(MockVariableLengthPayloadFilter.java:44)
   [junit4]    > 	at org.apache.lucene.index.DefaultIndexingChain$PerField.invert(DefaultIndexingChain.java:812)
   [junit4]    > 	at org.apache.lucene.index.DefaultIndexingChain.processField(DefaultIndexingChain.java:442)
   [junit4]    > 	at org.apache.lucene.index.DefaultIndexingChain.processDocument(DefaultIndexingChain.java:406)
   [junit4]    > 	at org.apache.lucene.index.DocumentsWriterPerThread.updateDocument(DocumentsWriterPerThread.java:250)
   [junit4]    > 	at org.apache.lucene.index.DocumentsWriter.updateDocument(DocumentsWriter.java:494)
   [junit4]    > 	at org.apache.lucene.index.IndexWriter.updateDocument(IndexWriter.java:1594)
   [junit4]    > 	at org.apache.lucene.index.IndexWriter.addDocument(IndexWriter.java:1213)
   [junit4]    > 	at org.apache.lucene.index.TestIndexWriterThreadsToSegments$2.run(TestIndexWriterThreadsToSegments.java:209)Throwable #4: com.carrotsearch.randomizedtesting.UncaughtExceptionError: Captured an uncaught exception in thread: Thread[id=4746, name=Thread-4260, state=RUNNABLE, group=TGRP-TestIndexWriterThreadsToSegments]
   [junit4]    > Caused by: java.lang.OutOfMemoryError: GC overhead limit exceeded
   [junit4]    > 	at __randomizedtesting.SeedInfo.seed([D563D606E1A2C66F]:0)
   [junit4]    > 	at java.io.BufferedOutputStream.<init>(BufferedOutputStream.java:76)
   [junit4]    > 	at org.apache.lucene.store.OutputStreamIndexOutput.<init>(OutputStreamIndexOutput.java:42)
   [junit4]    > 	at org.apache.lucene.store.FSDirectory$FSIndexOutput.<init>(FSDirectory.java:411)
   [junit4]    > 	at org.apache.lucene.store.FSDirectory$FSIndexOutput.<init>(FSDirectory.java:407)
   [junit4]    > 	at org.apache.lucene.store.FSDirectory.createOutput(FSDirectory.java:255)
   [junit4]    > 	at org.apache.lucene.store.MockDirectoryWrapper.createOutput(MockDirectoryWrapper.java:667)
   [junit4]    > 	at org.apache.lucene.store.LockValidatingDirectoryWrapper.createOutput(LockValidatingDirectoryWrapper.java:44)
   [junit4]    > 	at org.apache.lucene.store.TrackingDirectoryWrapper.createOutput(TrackingDirectoryWrapper.java:43)
   [junit4]    > 	at org.apache.lucene.codecs.compressing.CompressingStoredFieldsWriter.<init>(CompressingStoredFieldsWriter.java:115)
   [junit4]    > 	at org.apache.lucene.codecs.compressing.CompressingStoredFieldsFormat.fieldsWriter(CompressingStoredFieldsFormat.java:128)
   [junit4]    > 	at org.apache.lucene.codecs.lucene50.Lucene50StoredFieldsFormat.fieldsWriter(Lucene50StoredFieldsFormat.java:183)
   [junit4]    > 	at org.apache.lucene.codecs.asserting.AssertingStoredFieldsFormat.fieldsWriter(AssertingStoredFieldsFormat.java:48)
   [junit4]    > 	at org.apache.lucene.index.StoredFieldsConsumer.initStoredFieldsWriter(StoredFieldsConsumer.java:39)
   [junit4]    > 	at org.apache.lucene.index.StoredFieldsConsumer.startDocument(StoredFieldsConsumer.java:46)
   [junit4]    > 	at org.apache.lucene.index.DefaultIndexingChain.startStoredFields(DefaultIndexingChain.java:367)
   [junit4]    > 	at org.apache.lucene.index.DefaultIndexingChain.processDocument(DefaultIndexingChain.java:403)
   [junit4]    > 	at org.apache.lucene.index.DocumentsWriterPerThread.updateDocument(DocumentsWriterPerThread.java:250)
   [junit4]    > 	at org.apache.lucene.index.DocumentsWriter.updateDocument(DocumentsWriter.java:494)
   [junit4]    > 	at org.apache.lucene.index.IndexWriter.updateDocument(IndexWriter.java:1594)
   [junit4]    > 	at org.apache.lucene.index.IndexWriter.addDocument(IndexWriter.java:1213)
   [junit4]    > 	at org.apache.lucene.index.TestIndexWriterThreadsToSegments$2.run(TestIndexWriterThreadsToSegments.java:209)Throwable #5: com.carrotsearch.randomizedtesting.UncaughtExceptionError: Captured an uncaught exception in thread: Thread[id=4744, name=Thread-4258, state=RUNNABLE, group=TGRP-TestIndexWriterThreadsToSegments]
   [junit4]    > Caused by: java.lang.RuntimeException: org.apache.lucene.store.AlreadyClosedException: this IndexWriter is closed
   [junit4]    > 	at __randomizedtesting.SeedInfo.seed([D563D606E1A2C66F]:0)
   [junit4]    > 	at org.apache.lucene.index.TestIndexWriterThreadsToSegments$2.run(TestIndexWriterThreadsToSegments.java:220)
   [junit4]    > Caused by: org.apache.lucene.store.AlreadyClosedException: this IndexWriter is closed
   [junit4]    > 	at org.apache.lucene.index.IndexWriter.ensureOpen(IndexWriter.java:681)
   [junit4]    > 	at org.apache.lucene.index.IndexWriter.ensureOpen(IndexWriter.java:695)
   [junit4]    > 	at org.apache.lucene.index.IndexWriter.updateDocument(IndexWriter.java:1591)
   [junit4]    > 	at org.apache.lucene.index.IndexWriter.addDocument(IndexWriter.java:1213)
   [junit4]    > 	at org.apache.lucene.index.TestIndexWriterThreadsToSegments$2.run(TestIndexWriterThreadsToSegments.java:209)
   [junit4]    > Caused by: java.lang.OutOfMemoryError: GC overhead limit exceeded
   [junit4]    > 	at __randomizedtesting.SeedInfo.seed([D563D606E1A2C66F]:0)
   [junit4]    > 	at org.apache.lucene.analysis.MockTokenizer.readChar(MockTokenizer.java:237)
   [junit4]    > 	at org.apache.lucene.analysis.MockTokenizer.readCodePoint(MockTokenizer.java:203)
   [junit4]    > 	at org.apache.lucene.analysis.MockTokenizer.incrementToken(MockTokenizer.java:164)
   [junit4]    > 	at org.apache.lucene.analysis.MockTokenFilter.incrementToken(MockTokenFilter.java:80)
   [junit4]    > 	at org.apache.lucene.analysis.MockVariableLengthPayloadFilter.incrementToken(MockVariableLengthPayloadFilter.java:44)
   [junit4]    > 	at org.apache.lucene.index.DefaultIndexingChain$PerField.invert(DefaultIndexingChain.java:812)
   [junit4]    > 	at org.apache.lucene.index.DefaultIndexingChain.processField(DefaultIndexingChain.java:442)
   [junit4]    > 	at org.apache.lucene.index.DefaultIndexingChain.processDocument(DefaultIndexingChain.java:406)
   [junit4]    > 	at org.apache.lucene.index.DocumentsWriterPerThread.updateDocument(DocumentsWriterPerThread.java:250)
   [junit4]    > 	at org.apache.lucene.index.DocumentsWriter.updateDocument(DocumentsWriter.java:494)
   [junit4]    > 	at org.apache.lucene.index.IndexWriter.updateDocument(IndexWriter.java:1594)
   [junit4]    > 	... 2 moreThrowable #6: com.carrotsearch.randomizedtesting.UncaughtExceptionError: Captured an uncaught exception in thread: Thread[id=4742, name=Thread-4256, state=RUNNABLE, group=TGRP-TestIndexWriterThreadsToSegments]
   [junit4]    > Caused by: java.lang.OutOfMemoryError: GC overhead limit exceeded
   [junit4]    > 	at __randomizedtesting.SeedInfo.seed([D563D606E1A2C66F]:0)
   [junit4]    > 	at sun.nio.fs.UnixPath.encode(UnixPath.java:132)
   [junit4]    > 	at sun.nio.fs.UnixPath.<init>(UnixPath.java:71)
   [junit4]    > 	at sun.nio.fs.UnixFileSystem.getPath(UnixFileSystem.java:281)
   [junit4]    > 	at sun.nio.fs.AbstractPath.resolve(AbstractPath.java:53)
   [junit4]    > 	at org.apache.lucene.mockfile.FilterPath.resolve(FilterPath.java:155)
   [junit4]    > 	at org.apache.lucene.mockfile.FilterPath.resolve(FilterPath.java:155)
   [junit4]    > 	at org.apache.lucene.mockfile.FilterPath.resolve(FilterPath.java:155)
   [junit4]    > 	at org.apache.lucene.mockfile.FilterPath.resolve(FilterPath.java:155)
   [junit4]    > 	at org.apache.lucene.mockfile.FilterPath.resolve(FilterPath.java:155)
   [junit4]    > 	at org.apache.lucene.store.FSDirectory$FSIndexOutput.<init>(FSDirectory.java:411)
   [junit4]    > 	at org.apache.lucene.store.FSDirectory$FSIndexOutput.<init>(FSDirectory.java:407)
   [junit4]    > 	at org.apache.lucene.store.FSDirectory.createOutput(FSDirectory.java:255)
   [junit4]    > 	at org.apache.lucene.store.MockDirectoryWrapper.createOutput(MockDirectoryWrapper.java:667)
   [junit4]    > 	at org.apache.lucene.store.LockValidatingDirectoryWrapper.createOutput(LockValidatingDirectoryWrapper.java:44)
   [junit4]    > 	at org.apache.lucene.store.TrackingDirectoryWrapper.createOutput(TrackingDirectoryWrapper.java:43)
   [junit4]    > 	at org.apache.lucene.codecs.compressing.CompressingStoredFieldsWriter.<init>(CompressingStoredFieldsWriter.java:115)
   [junit4]    > 	at org.apache.lucene.codecs.compressing.CompressingStoredFieldsFormat.fieldsWriter(CompressingStoredFieldsFormat.java:128)
   [junit4]    > 	at org.apache.lucene.codecs.lucene50.Lucene50StoredFieldsFormat.fieldsWriter(Lucene50StoredFieldsFormat.java:183)
   [junit4]    > 	at org.apache.lucene.codecs.asserting.AssertingStoredFieldsFormat.fieldsWriter(AssertingStoredFieldsFormat.java:48)
   [junit4]    > 	at org.apache.lucene.index.StoredFieldsConsumer.initStoredFieldsWriter(StoredFieldsConsumer.java:39)
   [junit4]    > 	at org.apache.lucene.index.StoredFieldsConsumer.startDocument(StoredFieldsConsumer.java:46)
   [junit4]    > 	at org.apache.lucene.index.DefaultIndexingChain.startStoredFields(DefaultIndexingChain.java:367)
   [junit4]    > 	at org.apache.lucene.index.DefaultIndexingChain.processDocument(DefaultIndexingChain.java:403)
   [junit4]    > 	at org.apache.lucene.index.DocumentsWriterPerThread.updateDocument(DocumentsWriterPerThread.java:250)
   [junit4]    > 	at org.apache.lucene.index.DocumentsWriter.updateDocument(DocumentsWriter.java:494)
   [junit4]    > 	at org.apache.lucene.index.IndexWriter.updateDocument(IndexWriter.java:1594)
   [junit4]    > 	at org.apache.lucene.index.IndexWriter.addDocument(IndexWriter.java:1213)
   [junit4]    > 	at org.apache.lucene.index.TestIndexWriterThreadsToSegments$2.run(TestIndexWriterThreadsToSegments.java:209)Throwable #7: com.carrotsearch.randomizedtesting.UncaughtExceptionError: Captured an uncaught exception in thread: Thread[id=4741, name=Thread-4255, state=RUNNABLE, group=TGRP-TestIndexWriterThreadsToSegments]
   [junit4]    > Caused by: java.lang.RuntimeException: org.apache.lucene.store.AlreadyClosedException: this IndexWriter is closed
   [junit4]    > 	at __randomizedtesting.SeedInfo.seed([D563D606E1A2C66F]:0)
   [junit4]    > 	at org.apache.lucene.index.TestIndexWriterThreadsToSegments$2.run(TestIndexWriterThreadsToSegments.java:220)
   [junit4]    > Caused by: org.apache.lucene.store.AlreadyClosedException: this IndexWriter is closed
   [junit4]    > 	at org.apache.lucene.index.IndexWriter.ensureOpen(IndexWriter.java:681)
   [junit4]    > 	at org.apache.lucene.index.IndexWriter.ensureOpen(IndexWriter.java:695)
   [junit4]    > 	at org.apache.lucene.index.IndexWriter.updateDocument(IndexWriter.java:1591)
   [junit4]    > 	at org.apache.lucene.index.IndexWriter.addDocument(IndexWriter.java:1213)
   [junit4]    > 	at org.apache.lucene.index.TestIndexWriterThreadsToSegments$2.run(TestIndexWriterThreadsToSegments.java:209)
   [junit4]    > Caused by: java.lang.OutOfMemoryError: GC overhead limit exceeded
   [junit4]    > 	at __randomizedtesting.SeedInfo.seed([D563D606E1A2C66F]:0)
   [junit4]    > 	at org.apache.lucene.analysis.MockTokenizer.readChar(MockTokenizer.java:237)
   [junit4]    > 	at org.apache.lucene.analysis.MockTokenizer.readCodePoint(MockTokenizer.java:203)
   [junit4]    > 	at org.apache.lucene.analysis.MockTokenizer.incrementToken(MockTokenizer.java:164)
   [junit4]    > 	at org.apache.lucene.analysis.MockTokenFilter.incrementToken(MockTokenFilter.java:80)
   [junit4]    > 	at org.apache.lucene.analysis.MockVariableLengthPayloadFilter.incrementToken(MockVariableLengthPayloadFilter.java:44)
   [junit4]    > 	at org.apache.lucene.index.DefaultIndexingChain$PerField.invert(DefaultIndexingChain.java:812)
   [junit4]    > 	at org.apache.lucene.index.DefaultIndexingChain.processField(DefaultIndexingChain.java:442)
   [junit4]    > 	at org.apache.lucene.index.DefaultIndexingChain.processDocument(DefaultIndexingChain.java:406)
   [junit4]    > 	at org.apache.lucene.index.DocumentsWriterPerThread.updateDocument(DocumentsWriterPerThread.java:250)
   [junit4]    > 	at org.apache.lucene.index.DocumentsWriter.updateDocument(DocumentsWriter.java:494)
   [junit4]    > 	at org.apache.lucene.index.IndexWriter.updateDocument(IndexWriter.java:1594)
   [junit4]    > 	... 2 more
   [junit4] Completed [519/519 (1!)] on J2 in 7220.96s, 4 tests, 8 errors <<< FAILURES!

[...truncated 1 lines...]
   [junit4] JVM J2: stdout was not empty, see: /home/jenkins/jenkins-slave/workspace/Lucene-Solr-NightlyTests-8.1/checkout/lucene/build/core/test/temp/junit4-J2-20190701_180532_1035404205622535355137.sysout
   [junit4] >>> JVM J2 emitted unexpected output (verbatim) ----
   [junit4] java.lang.OutOfMemoryError: GC overhead limit exceeded
   [junit4] Dumping heap to /home/jenkins/jenkins-slave/workspace/Lucene-Solr-NightlyTests-8.1/checkout/heapdumps/java_pid1945.hprof ...
   [junit4] Heap dump file created [562695245 bytes in 20.113 secs]
   [junit4] <<< JVM J2: EOF ----

[...truncated 23274 lines...]
BUILD FAILED
/home/jenkins/jenkins-slave/workspace/Lucene-Solr-NightlyTests-8.1/checkout/build.xml:652: The following error occurred while executing this line:
/home/jenkins/jenkins-slave/workspace/Lucene-Solr-NightlyTests-8.1/checkout/build.xml:586: Some of the tests produced a heap dump, but did not fail. Maybe a suppressed OutOfMemoryError? Dumps created:
* java_pid1945.hprof

Total time: 644 minutes 57 seconds
Build step 'Invoke Ant' marked build as failure
Archiving artifacts
Recording test results
Email was triggered for: Failure - Any
Sending email for trigger: Failure - Any

Mime
View raw message