lucene-dev mailing list archives

Site index · List index
Message view « Date » · « Thread »
Top « Date » · « Thread »
From Policeman Jenkins Server <jenk...@thetaphi.de>
Subject [JENKINS] Lucene-Solr-8.x-MacOSX (64bit/jdk-12.0.1) - Build # 219 - Still Unstable!
Date Tue, 02 Jul 2019 19:43:37 GMT
Build: https://jenkins.thetaphi.de/job/Lucene-Solr-8.x-MacOSX/219/
Java: 64bit/jdk-12.0.1 -XX:+UseCompressedOops -XX:+UseConcMarkSweepGC

3 tests failed.
FAILED:  org.apache.solr.cloud.DeleteReplicaTest.raceConditionOnDeleteAndRegisterReplicaLegacy

Error Message:
Timeout occurred while waiting response from server at: https://127.0.0.1:57201/solr

Stack Trace:
org.apache.solr.client.solrj.SolrServerException: Timeout occurred while waiting response from server at: https://127.0.0.1:57201/solr
	at __randomizedtesting.SeedInfo.seed([17D2A2A6F4337909:6EC8BFB26206E5E1]:0)
	at org.apache.solr.client.solrj.impl.HttpSolrClient.executeMethod(HttpSolrClient.java:667)
	at org.apache.solr.client.solrj.impl.HttpSolrClient.request(HttpSolrClient.java:262)
	at org.apache.solr.client.solrj.impl.HttpSolrClient.request(HttpSolrClient.java:245)
	at org.apache.solr.client.solrj.impl.LBSolrClient.doRequest(LBSolrClient.java:368)
	at org.apache.solr.client.solrj.impl.LBSolrClient.request(LBSolrClient.java:296)
	at org.apache.solr.client.solrj.impl.BaseCloudSolrClient.sendRequest(BaseCloudSolrClient.java:1128)
	at org.apache.solr.client.solrj.impl.BaseCloudSolrClient.requestWithRetryOnStaleState(BaseCloudSolrClient.java:897)
	at org.apache.solr.client.solrj.impl.BaseCloudSolrClient.request(BaseCloudSolrClient.java:829)
	at org.apache.solr.client.solrj.SolrRequest.process(SolrRequest.java:211)
	at org.apache.solr.client.solrj.SolrRequest.process(SolrRequest.java:228)
	at org.apache.solr.cloud.DeleteReplicaTest.raceConditionOnDeleteAndRegisterReplica(DeleteReplicaTest.java:384)
	at org.apache.solr.cloud.DeleteReplicaTest.raceConditionOnDeleteAndRegisterReplicaLegacy(DeleteReplicaTest.java:264)
	at java.base/jdk.internal.reflect.NativeMethodAccessorImpl.invoke0(Native Method)
	at java.base/jdk.internal.reflect.NativeMethodAccessorImpl.invoke(NativeMethodAccessorImpl.java:62)
	at java.base/jdk.internal.reflect.DelegatingMethodAccessorImpl.invoke(DelegatingMethodAccessorImpl.java:43)
	at java.base/java.lang.reflect.Method.invoke(Method.java:567)
	at com.carrotsearch.randomizedtesting.RandomizedRunner.invoke(RandomizedRunner.java:1750)
	at com.carrotsearch.randomizedtesting.RandomizedRunner$8.evaluate(RandomizedRunner.java:938)
	at com.carrotsearch.randomizedtesting.RandomizedRunner$9.evaluate(RandomizedRunner.java:974)
	at com.carrotsearch.randomizedtesting.RandomizedRunner$10.evaluate(RandomizedRunner.java:988)
	at com.carrotsearch.randomizedtesting.rules.SystemPropertiesRestoreRule$1.evaluate(SystemPropertiesRestoreRule.java:57)
	at org.apache.lucene.util.TestRuleSetupTeardownChained$1.evaluate(TestRuleSetupTeardownChained.java:49)
	at org.apache.lucene.util.AbstractBeforeAfterRule$1.evaluate(AbstractBeforeAfterRule.java:45)
	at org.apache.lucene.util.TestRuleThreadAndTestName$1.evaluate(TestRuleThreadAndTestName.java:48)
	at org.apache.lucene.util.TestRuleIgnoreAfterMaxFailures$1.evaluate(TestRuleIgnoreAfterMaxFailures.java:64)
	at org.apache.lucene.util.TestRuleMarkFailure$1.evaluate(TestRuleMarkFailure.java:47)
	at com.carrotsearch.randomizedtesting.rules.StatementAdapter.evaluate(StatementAdapter.java:36)
	at com.carrotsearch.randomizedtesting.ThreadLeakControl$StatementRunner.run(ThreadLeakControl.java:368)
	at com.carrotsearch.randomizedtesting.ThreadLeakControl.forkTimeoutingTask(ThreadLeakControl.java:817)
	at com.carrotsearch.randomizedtesting.ThreadLeakControl$3.evaluate(ThreadLeakControl.java:468)
	at com.carrotsearch.randomizedtesting.RandomizedRunner.runSingleTest(RandomizedRunner.java:947)
	at com.carrotsearch.randomizedtesting.RandomizedRunner$5.evaluate(RandomizedRunner.java:832)
	at com.carrotsearch.randomizedtesting.RandomizedRunner$6.evaluate(RandomizedRunner.java:883)
	at com.carrotsearch.randomizedtesting.RandomizedRunner$7.evaluate(RandomizedRunner.java:894)
	at com.carrotsearch.randomizedtesting.rules.StatementAdapter.evaluate(StatementAdapter.java:36)
	at com.carrotsearch.randomizedtesting.rules.SystemPropertiesRestoreRule$1.evaluate(SystemPropertiesRestoreRule.java:57)
	at org.apache.lucene.util.AbstractBeforeAfterRule$1.evaluate(AbstractBeforeAfterRule.java:45)
	at com.carrotsearch.randomizedtesting.rules.StatementAdapter.evaluate(StatementAdapter.java:36)
	at org.apache.lucene.util.TestRuleStoreClassName$1.evaluate(TestRuleStoreClassName.java:41)
	at com.carrotsearch.randomizedtesting.rules.NoShadowingOrOverridesOnMethodsRule$1.evaluate(NoShadowingOrOverridesOnMethodsRule.java:40)
	at com.carrotsearch.randomizedtesting.rules.NoShadowingOrOverridesOnMethodsRule$1.evaluate(NoShadowingOrOverridesOnMethodsRule.java:40)
	at com.carrotsearch.randomizedtesting.rules.StatementAdapter.evaluate(StatementAdapter.java:36)
	at com.carrotsearch.randomizedtesting.rules.StatementAdapter.evaluate(StatementAdapter.java:36)
	at org.apache.lucene.util.TestRuleAssertionsRequired$1.evaluate(TestRuleAssertionsRequired.java:53)
	at org.apache.lucene.util.TestRuleMarkFailure$1.evaluate(TestRuleMarkFailure.java:47)
	at org.apache.lucene.util.TestRuleIgnoreAfterMaxFailures$1.evaluate(TestRuleIgnoreAfterMaxFailures.java:64)
	at org.apache.lucene.util.TestRuleIgnoreTestSuites$1.evaluate(TestRuleIgnoreTestSuites.java:54)
	at com.carrotsearch.randomizedtesting.rules.StatementAdapter.evaluate(StatementAdapter.java:36)
	at com.carrotsearch.randomizedtesting.ThreadLeakControl$StatementRunner.run(ThreadLeakControl.java:368)
	at java.base/java.lang.Thread.run(Thread.java:835)
Caused by: java.net.SocketTimeoutException: Read timed out
	at java.base/java.net.SocketInputStream.socketRead0(Native Method)
	at java.base/java.net.SocketInputStream.socketRead(SocketInputStream.java:115)
	at java.base/java.net.SocketInputStream.read(SocketInputStream.java:168)
	at java.base/java.net.SocketInputStream.read(SocketInputStream.java:140)
	at java.base/sun.security.ssl.SSLSocketInputRecord.read(SSLSocketInputRecord.java:448)
	at java.base/sun.security.ssl.SSLSocketInputRecord.bytesInCompletePacket(SSLSocketInputRecord.java:68)
	at java.base/sun.security.ssl.SSLSocketImpl.readApplicationRecord(SSLSocketImpl.java:1132)
	at java.base/sun.security.ssl.SSLSocketImpl$AppInputStream.read(SSLSocketImpl.java:828)
	at org.apache.http.impl.io.SessionInputBufferImpl.streamRead(SessionInputBufferImpl.java:137)
	at org.apache.http.impl.io.SessionInputBufferImpl.fillBuffer(SessionInputBufferImpl.java:153)
	at org.apache.http.impl.io.SessionInputBufferImpl.readLine(SessionInputBufferImpl.java:282)
	at org.apache.http.impl.conn.DefaultHttpResponseParser.parseHead(DefaultHttpResponseParser.java:138)
	at org.apache.http.impl.conn.DefaultHttpResponseParser.parseHead(DefaultHttpResponseParser.java:56)
	at org.apache.http.impl.io.AbstractMessageParser.parse(AbstractMessageParser.java:259)
	at org.apache.http.impl.DefaultBHttpClientConnection.receiveResponseHeader(DefaultBHttpClientConnection.java:163)
	at org.apache.http.impl.conn.CPoolProxy.receiveResponseHeader(CPoolProxy.java:165)
	at org.apache.http.protocol.HttpRequestExecutor.doReceiveResponse(HttpRequestExecutor.java:273)
	at org.apache.http.protocol.HttpRequestExecutor.execute(HttpRequestExecutor.java:125)
	at org.apache.http.impl.execchain.MainClientExec.execute(MainClientExec.java:272)
	at org.apache.http.impl.execchain.ProtocolExec.execute(ProtocolExec.java:185)
	at org.apache.http.impl.execchain.RetryExec.execute(RetryExec.java:89)
	at org.apache.http.impl.execchain.RedirectExec.execute(RedirectExec.java:110)
	at org.apache.http.impl.client.InternalHttpClient.doExecute(InternalHttpClient.java:185)
	at org.apache.http.impl.client.CloseableHttpClient.execute(CloseableHttpClient.java:83)
	at org.apache.http.impl.client.CloseableHttpClient.execute(CloseableHttpClient.java:56)
	at org.apache.solr.client.solrj.impl.HttpSolrClient.executeMethod(HttpSolrClient.java:555)
	... 49 more


FAILED:  org.apache.solr.cloud.DeleteReplicaTest.raceConditionOnDeleteAndRegisterReplicaLegacy

Error Message:
Timeout occurred while waiting response from server at: https://127.0.0.1:57703/solr

Stack Trace:
org.apache.solr.client.solrj.SolrServerException: Timeout occurred while waiting response from server at: https://127.0.0.1:57703/solr
	at __randomizedtesting.SeedInfo.seed([17D2A2A6F4337909:6EC8BFB26206E5E1]:0)
	at org.apache.solr.client.solrj.impl.HttpSolrClient.executeMethod(HttpSolrClient.java:667)
	at org.apache.solr.client.solrj.impl.HttpSolrClient.request(HttpSolrClient.java:262)
	at org.apache.solr.client.solrj.impl.HttpSolrClient.request(HttpSolrClient.java:245)
	at org.apache.solr.client.solrj.impl.LBSolrClient.doRequest(LBSolrClient.java:368)
	at org.apache.solr.client.solrj.impl.LBSolrClient.request(LBSolrClient.java:296)
	at org.apache.solr.client.solrj.impl.BaseCloudSolrClient.sendRequest(BaseCloudSolrClient.java:1128)
	at org.apache.solr.client.solrj.impl.BaseCloudSolrClient.requestWithRetryOnStaleState(BaseCloudSolrClient.java:897)
	at org.apache.solr.client.solrj.impl.BaseCloudSolrClient.request(BaseCloudSolrClient.java:829)
	at org.apache.solr.client.solrj.SolrRequest.process(SolrRequest.java:211)
	at org.apache.solr.client.solrj.SolrRequest.process(SolrRequest.java:228)
	at org.apache.solr.cloud.DeleteReplicaTest.raceConditionOnDeleteAndRegisterReplica(DeleteReplicaTest.java:384)
	at org.apache.solr.cloud.DeleteReplicaTest.raceConditionOnDeleteAndRegisterReplicaLegacy(DeleteReplicaTest.java:264)
	at java.base/jdk.internal.reflect.NativeMethodAccessorImpl.invoke0(Native Method)
	at java.base/jdk.internal.reflect.NativeMethodAccessorImpl.invoke(NativeMethodAccessorImpl.java:62)
	at java.base/jdk.internal.reflect.DelegatingMethodAccessorImpl.invoke(DelegatingMethodAccessorImpl.java:43)
	at java.base/java.lang.reflect.Method.invoke(Method.java:567)
	at com.carrotsearch.randomizedtesting.RandomizedRunner.invoke(RandomizedRunner.java:1750)
	at com.carrotsearch.randomizedtesting.RandomizedRunner$8.evaluate(RandomizedRunner.java:938)
	at com.carrotsearch.randomizedtesting.RandomizedRunner$9.evaluate(RandomizedRunner.java:974)
	at com.carrotsearch.randomizedtesting.RandomizedRunner$10.evaluate(RandomizedRunner.java:988)
	at com.carrotsearch.randomizedtesting.rules.SystemPropertiesRestoreRule$1.evaluate(SystemPropertiesRestoreRule.java:57)
	at org.apache.lucene.util.TestRuleSetupTeardownChained$1.evaluate(TestRuleSetupTeardownChained.java:49)
	at org.apache.lucene.util.AbstractBeforeAfterRule$1.evaluate(AbstractBeforeAfterRule.java:45)
	at org.apache.lucene.util.TestRuleThreadAndTestName$1.evaluate(TestRuleThreadAndTestName.java:48)
	at org.apache.lucene.util.TestRuleIgnoreAfterMaxFailures$1.evaluate(TestRuleIgnoreAfterMaxFailures.java:64)
	at org.apache.lucene.util.TestRuleMarkFailure$1.evaluate(TestRuleMarkFailure.java:47)
	at com.carrotsearch.randomizedtesting.rules.StatementAdapter.evaluate(StatementAdapter.java:36)
	at com.carrotsearch.randomizedtesting.ThreadLeakControl$StatementRunner.run(ThreadLeakControl.java:368)
	at com.carrotsearch.randomizedtesting.ThreadLeakControl.forkTimeoutingTask(ThreadLeakControl.java:817)
	at com.carrotsearch.randomizedtesting.ThreadLeakControl$3.evaluate(ThreadLeakControl.java:468)
	at com.carrotsearch.randomizedtesting.RandomizedRunner.runSingleTest(RandomizedRunner.java:947)
	at com.carrotsearch.randomizedtesting.RandomizedRunner$5.evaluate(RandomizedRunner.java:832)
	at com.carrotsearch.randomizedtesting.RandomizedRunner$6.evaluate(RandomizedRunner.java:883)
	at com.carrotsearch.randomizedtesting.RandomizedRunner$7.evaluate(RandomizedRunner.java:894)
	at com.carrotsearch.randomizedtesting.rules.StatementAdapter.evaluate(StatementAdapter.java:36)
	at com.carrotsearch.randomizedtesting.rules.SystemPropertiesRestoreRule$1.evaluate(SystemPropertiesRestoreRule.java:57)
	at org.apache.lucene.util.AbstractBeforeAfterRule$1.evaluate(AbstractBeforeAfterRule.java:45)
	at com.carrotsearch.randomizedtesting.rules.StatementAdapter.evaluate(StatementAdapter.java:36)
	at org.apache.lucene.util.TestRuleStoreClassName$1.evaluate(TestRuleStoreClassName.java:41)
	at com.carrotsearch.randomizedtesting.rules.NoShadowingOrOverridesOnMethodsRule$1.evaluate(NoShadowingOrOverridesOnMethodsRule.java:40)
	at com.carrotsearch.randomizedtesting.rules.NoShadowingOrOverridesOnMethodsRule$1.evaluate(NoShadowingOrOverridesOnMethodsRule.java:40)
	at com.carrotsearch.randomizedtesting.rules.StatementAdapter.evaluate(StatementAdapter.java:36)
	at com.carrotsearch.randomizedtesting.rules.StatementAdapter.evaluate(StatementAdapter.java:36)
	at org.apache.lucene.util.TestRuleAssertionsRequired$1.evaluate(TestRuleAssertionsRequired.java:53)
	at org.apache.lucene.util.TestRuleMarkFailure$1.evaluate(TestRuleMarkFailure.java:47)
	at org.apache.lucene.util.TestRuleIgnoreAfterMaxFailures$1.evaluate(TestRuleIgnoreAfterMaxFailures.java:64)
	at org.apache.lucene.util.TestRuleIgnoreTestSuites$1.evaluate(TestRuleIgnoreTestSuites.java:54)
	at com.carrotsearch.randomizedtesting.rules.StatementAdapter.evaluate(StatementAdapter.java:36)
	at com.carrotsearch.randomizedtesting.ThreadLeakControl$StatementRunner.run(ThreadLeakControl.java:368)
	at java.base/java.lang.Thread.run(Thread.java:835)
Caused by: java.net.SocketTimeoutException: Read timed out
	at java.base/java.net.SocketInputStream.socketRead0(Native Method)
	at java.base/java.net.SocketInputStream.socketRead(SocketInputStream.java:115)
	at java.base/java.net.SocketInputStream.read(SocketInputStream.java:168)
	at java.base/java.net.SocketInputStream.read(SocketInputStream.java:140)
	at java.base/sun.security.ssl.SSLSocketInputRecord.read(SSLSocketInputRecord.java:448)
	at java.base/sun.security.ssl.SSLSocketInputRecord.bytesInCompletePacket(SSLSocketInputRecord.java:68)
	at java.base/sun.security.ssl.SSLSocketImpl.readApplicationRecord(SSLSocketImpl.java:1132)
	at java.base/sun.security.ssl.SSLSocketImpl$AppInputStream.read(SSLSocketImpl.java:828)
	at org.apache.http.impl.io.SessionInputBufferImpl.streamRead(SessionInputBufferImpl.java:137)
	at org.apache.http.impl.io.SessionInputBufferImpl.fillBuffer(SessionInputBufferImpl.java:153)
	at org.apache.http.impl.io.SessionInputBufferImpl.readLine(SessionInputBufferImpl.java:282)
	at org.apache.http.impl.conn.DefaultHttpResponseParser.parseHead(DefaultHttpResponseParser.java:138)
	at org.apache.http.impl.conn.DefaultHttpResponseParser.parseHead(DefaultHttpResponseParser.java:56)
	at org.apache.http.impl.io.AbstractMessageParser.parse(AbstractMessageParser.java:259)
	at org.apache.http.impl.DefaultBHttpClientConnection.receiveResponseHeader(DefaultBHttpClientConnection.java:163)
	at org.apache.http.impl.conn.CPoolProxy.receiveResponseHeader(CPoolProxy.java:165)
	at org.apache.http.protocol.HttpRequestExecutor.doReceiveResponse(HttpRequestExecutor.java:273)
	at org.apache.http.protocol.HttpRequestExecutor.execute(HttpRequestExecutor.java:125)
	at org.apache.http.impl.execchain.MainClientExec.execute(MainClientExec.java:272)
	at org.apache.http.impl.execchain.ProtocolExec.execute(ProtocolExec.java:185)
	at org.apache.http.impl.execchain.RetryExec.execute(RetryExec.java:89)
	at org.apache.http.impl.execchain.RedirectExec.execute(RedirectExec.java:110)
	at org.apache.http.impl.client.InternalHttpClient.doExecute(InternalHttpClient.java:185)
	at org.apache.http.impl.client.CloseableHttpClient.execute(CloseableHttpClient.java:83)
	at org.apache.http.impl.client.CloseableHttpClient.execute(CloseableHttpClient.java:56)
	at org.apache.solr.client.solrj.impl.HttpSolrClient.executeMethod(HttpSolrClient.java:555)
	... 49 more


FAILED:  org.apache.solr.cloud.DeleteReplicaTest.raceConditionOnDeleteAndRegisterReplicaLegacy

Error Message:
Timeout occurred while waiting response from server at: https://127.0.0.1:56792/solr

Stack Trace:
org.apache.solr.client.solrj.SolrServerException: Timeout occurred while waiting response from server at: https://127.0.0.1:56792/solr
	at __randomizedtesting.SeedInfo.seed([17D2A2A6F4337909:6EC8BFB26206E5E1]:0)
	at org.apache.solr.client.solrj.impl.HttpSolrClient.executeMethod(HttpSolrClient.java:667)
	at org.apache.solr.client.solrj.impl.HttpSolrClient.request(HttpSolrClient.java:262)
	at org.apache.solr.client.solrj.impl.HttpSolrClient.request(HttpSolrClient.java:245)
	at org.apache.solr.client.solrj.impl.LBSolrClient.doRequest(LBSolrClient.java:368)
	at org.apache.solr.client.solrj.impl.LBSolrClient.request(LBSolrClient.java:296)
	at org.apache.solr.client.solrj.impl.BaseCloudSolrClient.sendRequest(BaseCloudSolrClient.java:1128)
	at org.apache.solr.client.solrj.impl.BaseCloudSolrClient.requestWithRetryOnStaleState(BaseCloudSolrClient.java:897)
	at org.apache.solr.client.solrj.impl.BaseCloudSolrClient.request(BaseCloudSolrClient.java:829)
	at org.apache.solr.client.solrj.SolrRequest.process(SolrRequest.java:211)
	at org.apache.solr.client.solrj.SolrRequest.process(SolrRequest.java:228)
	at org.apache.solr.cloud.DeleteReplicaTest.raceConditionOnDeleteAndRegisterReplica(DeleteReplicaTest.java:384)
	at org.apache.solr.cloud.DeleteReplicaTest.raceConditionOnDeleteAndRegisterReplicaLegacy(DeleteReplicaTest.java:264)
	at java.base/jdk.internal.reflect.NativeMethodAccessorImpl.invoke0(Native Method)
	at java.base/jdk.internal.reflect.NativeMethodAccessorImpl.invoke(NativeMethodAccessorImpl.java:62)
	at java.base/jdk.internal.reflect.DelegatingMethodAccessorImpl.invoke(DelegatingMethodAccessorImpl.java:43)
	at java.base/java.lang.reflect.Method.invoke(Method.java:567)
	at com.carrotsearch.randomizedtesting.RandomizedRunner.invoke(RandomizedRunner.java:1750)
	at com.carrotsearch.randomizedtesting.RandomizedRunner$8.evaluate(RandomizedRunner.java:938)
	at com.carrotsearch.randomizedtesting.RandomizedRunner$9.evaluate(RandomizedRunner.java:974)
	at com.carrotsearch.randomizedtesting.RandomizedRunner$10.evaluate(RandomizedRunner.java:988)
	at com.carrotsearch.randomizedtesting.rules.SystemPropertiesRestoreRule$1.evaluate(SystemPropertiesRestoreRule.java:57)
	at org.apache.lucene.util.TestRuleSetupTeardownChained$1.evaluate(TestRuleSetupTeardownChained.java:49)
	at org.apache.lucene.util.AbstractBeforeAfterRule$1.evaluate(AbstractBeforeAfterRule.java:45)
	at org.apache.lucene.util.TestRuleThreadAndTestName$1.evaluate(TestRuleThreadAndTestName.java:48)
	at org.apache.lucene.util.TestRuleIgnoreAfterMaxFailures$1.evaluate(TestRuleIgnoreAfterMaxFailures.java:64)
	at org.apache.lucene.util.TestRuleMarkFailure$1.evaluate(TestRuleMarkFailure.java:47)
	at com.carrotsearch.randomizedtesting.rules.StatementAdapter.evaluate(StatementAdapter.java:36)
	at com.carrotsearch.randomizedtesting.ThreadLeakControl$StatementRunner.run(ThreadLeakControl.java:368)
	at com.carrotsearch.randomizedtesting.ThreadLeakControl.forkTimeoutingTask(ThreadLeakControl.java:817)
	at com.carrotsearch.randomizedtesting.ThreadLeakControl$3.evaluate(ThreadLeakControl.java:468)
	at com.carrotsearch.randomizedtesting.RandomizedRunner.runSingleTest(RandomizedRunner.java:947)
	at com.carrotsearch.randomizedtesting.RandomizedRunner$5.evaluate(RandomizedRunner.java:832)
	at com.carrotsearch.randomizedtesting.RandomizedRunner$6.evaluate(RandomizedRunner.java:883)
	at com.carrotsearch.randomizedtesting.RandomizedRunner$7.evaluate(RandomizedRunner.java:894)
	at com.carrotsearch.randomizedtesting.rules.StatementAdapter.evaluate(StatementAdapter.java:36)
	at com.carrotsearch.randomizedtesting.rules.SystemPropertiesRestoreRule$1.evaluate(SystemPropertiesRestoreRule.java:57)
	at org.apache.lucene.util.AbstractBeforeAfterRule$1.evaluate(AbstractBeforeAfterRule.java:45)
	at com.carrotsearch.randomizedtesting.rules.StatementAdapter.evaluate(StatementAdapter.java:36)
	at org.apache.lucene.util.TestRuleStoreClassName$1.evaluate(TestRuleStoreClassName.java:41)
	at com.carrotsearch.randomizedtesting.rules.NoShadowingOrOverridesOnMethodsRule$1.evaluate(NoShadowingOrOverridesOnMethodsRule.java:40)
	at com.carrotsearch.randomizedtesting.rules.NoShadowingOrOverridesOnMethodsRule$1.evaluate(NoShadowingOrOverridesOnMethodsRule.java:40)
	at com.carrotsearch.randomizedtesting.rules.StatementAdapter.evaluate(StatementAdapter.java:36)
	at com.carrotsearch.randomizedtesting.rules.StatementAdapter.evaluate(StatementAdapter.java:36)
	at org.apache.lucene.util.TestRuleAssertionsRequired$1.evaluate(TestRuleAssertionsRequired.java:53)
	at org.apache.lucene.util.TestRuleMarkFailure$1.evaluate(TestRuleMarkFailure.java:47)
	at org.apache.lucene.util.TestRuleIgnoreAfterMaxFailures$1.evaluate(TestRuleIgnoreAfterMaxFailures.java:64)
	at org.apache.lucene.util.TestRuleIgnoreTestSuites$1.evaluate(TestRuleIgnoreTestSuites.java:54)
	at com.carrotsearch.randomizedtesting.rules.StatementAdapter.evaluate(StatementAdapter.java:36)
	at com.carrotsearch.randomizedtesting.ThreadLeakControl$StatementRunner.run(ThreadLeakControl.java:368)
	at java.base/java.lang.Thread.run(Thread.java:835)
Caused by: java.net.SocketTimeoutException: Read timed out
	at java.base/java.net.SocketInputStream.socketRead0(Native Method)
	at java.base/java.net.SocketInputStream.socketRead(SocketInputStream.java:115)
	at java.base/java.net.SocketInputStream.read(SocketInputStream.java:168)
	at java.base/java.net.SocketInputStream.read(SocketInputStream.java:140)
	at java.base/sun.security.ssl.SSLSocketInputRecord.read(SSLSocketInputRecord.java:448)
	at java.base/sun.security.ssl.SSLSocketInputRecord.bytesInCompletePacket(SSLSocketInputRecord.java:68)
	at java.base/sun.security.ssl.SSLSocketImpl.readApplicationRecord(SSLSocketImpl.java:1132)
	at java.base/sun.security.ssl.SSLSocketImpl$AppInputStream.read(SSLSocketImpl.java:828)
	at org.apache.http.impl.io.SessionInputBufferImpl.streamRead(SessionInputBufferImpl.java:137)
	at org.apache.http.impl.io.SessionInputBufferImpl.fillBuffer(SessionInputBufferImpl.java:153)
	at org.apache.http.impl.io.SessionInputBufferImpl.readLine(SessionInputBufferImpl.java:282)
	at org.apache.http.impl.conn.DefaultHttpResponseParser.parseHead(DefaultHttpResponseParser.java:138)
	at org.apache.http.impl.conn.DefaultHttpResponseParser.parseHead(DefaultHttpResponseParser.java:56)
	at org.apache.http.impl.io.AbstractMessageParser.parse(AbstractMessageParser.java:259)
	at org.apache.http.impl.DefaultBHttpClientConnection.receiveResponseHeader(DefaultBHttpClientConnection.java:163)
	at org.apache.http.impl.conn.CPoolProxy.receiveResponseHeader(CPoolProxy.java:165)
	at org.apache.http.protocol.HttpRequestExecutor.doReceiveResponse(HttpRequestExecutor.java:273)
	at org.apache.http.protocol.HttpRequestExecutor.execute(HttpRequestExecutor.java:125)
	at org.apache.http.impl.execchain.MainClientExec.execute(MainClientExec.java:272)
	at org.apache.http.impl.execchain.ProtocolExec.execute(ProtocolExec.java:185)
	at org.apache.http.impl.execchain.RetryExec.execute(RetryExec.java:89)
	at org.apache.http.impl.execchain.RedirectExec.execute(RedirectExec.java:110)
	at org.apache.http.impl.client.InternalHttpClient.doExecute(InternalHttpClient.java:185)
	at org.apache.http.impl.client.CloseableHttpClient.execute(CloseableHttpClient.java:83)
	at org.apache.http.impl.client.CloseableHttpClient.execute(CloseableHttpClient.java:56)
	at org.apache.solr.client.solrj.impl.HttpSolrClient.executeMethod(HttpSolrClient.java:555)
	... 49 more




Build Log:
[...truncated 2100 lines...]
   [junit4] JVM J0: stderr was not empty, see: /Users/jenkins/workspace/Lucene-Solr-8.x-MacOSX/lucene/build/core/test/temp/junit4-J0-20190702_172845_0805255054991394433859.syserr
   [junit4] >>> JVM J0 emitted unexpected output (verbatim) ----
   [junit4] OpenJDK 64-Bit Server VM warning: Option UseConcMarkSweepGC was deprecated in version 9.0 and will likely be removed in a future release.
   [junit4] <<< JVM J0: EOF ----

[...truncated 5 lines...]
   [junit4] JVM J1: stderr was not empty, see: /Users/jenkins/workspace/Lucene-Solr-8.x-MacOSX/lucene/build/core/test/temp/junit4-J1-20190702_172845_08012044351784148585428.syserr
   [junit4] >>> JVM J1 emitted unexpected output (verbatim) ----
   [junit4] OpenJDK 64-Bit Server VM warning: Option UseConcMarkSweepGC was deprecated in version 9.0 and will likely be removed in a future release.
   [junit4] <<< JVM J1: EOF ----

[...truncated 296 lines...]
   [junit4] JVM J0: stderr was not empty, see: /Users/jenkins/workspace/Lucene-Solr-8.x-MacOSX/lucene/build/test-framework/test/temp/junit4-J0-20190702_174012_6752038747862206950602.syserr
   [junit4] >>> JVM J0 emitted unexpected output (verbatim) ----
   [junit4] OpenJDK 64-Bit Server VM warning: Option UseConcMarkSweepGC was deprecated in version 9.0 and will likely be removed in a future release.
   [junit4] <<< JVM J0: EOF ----

[...truncated 3 lines...]
   [junit4] JVM J1: stderr was not empty, see: /Users/jenkins/workspace/Lucene-Solr-8.x-MacOSX/lucene/build/test-framework/test/temp/junit4-J1-20190702_174012_6752225016641937727239.syserr
   [junit4] >>> JVM J1 emitted unexpected output (verbatim) ----
   [junit4] OpenJDK 64-Bit Server VM warning: Option UseConcMarkSweepGC was deprecated in version 9.0 and will likely be removed in a future release.
   [junit4] <<< JVM J1: EOF ----

[...truncated 1087 lines...]
   [junit4] JVM J0: stderr was not empty, see: /Users/jenkins/workspace/Lucene-Solr-8.x-MacOSX/lucene/build/analysis/common/test/temp/junit4-J0-20190702_174132_5888128396568003272976.syserr
   [junit4] >>> JVM J0 emitted unexpected output (verbatim) ----
   [junit4] OpenJDK 64-Bit Server VM warning: Option UseConcMarkSweepGC was deprecated in version 9.0 and will likely be removed in a future release.
   [junit4] <<< JVM J0: EOF ----

[...truncated 3 lines...]
   [junit4] JVM J1: stderr was not empty, see: /Users/jenkins/workspace/Lucene-Solr-8.x-MacOSX/lucene/build/analysis/common/test/temp/junit4-J1-20190702_174132_5888406628401954870135.syserr
   [junit4] >>> JVM J1 emitted unexpected output (verbatim) ----
   [junit4] OpenJDK 64-Bit Server VM warning: Option UseConcMarkSweepGC was deprecated in version 9.0 and will likely be removed in a future release.
   [junit4] <<< JVM J1: EOF ----

[...truncated 256 lines...]
   [junit4] JVM J1: stderr was not empty, see: /Users/jenkins/workspace/Lucene-Solr-8.x-MacOSX/lucene/build/analysis/icu/test/temp/junit4-J1-20190702_174416_0383530766246386764023.syserr
   [junit4] >>> JVM J1 emitted unexpected output (verbatim) ----
   [junit4] OpenJDK 64-Bit Server VM warning: Option UseConcMarkSweepGC was deprecated in version 9.0 and will likely be removed in a future release.
   [junit4] <<< JVM J1: EOF ----

[...truncated 3 lines...]
   [junit4] JVM J0: stderr was not empty, see: /Users/jenkins/workspace/Lucene-Solr-8.x-MacOSX/lucene/build/analysis/icu/test/temp/junit4-J0-20190702_174416_037730608781863022532.syserr
   [junit4] >>> JVM J0 emitted unexpected output (verbatim) ----
   [junit4] OpenJDK 64-Bit Server VM warning: Option UseConcMarkSweepGC was deprecated in version 9.0 and will likely be removed in a future release.
   [junit4] <<< JVM J0: EOF ----

[...truncated 228 lines...]
   [junit4] JVM J1: stderr was not empty, see: /Users/jenkins/workspace/Lucene-Solr-8.x-MacOSX/lucene/build/analysis/kuromoji/test/temp/junit4-J1-20190702_174431_9141510531164268049254.syserr
   [junit4] >>> JVM J1 emitted unexpected output (verbatim) ----
   [junit4] OpenJDK 64-Bit Server VM warning: Option UseConcMarkSweepGC was deprecated in version 9.0 and will likely be removed in a future release.
   [junit4] <<< JVM J1: EOF ----

   [junit4] JVM J0: stderr was not empty, see: /Users/jenkins/workspace/Lucene-Solr-8.x-MacOSX/lucene/build/analysis/kuromoji/test/temp/junit4-J0-20190702_174431_91415702481030121039731.syserr
   [junit4] >>> JVM J0 emitted unexpected output (verbatim) ----
   [junit4] OpenJDK 64-Bit Server VM warning: Option UseConcMarkSweepGC was deprecated in version 9.0 and will likely be removed in a future release.
   [junit4] <<< JVM J0: EOF ----

[...truncated 162 lines...]
   [junit4] JVM J0: stderr was not empty, see: /Users/jenkins/workspace/Lucene-Solr-8.x-MacOSX/lucene/build/analysis/morfologik/test/temp/junit4-J0-20190702_174511_2128222132842708543313.syserr
   [junit4] >>> JVM J0 emitted unexpected output (verbatim) ----
   [junit4] OpenJDK 64-Bit Server VM warning: Option UseConcMarkSweepGC was deprecated in version 9.0 and will likely be removed in a future release.
   [junit4] <<< JVM J0: EOF ----

[...truncated 3 lines...]
   [junit4] JVM J1: stderr was not empty, see: /Users/jenkins/workspace/Lucene-Solr-8.x-MacOSX/lucene/build/analysis/morfologik/test/temp/junit4-J1-20190702_174511_21212509421436624506240.syserr
   [junit4] >>> JVM J1 emitted unexpected output (verbatim) ----
   [junit4] OpenJDK 64-Bit Server VM warning: Option UseConcMarkSweepGC was deprecated in version 9.0 and will likely be removed in a future release.
   [junit4] <<< JVM J1: EOF ----

[...truncated 216 lines...]
   [junit4] JVM J0: stderr was not empty, see: /Users/jenkins/workspace/Lucene-Solr-8.x-MacOSX/lucene/build/analysis/nori/test/temp/junit4-J0-20190702_174522_4993789311347420462429.syserr
   [junit4] >>> JVM J0 emitted unexpected output (verbatim) ----
   [junit4] OpenJDK 64-Bit Server VM warning: Option UseConcMarkSweepGC was deprecated in version 9.0 and will likely be removed in a future release.
   [junit4] <<< JVM J0: EOF ----

[...truncated 3 lines...]
   [junit4] JVM J1: stderr was not empty, see: /Users/jenkins/workspace/Lucene-Solr-8.x-MacOSX/lucene/build/analysis/nori/test/temp/junit4-J1-20190702_174522_4993886271689467082344.syserr
   [junit4] >>> JVM J1 emitted unexpected output (verbatim) ----
   [junit4] OpenJDK 64-Bit Server VM warning: Option UseConcMarkSweepGC was deprecated in version 9.0 and will likely be removed in a future release.
   [junit4] <<< JVM J1: EOF ----

[...truncated 171 lines...]
   [junit4] JVM J1: stderr was not empty, see: /Users/jenkins/workspace/Lucene-Solr-8.x-MacOSX/lucene/build/analysis/opennlp/test/temp/junit4-J1-20190702_174544_44816007705876305124403.syserr
   [junit4] >>> JVM J1 emitted unexpected output (verbatim) ----
   [junit4] OpenJDK 64-Bit Server VM warning: Option UseConcMarkSweepGC was deprecated in version 9.0 and will likely be removed in a future release.
   [junit4] <<< JVM J1: EOF ----

   [junit4] JVM J0: stderr was not empty, see: /Users/jenkins/workspace/Lucene-Solr-8.x-MacOSX/lucene/build/analysis/opennlp/test/temp/junit4-J0-20190702_174544_4482951093009904574067.syserr
   [junit4] >>> JVM J0 emitted unexpected output (verbatim) ----
   [junit4] OpenJDK 64-Bit Server VM warning: Option UseConcMarkSweepGC was deprecated in version 9.0 and will likely be removed in a future release.
   [junit4] <<< JVM J0: EOF ----

[...truncated 176 lines...]
   [junit4] JVM J0: stderr was not empty, see: /Users/jenkins/workspace/Lucene-Solr-8.x-MacOSX/lucene/build/analysis/phonetic/test/temp/junit4-J0-20190702_174551_62515005576310114695568.syserr
   [junit4] >>> JVM J0 emitted unexpected output (verbatim) ----
   [junit4] OpenJDK 64-Bit Server VM warning: Option UseConcMarkSweepGC was deprecated in version 9.0 and will likely be removed in a future release.
   [junit4] <<< JVM J0: EOF ----

[...truncated 3 lines...]
   [junit4] JVM J1: stderr was not empty, see: /Users/jenkins/workspace/Lucene-Solr-8.x-MacOSX/lucene/build/analysis/phonetic/test/temp/junit4-J1-20190702_174551_6253697658444059101096.syserr
   [junit4] >>> JVM J1 emitted unexpected output (verbatim) ----
   [junit4] OpenJDK 64-Bit Server VM warning: Option UseConcMarkSweepGC was deprecated in version 9.0 and will likely be removed in a future release.
   [junit4] <<< JVM J1: EOF ----

[...truncated 159 lines...]
   [junit4] JVM J0: stderr was not empty, see: /Users/jenkins/workspace/Lucene-Solr-8.x-MacOSX/lucene/build/analysis/smartcn/test/temp/junit4-J0-20190702_174610_1127523736755334967785.syserr
   [junit4] >>> JVM J0 emitted unexpected output (verbatim) ----
   [junit4] OpenJDK 64-Bit Server VM warning: Option UseConcMarkSweepGC was deprecated in version 9.0 and will likely be removed in a future release.
   [junit4] <<< JVM J0: EOF ----

[...truncated 3 lines...]
   [junit4] JVM J1: stderr was not empty, see: /Users/jenkins/workspace/Lucene-Solr-8.x-MacOSX/lucene/build/analysis/smartcn/test/temp/junit4-J1-20190702_174610_11215059197114729544418.syserr
   [junit4] >>> JVM J1 emitted unexpected output (verbatim) ----
   [junit4] OpenJDK 64-Bit Server VM warning: Option UseConcMarkSweepGC was deprecated in version 9.0 and will likely be removed in a future release.
   [junit4] <<< JVM J1: EOF ----

[...truncated 164 lines...]
   [junit4] JVM J0: stderr was not empty, see: /Users/jenkins/workspace/Lucene-Solr-8.x-MacOSX/lucene/build/analysis/stempel/test/temp/junit4-J0-20190702_174622_07311841946115682576250.syserr
   [junit4] >>> JVM J0 emitted unexpected output (verbatim) ----
   [junit4] OpenJDK 64-Bit Server VM warning: Option UseConcMarkSweepGC was deprecated in version 9.0 and will likely be removed in a future release.
   [junit4] <<< JVM J0: EOF ----

[...truncated 3 lines...]
   [junit4] JVM J1: stderr was not empty, see: /Users/jenkins/workspace/Lucene-Solr-8.x-MacOSX/lucene/build/analysis/stempel/test/temp/junit4-J1-20190702_174622_07315471680589882955648.syserr
   [junit4] >>> JVM J1 emitted unexpected output (verbatim) ----
   [junit4] OpenJDK 64-Bit Server VM warning: Option UseConcMarkSweepGC was deprecated in version 9.0 and will likely be removed in a future release.
   [junit4] <<< JVM J1: EOF ----

[...truncated 193 lines...]
   [junit4] JVM J0: stderr was not empty, see: /Users/jenkins/workspace/Lucene-Solr-8.x-MacOSX/lucene/build/backward-codecs/test/temp/junit4-J0-20190702_174629_24213031569179737506507.syserr
   [junit4] >>> JVM J0 emitted unexpected output (verbatim) ----
   [junit4] OpenJDK 64-Bit Server VM warning: Option UseConcMarkSweepGC was deprecated in version 9.0 and will likely be removed in a future release.
   [junit4] <<< JVM J0: EOF ----

[...truncated 9 lines...]
   [junit4] JVM J1: stderr was not empty, see: /Users/jenkins/workspace/Lucene-Solr-8.x-MacOSX/lucene/build/backward-codecs/test/temp/junit4-J1-20190702_174629_2426377181453173198717.syserr
   [junit4] >>> JVM J1 emitted unexpected output (verbatim) ----
   [junit4] OpenJDK 64-Bit Server VM warning: Option UseConcMarkSweepGC was deprecated in version 9.0 and will likely be removed in a future release.
   [junit4] <<< JVM J1: EOF ----

[...truncated 1556 lines...]
   [junit4] JVM J0: stderr was not empty, see: /Users/jenkins/workspace/Lucene-Solr-8.x-MacOSX/lucene/build/benchmark/test/temp/junit4-J0-20190702_174834_1866299412938760255495.syserr
   [junit4] >>> JVM J0 emitted unexpected output (verbatim) ----
   [junit4] OpenJDK 64-Bit Server VM warning: Option UseConcMarkSweepGC was deprecated in version 9.0 and will likely be removed in a future release.
   [junit4] <<< JVM J0: EOF ----

[...truncated 3 lines...]
   [junit4] JVM J1: stderr was not empty, see: /Users/jenkins/workspace/Lucene-Solr-8.x-MacOSX/lucene/build/benchmark/test/temp/junit4-J1-20190702_174834_1868846199897079684466.syserr
   [junit4] >>> JVM J1 emitted unexpected output (verbatim) ----
   [junit4] OpenJDK 64-Bit Server VM warning: Option UseConcMarkSweepGC was deprecated in version 9.0 and will likely be removed in a future release.
   [junit4] <<< JVM J1: EOF ----

[...truncated 251 lines...]
   [junit4] JVM J0: stderr was not empty, see: /Users/jenkins/workspace/Lucene-Solr-8.x-MacOSX/lucene/build/classification/test/temp/junit4-J0-20190702_174847_06410092997389571826185.syserr
   [junit4] >>> JVM J0 emitted unexpected output (verbatim) ----
   [junit4] OpenJDK 64-Bit Server VM warning: Option UseConcMarkSweepGC was deprecated in version 9.0 and will likely be removed in a future release.
   [junit4] <<< JVM J0: EOF ----

[...truncated 3 lines...]
   [junit4] JVM J1: stderr was not empty, see: /Users/jenkins/workspace/Lucene-Solr-8.x-MacOSX/lucene/build/classification/test/temp/junit4-J1-20190702_174847_06515179116322486781476.syserr
   [junit4] >>> JVM J1 emitted unexpected output (verbatim) ----
   [junit4] OpenJDK 64-Bit Server VM warning: Option UseConcMarkSweepGC was deprecated in version 9.0 and will likely be removed in a future release.
   [junit4] <<< JVM J1: EOF ----

[...truncated 261 lines...]
   [junit4] JVM J0: stderr was not empty, see: /Users/jenkins/workspace/Lucene-Solr-8.x-MacOSX/lucene/build/codecs/test/temp/junit4-J0-20190702_174907_2069746589761915389227.syserr
   [junit4] >>> JVM J0 emitted unexpected output (verbatim) ----
   [junit4] OpenJDK 64-Bit Server VM warning: Option UseConcMarkSweepGC was deprecated in version 9.0 and will likely be removed in a future release.
   [junit4] <<< JVM J0: EOF ----

[...truncated 3 lines...]
   [junit4] JVM J1: stderr was not empty, see: /Users/jenkins/workspace/Lucene-Solr-8.x-MacOSX/lucene/build/codecs/test/temp/junit4-J1-20190702_174907_20614863340029898032712.syserr
   [junit4] >>> JVM J1 emitted unexpected output (verbatim) ----
   [junit4] OpenJDK 64-Bit Server VM warning: Option UseConcMarkSweepGC was deprecated in version 9.0 and will likely be removed in a future release.
   [junit4] <<< JVM J1: EOF ----

[...truncated 234 lines...]
   [junit4] JVM J0: stderr was not empty, see: /Users/jenkins/workspace/Lucene-Solr-8.x-MacOSX/lucene/build/demo/test/temp/junit4-J0-20190702_175129_34316306751111008851152.syserr
   [junit4] >>> JVM J0 emitted unexpected output (verbatim) ----
   [junit4] OpenJDK 64-Bit Server VM warning: Option UseConcMarkSweepGC was deprecated in version 9.0 and will likely be removed in a future release.
   [junit4] <<< JVM J0: EOF ----

   [junit4] JVM J1: stderr was not empty, see: /Users/jenkins/workspace/Lucene-Solr-8.x-MacOSX/lucene/build/demo/test/temp/junit4-J1-20190702_175129_3434851443392223764482.syserr
   [junit4] >>> JVM J1 emitted unexpected output (verbatim) ----
   [junit4] OpenJDK 64-Bit Server VM warning: Option UseConcMarkSweepGC was deprecated in version 9.0 and will likely be removed in a future release.
   [junit4] <<< JVM J1: EOF ----

[...truncated 173 lines...]
   [junit4] JVM J1: stderr was not empty, see: /Users/jenkins/workspace/Lucene-Solr-8.x-MacOSX/lucene/build/expressions/test/temp/junit4-J1-20190702_175135_3585200026809694891973.syserr
   [junit4] >>> JVM J1 emitted unexpected output (verbatim) ----
   [junit4] OpenJDK 64-Bit Server VM warning: Option UseConcMarkSweepGC was deprecated in version 9.0 and will likely be removed in a future release.
   [junit4] <<< JVM J1: EOF ----

[...truncated 3 lines...]
   [junit4] JVM J0: stderr was not empty, see: /Users/jenkins/workspace/Lucene-Solr-8.x-MacOSX/lucene/build/expressions/test/temp/junit4-J0-20190702_175135_3583786255625275578997.syserr
   [junit4] >>> JVM J0 emitted unexpected output (verbatim) ----
   [junit4] OpenJDK 64-Bit Server VM warning: Option UseConcMarkSweepGC was deprecated in version 9.0 and will likely be removed in a future release.
   [junit4] <<< JVM J0: EOF ----

[...truncated 234 lines...]
   [junit4] JVM J0: stderr was not empty, see: /Users/jenkins/workspace/Lucene-Solr-8.x-MacOSX/lucene/build/facet/test/temp/junit4-J0-20190702_175145_2077509944314791686542.syserr
   [junit4] >>> JVM J0 emitted unexpected output (verbatim) ----
   [junit4] OpenJDK 64-Bit Server VM warning: Option UseConcMarkSweepGC was deprecated in version 9.0 and will likely be removed in a future release.
   [junit4] <<< JVM J0: EOF ----

[...truncated 3 lines...]
   [junit4] JVM J1: stderr was not empty, see: /Users/jenkins/workspace/Lucene-Solr-8.x-MacOSX/lucene/build/facet/test/temp/junit4-J1-20190702_175145_20816947341451660130448.syserr
   [junit4] >>> JVM J1 emitted unexpected output (verbatim) ----
   [junit4] OpenJDK 64-Bit Server VM warning: Option UseConcMarkSweepGC was deprecated in version 9.0 and will likely be removed in a future release.
   [junit4] <<< JVM J1: EOF ----

[...truncated 182 lines...]
   [junit4] JVM J0: stderr was not empty, see: /Users/jenkins/workspace/Lucene-Solr-8.x-MacOSX/lucene/build/grouping/test/temp/junit4-J0-20190702_175232_5934222371140387538174.syserr
   [junit4] >>> JVM J0 emitted unexpected output (verbatim) ----
   [junit4] OpenJDK 64-Bit Server VM warning: Option UseConcMarkSweepGC was deprecated in version 9.0 and will likely be removed in a future release.
   [junit4] <<< JVM J0: EOF ----

[...truncated 3 lines...]
   [junit4] JVM J1: stderr was not empty, see: /Users/jenkins/workspace/Lucene-Solr-8.x-MacOSX/lucene/build/grouping/test/temp/junit4-J1-20190702_175232_59311543645817671353684.syserr
   [junit4] >>> JVM J1 emitted unexpected output (verbatim) ----
   [junit4] OpenJDK 64-Bit Server VM warning: Option UseConcMarkSweepGC was deprecated in version 9.0 and will likely be removed in a future release.
   [junit4] <<< JVM J1: EOF ----

[...truncated 255 lines...]
   [junit4] JVM J0: stderr was not empty, see: /Users/jenkins/workspace/Lucene-Solr-8.x-MacOSX/lucene/build/highlighter/test/temp/junit4-J0-20190702_175243_9077410944910078748328.syserr
   [junit4] >>> JVM J0 emitted unexpected output (verbatim) ----
   [junit4] OpenJDK 64-Bit Server VM warning: Option UseConcMarkSweepGC was deprecated in version 9.0 and will likely be removed in a future release.
   [junit4] <<< JVM J0: EOF ----

[...truncated 3 lines...]
   [junit4] JVM J1: stderr was not empty, see: /Users/jenkins/workspace/Lucene-Solr-8.x-MacOSX/lucene/build/highlighter/test/temp/junit4-J1-20190702_175243_9078265826325818707680.syserr
   [junit4] >>> JVM J1 emitted unexpected output (verbatim) ----
   [junit4] OpenJDK 64-Bit Server VM warning: Option UseConcMarkSweepGC was deprecated in version 9.0 and will likely be removed in a future release.
   [junit4] <<< JVM J1: EOF ----

[...truncated 163 lines...]
   [junit4] JVM J1: stderr was not empty, see: /Users/jenkins/workspace/Lucene-Solr-8.x-MacOSX/lucene/build/join/test/temp/junit4-J1-20190702_175313_61315997973099251552944.syserr
   [junit4] >>> JVM J1 emitted unexpected output (verbatim) ----
   [junit4] OpenJDK 64-Bit Server VM warning: Option UseConcMarkSweepGC was deprecated in version 9.0 and will likely be removed in a future release.
   [junit4] <<< JVM J1: EOF ----

[...truncated 9 lines...]
   [junit4] JVM J0: stderr was not empty, see: /Users/jenkins/workspace/Lucene-Solr-8.x-MacOSX/lucene/build/join/test/temp/junit4-J0-20190702_175313_6136888648160198431681.syserr
   [junit4] >>> JVM J0 emitted unexpected output (verbatim) ----
   [junit4] OpenJDK 64-Bit Server VM warning: Option UseConcMarkSweepGC was deprecated in version 9.0 and will likely be removed in a future release.
   [junit4] <<< JVM J0: EOF ----

[...truncated 305 lines...]
   [junit4] JVM J0: stderr was not empty, see: /Users/jenkins/workspace/Lucene-Solr-8.x-MacOSX/lucene/build/luke/test/temp/junit4-J0-20190702_175335_5332051369289856332073.syserr
   [junit4] >>> JVM J0 emitted unexpected output (verbatim) ----
   [junit4] OpenJDK 64-Bit Server VM warning: Option UseConcMarkSweepGC was deprecated in version 9.0 and will likely be removed in a future release.
   [junit4] <<< JVM J0: EOF ----

   [junit4] JVM J1: stderr was not empty, see: /Users/jenkins/workspace/Lucene-Solr-8.x-MacOSX/lucene/build/luke/test/temp/junit4-J1-20190702_175335_533959391555218067218.syserr
   [junit4] >>> JVM J1 emitted unexpected output (verbatim) ----
   [junit4] OpenJDK 64-Bit Server VM warning: Option UseConcMarkSweepGC was deprecated in version 9.0 and will likely be removed in a future release.
   [junit4] <<< JVM J1: EOF ----

[...truncated 155 lines...]
   [junit4] JVM J0: stderr was not empty, see: /Users/jenkins/workspace/Lucene-Solr-8.x-MacOSX/lucene/build/memory/test/temp/junit4-J0-20190702_175349_89811024194733280939570.syserr
   [junit4] >>> JVM J0 emitted unexpected output (verbatim) ----
   [junit4] OpenJDK 64-Bit Server VM warning: Option UseConcMarkSweepGC was deprecated in version 9.0 and will likely be removed in a future release.
   [junit4] <<< JVM J0: EOF ----

[...truncated 3 lines...]
   [junit4] JVM J1: stderr was not empty, see: /Users/jenkins/workspace/Lucene-Solr-8.x-MacOSX/lucene/build/memory/test/temp/junit4-J1-20190702_175349_89912310298743945561822.syserr
   [junit4] >>> JVM J1 emitted unexpected output (verbatim) ----
   [junit4] OpenJDK 64-Bit Server VM warning: Option UseConcMarkSweepGC was deprecated in version 9.0 and will likely be removed in a future release.
   [junit4] <<< JVM J1: EOF ----

[...truncated 190 lines...]
   [junit4] JVM J0: stderr was not empty, see: /Users/jenkins/workspace/Lucene-Solr-8.x-MacOSX/lucene/build/misc/test/temp/junit4-J0-20190702_175359_68917921873476317079974.syserr
   [junit4] >>> JVM J0 emitted unexpected output (verbatim) ----
   [junit4] OpenJDK 64-Bit Server VM warning: Option UseConcMarkSweepGC was deprecated in version 9.0 and will likely be removed in a future release.
   [junit4] <<< JVM J0: EOF ----

[...truncated 6 lines...]
   [junit4] JVM J1: stderr was not empty, see: /Users/jenkins/workspace/Lucene-Solr-8.x-MacOSX/lucene/build/misc/test/temp/junit4-J1-20190702_175359_6893000822667742167137.syserr
   [junit4] >>> JVM J1 emitted unexpected output (verbatim) ----
   [junit4] OpenJDK 64-Bit Server VM warning: Option UseConcMarkSweepGC was deprecated in version 9.0 and will likely be removed in a future release.
   [junit4] <<< JVM J1: EOF ----

[...truncated 261 lines...]
   [junit4] JVM J1: stderr was not empty, see: /Users/jenkins/workspace/Lucene-Solr-8.x-MacOSX/lucene/build/monitor/test/temp/junit4-J1-20190702_175452_19212433093685601052076.syserr
   [junit4] >>> JVM J1 emitted unexpected output (verbatim) ----
   [junit4] OpenJDK 64-Bit Server VM warning: Option UseConcMarkSweepGC was deprecated in version 9.0 and will likely be removed in a future release.
   [junit4] <<< JVM J1: EOF ----

   [junit4] JVM J0: stderr was not empty, see: /Users/jenkins/workspace/Lucene-Solr-8.x-MacOSX/lucene/build/monitor/test/temp/junit4-J0-20190702_175452_1903372107520508532214.syserr
   [junit4] >>> JVM J0 emitted unexpected output (verbatim) ----
   [junit4] OpenJDK 64-Bit Server VM warning: Option UseConcMarkSweepGC was deprecated in version 9.0 and will likely be removed in a future release.
   [junit4] <<< JVM J0: EOF ----

[...truncated 321 lines...]
   [junit4] JVM J0: stderr was not empty, see: /Users/jenkins/workspace/Lucene-Solr-8.x-MacOSX/lucene/build/queries/test/temp/junit4-J0-20190702_175509_28310611242109954942490.syserr
   [junit4] >>> JVM J0 emitted unexpected output (verbatim) ----
   [junit4] OpenJDK 64-Bit Server VM warning: Option UseConcMarkSweepGC was deprecated in version 9.0 and will likely be removed in a future release.
   [junit4] <<< JVM J0: EOF ----

[...truncated 3 lines...]
   [junit4] JVM J1: stderr was not empty, see: /Users/jenkins/workspace/Lucene-Solr-8.x-MacOSX/lucene/build/queries/test/temp/junit4-J1-20190702_175509_2839340252147819225647.syserr
   [junit4] >>> JVM J1 emitted unexpected output (verbatim) ----
   [junit4] OpenJDK 64-Bit Server VM warning: Option UseConcMarkSweepGC was deprecated in version 9.0 and will likely be removed in a future release.
   [junit4] <<< JVM J1: EOF ----

[...truncated 231 lines...]
   [junit4] JVM J0: stderr was not empty, see: /Users/jenkins/workspace/Lucene-Solr-8.x-MacOSX/lucene/build/queryparser/test/temp/junit4-J0-20190702_175530_5541454250406870505112.syserr
   [junit4] >>> JVM J0 emitted unexpected output (verbatim) ----
   [junit4] OpenJDK 64-Bit Server VM warning: Option UseConcMarkSweepGC was deprecated in version 9.0 and will likely be removed in a future release.
   [junit4] <<< JVM J0: EOF ----

[...truncated 3 lines...]
   [junit4] JVM J1: stderr was not empty, see: /Users/jenkins/workspace/Lucene-Solr-8.x-MacOSX/lucene/build/queryparser/test/temp/junit4-J1-20190702_175530_55414301392206518226005.syserr
   [junit4] >>> JVM J1 emitted unexpected output (verbatim) ----
   [junit4] OpenJDK 64-Bit Server VM warning: Option UseConcMarkSweepGC was deprecated in version 9.0 and will likely be removed in a future release.
   [junit4] <<< JVM J1: EOF ----

[...truncated 216 lines...]
   [junit4] JVM J0: stderr was not empty, see: /Users/jenkins/workspace/Lucene-Solr-8.x-MacOSX/lucene/build/replicator/test/temp/junit4-J0-20190702_175550_4742248251964792178013.syserr
   [junit4] >>> JVM J0 emitted unexpected output (verbatim) ----
   [junit4] OpenJDK 64-Bit Server VM warning: Option UseConcMarkSweepGC was deprecated in version 9.0 and will likely be removed in a future release.
   [junit4] <<< JVM J0: EOF ----

[...truncated 3 lines...]
   [junit4] JVM J1: stderr was not empty, see: /Users/jenkins/workspace/Lucene-Solr-8.x-MacOSX/lucene/build/replicator/test/temp/junit4-J1-20190702_175550_4817724704083820342338.syserr
   [junit4] >>> JVM J1 emitted unexpected output (verbatim) ----
   [junit4] OpenJDK 64-Bit Server VM warning: Option UseConcMarkSweepGC was deprecated in version 9.0 and will likely be removed in a future release.
   [junit4] <<< JVM J1: EOF ----

[...truncated 241 lines...]
   [junit4] JVM J1: stderr was not empty, see: /Users/jenkins/workspace/Lucene-Solr-8.x-MacOSX/lucene/build/sandbox/test/temp/junit4-J1-20190702_175614_5169575739826052746109.syserr
   [junit4] >>> JVM J1 emitted unexpected output (verbatim) ----
   [junit4] OpenJDK 64-Bit Server VM warning: Option UseConcMarkSweepGC was deprecated in version 9.0 and will likely be removed in a future release.
   [junit4] <<< JVM J1: EOF ----

   [junit4] JVM J0: stderr was not empty, see: /Users/jenkins/workspace/Lucene-Solr-8.x-MacOSX/lucene/build/sandbox/test/temp/junit4-J0-20190702_175614_51217366402499519380762.syserr
   [junit4] >>> JVM J0 emitted unexpected output (verbatim) ----
   [junit4] OpenJDK 64-Bit Server VM warning: Option UseConcMarkSweepGC was deprecated in version 9.0 and will likely be removed in a future release.
   [junit4] <<< JVM J0: EOF ----

[...truncated 299 lines...]
   [junit4] JVM J1: stderr was not empty, see: /Users/jenkins/workspace/Lucene-Solr-8.x-MacOSX/lucene/build/spatial-extras/test/temp/junit4-J1-20190702_175706_8971047703514641367058.syserr
   [junit4] >>> JVM J1 emitted unexpected output (verbatim) ----
   [junit4] OpenJDK 64-Bit Server VM warning: Option UseConcMarkSweepGC was deprecated in version 9.0 and will likely be removed in a future release.
   [junit4] <<< JVM J1: EOF ----

[...truncated 3 lines...]
   [junit4] JVM J0: stderr was not empty, see: /Users/jenkins/workspace/Lucene-Solr-8.x-MacOSX/lucene/build/spatial-extras/test/temp/junit4-J0-20190702_175706_89713412536375621075311.syserr
   [junit4] >>> JVM J0 emitted unexpected output (verbatim) ----
   [junit4] OpenJDK 64-Bit Server VM warning: Option UseConcMarkSweepGC was deprecated in version 9.0 and will likely be removed in a future release.
   [junit4] <<< JVM J0: EOF ----

[...truncated 151 lines...]
   [junit4] JVM J0: stderr was not empty, see: /Users/jenkins/workspace/Lucene-Solr-8.x-MacOSX/lucene/build/spatial/test/temp/junit4-J0-20190702_175751_3025900526963700892666.syserr
   [junit4] >>> JVM J0 emitted unexpected output (verbatim) ----
   [junit4] OpenJDK 64-Bit Server VM warning: Option UseConcMarkSweepGC was deprecated in version 9.0 and will likely be removed in a future release.
   [junit4] <<< JVM J0: EOF ----

[...truncated 174 lines...]
   [junit4] JVM J0: stderr was not empty, see: /Users/jenkins/workspace/Lucene-Solr-8.x-MacOSX/lucene/build/spatial3d/test/temp/junit4-J0-20190702_175754_2209937494681683825646.syserr
   [junit4] >>> JVM J0 emitted unexpected output (verbatim) ----
   [junit4] OpenJDK 64-Bit Server VM warning: Option UseConcMarkSweepGC was deprecated in version 9.0 and will likely be removed in a future release.
   [junit4] <<< JVM J0: EOF ----

[...truncated 17 lines...]
   [junit4] JVM J1: stderr was not empty, see: /Users/jenkins/workspace/Lucene-Solr-8.x-MacOSX/lucene/build/spatial3d/test/temp/junit4-J1-20190702_175754_2248094180039092714079.syserr
   [junit4] >>> JVM J1 emitted unexpected output (verbatim) ----
   [junit4] OpenJDK 64-Bit Server VM warning: Option UseConcMarkSweepGC was deprecated in version 9.0 and will likely be removed in a future release.
   [junit4] <<< JVM J1: EOF ----

[...truncated 261 lines...]
   [junit4] JVM J0: stderr was not empty, see: /Users/jenkins/workspace/Lucene-Solr-8.x-MacOSX/lucene/build/suggest/test/temp/junit4-J0-20190702_175819_6138016399775469758175.syserr
   [junit4] >>> JVM J0 emitted unexpected output (verbatim) ----
   [junit4] OpenJDK 64-Bit Server VM warning: Option UseConcMarkSweepGC was deprecated in version 9.0 and will likely be removed in a future release.
   [junit4] <<< JVM J0: EOF ----

[...truncated 3 lines...]
   [junit4] JVM J1: stderr was not empty, see: /Users/jenkins/workspace/Lucene-Solr-8.x-MacOSX/lucene/build/suggest/test/temp/junit4-J1-20190702_175819_6132364631200924710399.syserr
   [junit4] >>> JVM J1 emitted unexpected output (verbatim) ----
   [junit4] OpenJDK 64-Bit Server VM warning: Option UseConcMarkSweepGC was deprecated in version 9.0 and will likely be removed in a future release.
   [junit4] <<< JVM J1: EOF ----

[...truncated 3269 lines...]
   [junit4] Suite: org.apache.solr.cloud.DeleteReplicaTest
   [junit4]   2> 2324943 INFO  (SUITE-DeleteReplicaTest-seed#[17D2A2A6F4337909]-worker) [     ] o.a.s.SolrTestCaseJ4 SecureRandom sanity checks: test.solr.allowed.securerandom=null & java.security.egd=file:/dev/./urandom
   [junit4]   2> Creating dataDir: /Users/jenkins/workspace/Lucene-Solr-8.x-MacOSX/solr/build/solr-core/test/J0/temp/solr.cloud.DeleteReplicaTest_17D2A2A6F4337909-001/init-core-data-001
   [junit4]   2> 2324943 WARN  (SUITE-DeleteReplicaTest-seed#[17D2A2A6F4337909]-worker) [     ] o.a.s.SolrTestCaseJ4 startTrackingSearchers: numOpens=4 numCloses=4
   [junit4]   2> 2324944 INFO  (SUITE-DeleteReplicaTest-seed#[17D2A2A6F4337909]-worker) [     ] o.a.s.SolrTestCaseJ4 Using PointFields (NUMERIC_POINTS_SYSPROP=true) w/NUMERIC_DOCVALUES_SYSPROP=false
   [junit4]   2> 2324944 INFO  (SUITE-DeleteReplicaTest-seed#[17D2A2A6F4337909]-worker) [     ] o.a.s.SolrTestCaseJ4 Randomized ssl (true) and clientAuth (false) via: @org.apache.solr.util.RandomizeSSL(reason="", value=0.0/0.0, ssl=0.0/0.0, clientAuth=0.0/0.0) w/ MAC_OS_X supressed clientAuth
   [junit4]   2> 2324948 INFO  (TEST-DeleteReplicaTest.raceConditionOnDeleteAndRegisterReplica-seed#[17D2A2A6F4337909]) [     ] o.a.s.SolrTestCaseJ4 ###Starting raceConditionOnDeleteAndRegisterReplica
   [junit4]   2> 2324948 INFO  (TEST-DeleteReplicaTest.raceConditionOnDeleteAndRegisterReplica-seed#[17D2A2A6F4337909]) [     ] o.a.s.c.MiniSolrCloudCluster Starting cluster of 4 servers in /Users/jenkins/workspace/Lucene-Solr-8.x-MacOSX/solr/build/solr-core/test/J0/temp/solr.cloud.DeleteReplicaTest_17D2A2A6F4337909-001/tempDir-001
   [junit4]   2> 2324948 INFO  (TEST-DeleteReplicaTest.raceConditionOnDeleteAndRegisterReplica-seed#[17D2A2A6F4337909]) [     ] o.a.s.c.ZkTestServer STARTING ZK TEST SERVER
   [junit4]   2> 2324949 INFO  (ZkTestServer Run Thread) [     ] o.a.s.c.ZkTestServer client port:0.0.0.0/0.0.0.0:0
   [junit4]   2> 2324949 INFO  (ZkTestServer Run Thread) [     ] o.a.s.c.ZkTestServer Starting server
   [junit4]   2> 2325049 INFO  (TEST-DeleteReplicaTest.raceConditionOnDeleteAndRegisterReplica-seed#[17D2A2A6F4337909]) [     ] o.a.s.c.ZkTestServer start zk server on port:56400
   [junit4]   2> 2325049 INFO  (TEST-DeleteReplicaTest.raceConditionOnDeleteAndRegisterReplica-seed#[17D2A2A6F4337909]) [     ] o.a.s.c.ZkTestServer parse host and port list: 127.0.0.1:56400
   [junit4]   2> 2325049 INFO  (TEST-DeleteReplicaTest.raceConditionOnDeleteAndRegisterReplica-seed#[17D2A2A6F4337909]) [     ] o.a.s.c.ZkTestServer connecting to 127.0.0.1 56400
   [junit4]   2> 2325051 INFO  (TEST-DeleteReplicaTest.raceConditionOnDeleteAndRegisterReplica-seed#[17D2A2A6F4337909]) [     ] o.a.s.c.c.ConnectionManager Waiting for client to connect to ZooKeeper
   [junit4]   2> 2325066 INFO  (zkConnectionManagerCallback-13537-thread-1) [     ] o.a.s.c.c.ConnectionManager zkClient has connected
   [junit4]   2> 2325066 INFO  (TEST-DeleteReplicaTest.raceConditionOnDeleteAndRegisterReplica-seed#[17D2A2A6F4337909]) [     ] o.a.s.c.c.ConnectionManager Client is connected to ZooKeeper
   [junit4]   2> 2325069 INFO  (TEST-DeleteReplicaTest.raceConditionOnDeleteAndRegisterReplica-seed#[17D2A2A6F4337909]) [     ] o.a.s.c.c.ConnectionManager Waiting for client to connect to ZooKeeper
   [junit4]   2> 2325072 INFO  (zkConnectionManagerCallback-13539-thread-1) [     ] o.a.s.c.c.ConnectionManager zkClient has connected
   [junit4]   2> 2325072 INFO  (TEST-DeleteReplicaTest.raceConditionOnDeleteAndRegisterReplica-seed#[17D2A2A6F4337909]) [     ] o.a.s.c.c.ConnectionManager Client is connected to ZooKeeper
   [junit4]   2> 2325073 INFO  (TEST-DeleteReplicaTest.raceConditionOnDeleteAndRegisterReplica-seed#[17D2A2A6F4337909]) [     ] o.a.s.c.c.ConnectionManager Waiting for client to connect to ZooKeeper
   [junit4]   2> 2325075 INFO  (zkConnectionManagerCallback-13541-thread-1) [     ] o.a.s.c.c.ConnectionManager zkClient has connected
   [junit4]   2> 2325075 INFO  (TEST-DeleteReplicaTest.raceConditionOnDeleteAndRegisterReplica-seed#[17D2A2A6F4337909]) [     ] o.a.s.c.c.ConnectionManager Client is connected to ZooKeeper
   [junit4]   2> 2325188 WARN  (jetty-launcher-13542-thread-2) [     ] o.e.j.s.AbstractConnector Ignoring deprecated socket close linger time
   [junit4]   2> 2325188 INFO  (jetty-launcher-13542-thread-2) [     ] o.a.s.c.s.e.JettySolrRunner Start Jetty (original configured port=0)
   [junit4]   2> 2325188 INFO  (jetty-launcher-13542-thread-2) [     ] o.a.s.c.s.e.JettySolrRunner Trying to start Jetty on port 0 try number 1 ...
   [junit4]   2> 2325188 INFO  (jetty-launcher-13542-thread-2) [     ] o.e.j.s.Server jetty-9.4.19.v20190610; built: 2019-06-10T16:30:51.723Z; git: afcf563148970e98786327af5e07c261fda175d3; jvm 12.0.1+12
   [junit4]   2> 2325189 WARN  (jetty-launcher-13542-thread-1) [     ] o.e.j.s.AbstractConnector Ignoring deprecated socket close linger time
   [junit4]   2> 2325189 INFO  (jetty-launcher-13542-thread-1) [     ] o.a.s.c.s.e.JettySolrRunner Start Jetty (original configured port=0)
   [junit4]   2> 2325189 INFO  (jetty-launcher-13542-thread-1) [     ] o.a.s.c.s.e.JettySolrRunner Trying to start Jetty on port 0 try number 1 ...
   [junit4]   2> 2325189 INFO  (jetty-launcher-13542-thread-1) [     ] o.e.j.s.Server jetty-9.4.19.v20190610; built: 2019-06-10T16:30:51.723Z; git: afcf563148970e98786327af5e07c261fda175d3; jvm 12.0.1+12
   [junit4]   2> 2325192 INFO  (jetty-launcher-13542-thread-2) [     ] o.e.j.s.session DefaultSessionIdManager workerName=node0
   [junit4]   2> 2325192 INFO  (jetty-launcher-13542-thread-2) [     ] o.e.j.s.session No SessionScavenger set, using defaults
   [junit4]   2> 2325192 INFO  (jetty-launcher-13542-thread-2) [     ] o.e.j.s.session node0 Scavenging every 660000ms
   [junit4]   2> 2325193 INFO  (jetty-launcher-13542-thread-2) [     ] o.e.j.s.h.ContextHandler Started o.e.j.s.ServletContextHandler@35e47465{/solr,null,AVAILABLE}
   [junit4]   2> 2325194 INFO  (jetty-launcher-13542-thread-2) [     ] o.e.j.s.AbstractConnector Started ServerConnector@3eea00e3{ssl,[ssl, alpn, http/1.1, h2]}{127.0.0.1:56405}
   [junit4]   2> 2325194 INFO  (jetty-launcher-13542-thread-2) [     ] o.e.j.s.Server Started @2325266ms
   [junit4]   2> 2325194 INFO  (jetty-launcher-13542-thread-2) [     ] o.a.s.c.s.e.JettySolrRunner Jetty properties: {hostContext=/solr, hostPort=56405}
   [junit4]   2> 2325194 ERROR (jetty-launcher-13542-thread-2) [     ] o.a.s.u.StartupLoggingUtils Missing Java Option solr.log.dir. Logging may be missing or incomplete.
   [junit4]   2> 2325194 INFO  (jetty-launcher-13542-thread-2) [     ] o.a.s.s.SolrDispatchFilter Using logger factory org.apache.logging.slf4j.Log4jLoggerFactory
   [junit4]   2> 2325194 INFO  (jetty-launcher-13542-thread-2) [     ] o.a.s.s.SolrDispatchFilter  ___      _       Welcome to Apache Solr™ version 8.2.0
   [junit4]   2> 2325194 INFO  (jetty-launcher-13542-thread-2) [     ] o.a.s.s.SolrDispatchFilter / __| ___| |_ _   Starting in cloud mode on port null
   [junit4]   2> 2325194 INFO  (jetty-launcher-13542-thread-2) [     ] o.a.s.s.SolrDispatchFilter \__ \/ _ \ | '_|  Install dir: null
   [junit4]   2> 2325194 INFO  (jetty-launcher-13542-thread-2) [     ] o.a.s.s.SolrDispatchFilter |___/\___/_|_|    Start time: 2019-07-02T18:38:58.940467Z
   [junit4]   2> 2325196 INFO  (jetty-launcher-13542-thread-1) [     ] o.e.j.s.session DefaultSessionIdManager workerName=node0
   [junit4]   2> 2325196 INFO  (jetty-launcher-13542-thread-1) [     ] o.e.j.s.session No SessionScavenger set, using defaults
   [junit4]   2> 2325196 INFO  (jetty-launcher-13542-thread-1) [     ] o.e.j.s.session node0 Scavenging every 660000ms
   [junit4]   2> 2325197 INFO  (jetty-launcher-13542-thread-1) [     ] o.e.j.s.h.ContextHandler Started o.e.j.s.ServletContextHandler@6f609afa{/solr,null,AVAILABLE}
   [junit4]   2> 2325198 INFO  (jetty-launcher-13542-thread-1) [     ] o.e.j.s.AbstractConnector Started ServerConnector@3801f8aa{ssl,[ssl, alpn, http/1.1, h2]}{127.0.0.1:56406}
   [junit4]   2> 2325198 INFO  (jetty-launcher-13542-thread-1) [     ] o.e.j.s.Server Started @2325271ms
   [junit4]   2> 2325198 INFO  (jetty-launcher-13542-thread-1) [     ] o.a.s.c.s.e.JettySolrRunner Jetty properties: {hostContext=/solr, hostPort=56406}
   [junit4]   2> 2325198 ERROR (jetty-launcher-13542-thread-1) [     ] o.a.s.u.StartupLoggingUtils Missing Java Option solr.log.dir. Logging may be missing or incomplete.
   [junit4]   2> 2325198 INFO  (jetty-launcher-13542-thread-1) [     ] o.a.s.s.SolrDispatchFilter Using logger factory org.apache.logging.slf4j.Log4jLoggerFactory
   [junit4]   2> 2325198 INFO  (jetty-launcher-13542-thread-1) [     ] o.a.s.s.SolrDispatchFilter  ___      _       Welcome to Apache Solr™ version 8.2.0
   [junit4]   2> 2325198 INFO  (jetty-launcher-13542-thread-1) [     ] o.a.s.s.SolrDispatchFilter / __| ___| |_ _   Starting in cloud mode on port null
   [junit4]   2> 2325198 INFO  (jetty-launcher-13542-thread-1) [     ] o.a.s.s.SolrDispatchFilter \__ \/ _ \ | '_|  Install dir: null
   [junit4]   2> 2325198 INFO  (jetty-launcher-13542-thread-1) [     ] o.a.s.s.SolrDispatchFilter |___/\___/_|_|    Start time: 2019-07-02T18:38:58.944543Z
   [junit4]   2> 2325199 INFO  (jetty-launcher-13542-thread-2) [     ] o.a.s.c.c.ConnectionManager Waiting for client to connect to ZooKeeper
   [junit4]   2> 2325203 INFO  (zkConnectionManagerCallback-13544-thread-1) [     ] o.a.s.c.c.ConnectionManager zkClient has connected
   [junit4]   2> 2325203 INFO  (jetty-launcher-13542-thread-2) [     ] o.a.s.c.c.ConnectionManager Client is connected to ZooKeeper
   [junit4]   2> 2325204 INFO  (jetty-launcher-13542-thread-1) [     ] o.a.s.c.c.ConnectionManager Waiting for client to connect to ZooKeeper
   [junit4]   2> 2325205 INFO  (jetty-launcher-13542-thread-2) [     ] o.a.s.s.SolrDispatchFilter solr.xml found in ZooKeeper. Loading...
   [junit4]   2> 2325207 WARN  (jetty-launcher-13542-thread-3) [     ] o.e.j.s.AbstractConnector Ignoring deprecated socket close linger time
   [junit4]   2> 2325207 WARN  (jetty-launcher-13542-thread-4) [     ] o.e.j.s.AbstractConnector Ignoring deprecated socket close linger time
   [junit4]   2> 2325207 INFO  (jetty-launcher-13542-thread-3) [     ] o.a.s.c.s.e.JettySolrRunner Start Jetty (original configured port=0)
   [junit4]   2> 2325207 INFO  (jetty-launcher-13542-thread-3) [     ] o.a.s.c.s.e.JettySolrRunner Trying to start Jetty on port 0 try number 1 ...
   [junit4]   2> 2325207 INFO  (jetty-launcher-13542-thread-3) [     ] o.e.j.s.Server jetty-9.4.19.v20190610; built: 2019-06-10T16:30:51.723Z; git: afcf563148970e98786327af5e07c261fda175d3; jvm 12.0.1+12
   [junit4]   2> 2325207 INFO  (jetty-launcher-13542-thread-4) [     ] o.a.s.c.s.e.JettySolrRunner Start Jetty (original configured port=0)
   [junit4]   2> 2325207 INFO  (jetty-launcher-13542-thread-4) [     ] o.a.s.c.s.e.JettySolrRunner Trying to start Jetty on port 0 try number 1 ...
   [junit4]   2> 2325207 INFO  (jetty-launcher-13542-thread-4) [     ] o.e.j.s.Server jetty-9.4.19.v20190610; built: 2019-06-10T16:30:51.723Z; git: afcf563148970e98786327af5e07c261fda175d3; jvm 12.0.1+12
   [junit4]   2> 2325209 INFO  (zkConnectionManagerCallback-13546-thread-1) [     ] o.a.s.c.c.ConnectionManager zkClient has connected
   [junit4]   2> 2325209 INFO  (jetty-launcher-13542-thread-1) [     ] o.a.s.c.c.ConnectionManager Client is connected to ZooKeeper
   [junit4]   2> 2325211 INFO  (jetty-launcher-13542-thread-1) [     ] o.a.s.s.SolrDispatchFilter solr.xml found in ZooKeeper. Loading...
   [junit4]   2> 2325215 INFO  (jetty-launcher-13542-thread-4) [     ] o.e.j.s.session DefaultSessionIdManager workerName=node0
   [junit4]   2> 2325215 INFO  (jetty-launcher-13542-thread-4) [     ] o.e.j.s.session No SessionScavenger set, using defaults
   [junit4]   2> 2325215 INFO  (jetty-launcher-13542-thread-4) [     ] o.e.j.s.session node0 Scavenging every 600000ms
   [junit4]   2> 2325217 INFO  (jetty-launcher-13542-thread-4) [     ] o.e.j.s.h.ContextHandler Started o.e.j.s.ServletContextHandler@54f3db82{/solr,null,AVAILABLE}
   [junit4]   2> 2325218 INFO  (jetty-launcher-13542-thread-4) [     ] o.e.j.s.AbstractConnector Started ServerConnector@36f05a6d{ssl,[ssl, alpn, http/1.1, h2]}{127.0.0.1:56409}
   [junit4]   2> 2325218 INFO  (jetty-launcher-13542-thread-4) [     ] o.e.j.s.Server Started @2325291ms
   [junit4]   2> 2325218 INFO  (jetty-launcher-13542-thread-4) [     ] o.a.s.c.s.e.JettySolrRunner Jetty properties: {hostContext=/solr, hostPort=56409}
   [junit4]   2> 2325218 ERROR (jetty-launcher-13542-thread-4) [     ] o.a.s.u.StartupLoggingUtils Missing Java Option solr.log.dir. Logging may be missing or incomplete.
   [junit4]   2> 2325218 INFO  (jetty-launcher-13542-thread-4) [     ] o.a.s.s.SolrDispatchFilter Using logger factory org.apache.logging.slf4j.Log4jLoggerFactory
   [junit4]   2> 2325218 INFO  (jetty-launcher-13542-thread-4) [     ] o.a.s.s.SolrDispatchFilter  ___      _       Welcome to Apache Solr™ version 8.2.0
   [junit4]   2> 2325218 INFO  (jetty-launcher-13542-thread-4) [     ] o.a.s.s.SolrDispatchFilter / __| ___| |_ _   Starting in cloud mode on port null
   [junit4]   2> 2325218 INFO  (jetty-launcher-13542-thread-4) [     ] o.a.s.s.SolrDispatchFilter \__ \/ _ \ | '_|  Install dir: null
   [junit4]   2> 2325218 INFO  (jetty-launcher-13542-thread-4) [     ] o.a.s.s.SolrDispatchFilter |___/\___/_|_|    Start time: 2019-07-02T18:38:58.964956Z
   [junit4]   2> 2325219 INFO  (jetty-launcher-13542-thread-3) [     ] o.e.j.s.session DefaultSessionIdManager workerName=node0
   [junit4]   2> 2325219 INFO  (jetty-launcher-13542-thread-3) [     ] o.e.j.s.session No SessionScavenger set, using defaults
   [junit4]   2> 2325219 INFO  (jetty-launcher-13542-thread-3) [     ] o.e.j.s.session node0 Scavenging every 600000ms
   [junit4]   2> 2325220 INFO  (jetty-launcher-13542-thread-3) [     ] o.e.j.s.h.ContextHandler Started o.e.j.s.ServletContextHandler@6c040099{/solr,null,AVAILABLE}
   [junit4]   2> 2325226 INFO  (jetty-launcher-13542-thread-3) [     ] o.e.j.s.AbstractConnector Started ServerConnector@6626f4a9{ssl,[ssl, alpn, http/1.1, h2]}{127.0.0.1:56410}
   [junit4]   2> 2325226 INFO  (jetty-launcher-13542-thread-3) [     ] o.e.j.s.Server Started @2325299ms
   [junit4]   2> 2325226 INFO  (jetty-launcher-13542-thread-3) [     ] o.a.s.c.s.e.JettySolrRunner Jetty properties: {hostContext=/solr, hostPort=56410}
   [junit4]   2> 2325226 ERROR (jetty-launcher-13542-thread-3) [     ] o.a.s.u.StartupLoggingUtils Missing Java Option solr.log.dir. Logging may be missing or incomplete.
   [junit4]   2> 2325226 INFO  (jetty-launcher-13542-thread-3) [     ] o.a.s.s.SolrDispatchFilter Using logger factory org.apache.logging.slf4j.Log4jLoggerFactory
   [junit4]   2> 2325226 INFO  (jetty-launcher-13542-thread-3) [     ] o.a.s.s.SolrDispatchFilter  ___      _       Welcome to Apache Solr™ version 8.2.0
   [junit4]   2> 2325226 INFO  (jetty-launcher-13542-thread-3) [     ] o.a.s.s.SolrDispatchFilter / __| ___| |_ _   Starting in cloud mode on port null
   [junit4]   2> 2325226 INFO  (jetty-launcher-13542-thread-3) [     ] o.a.s.s.SolrDispatchFilter \__ \/ _ \ | '_|  Install dir: null
   [junit4]   2> 2325226 INFO  (jetty-launcher-13542-thread-3) [     ] o.a.s.s.SolrDispatchFilter |___/\___/_|_|    Start time: 2019-07-02T18:38:58.972643Z
   [junit4]   2> 2325230 INFO  (jetty-launcher-13542-thread-4) [     ] o.a.s.c.c.ConnectionManager Waiting for client to connect to ZooKeeper
   [junit4]   2> 2325233 INFO  (jetty-launcher-13542-thread-3) [     ] o.a.s.c.c.ConnectionManager Waiting for client to connect to ZooKeeper
   [junit4]   2> 2325235 INFO  (zkConnectionManagerCallback-13548-thread-1) [     ] o.a.s.c.c.ConnectionManager zkClient has connected
   [junit4]   2> 2325235 INFO  (jetty-launcher-13542-thread-4) [     ] o.a.s.c.c.ConnectionManager Client is connected to ZooKeeper
   [junit4]   2> 2325237 INFO  (zkConnectionManagerCallback-13550-thread-1) [     ] o.a.s.c.c.ConnectionManager zkClient has connected
   [junit4]   2> 2325237 INFO  (jetty-launcher-13542-thread-3) [     ] o.a.s.c.c.ConnectionManager Client is connected to ZooKeeper
   [junit4]   2> 2325237 INFO  (jetty-launcher-13542-thread-4) [     ] o.a.s.s.SolrDispatchFilter solr.xml found in ZooKeeper. Loading...
   [junit4]   2> 2325239 INFO  (jetty-launcher-13542-thread-3) [     ] o.a.s.s.SolrDispatchFilter solr.xml found in ZooKeeper. Loading...
   [junit4]   2> 2325484 INFO  (jetty-launcher-13542-thread-2) [     ] o.a.s.h.c.HttpShardHandlerFactory Host whitelist initialized: WhitelistHostChecker [whitelistHosts=null, whitelistHostCheckingEnabled=true]
   [junit4]   2> 2325485 WARN  (jetty-launcher-13542-thread-2) [     ] o.e.j.u.s.S.config Trusting all certificates configured for Client@24eb5486[provider=null,keyStore=null,trustStore=null]
   [junit4]   2> 2325485 WARN  (jetty-launcher-13542-thread-2) [     ] o.e.j.u.s.S.config No Client EndPointIdentificationAlgorithm configured for Client@24eb5486[provider=null,keyStore=null,trustStore=null]
   [junit4]   2> 2325488 WARN  (jetty-launcher-13542-thread-2) [     ] o.e.j.u.s.S.config Trusting all certificates configured for Client@44ed610[provider=null,keyStore=null,trustStore=null]
   [junit4]   2> 2325488 WARN  (jetty-launcher-13542-thread-2) [     ] o.e.j.u.s.S.config No Client EndPointIdentificationAlgorithm configured for Client@44ed610[provider=null,keyStore=null,trustStore=null]
   [junit4]   2> 2325489 INFO  (jetty-launcher-13542-thread-2) [     ] o.a.s.c.ZkContainer Zookeeper client=127.0.0.1:56400/solr
   [junit4]   2> 2325490 INFO  (jetty-launcher-13542-thread-2) [     ] o.a.s.c.c.ConnectionManager Waiting for client to connect to ZooKeeper
   [junit4]   2> 2325493 INFO  (zkConnectionManagerCallback-13558-thread-1) [     ] o.a.s.c.c.ConnectionManager zkClient has connected
   [junit4]   2> 2325493 INFO  (jetty-launcher-13542-thread-2) [     ] o.a.s.c.c.ConnectionManager Client is connected to ZooKeeper
   [junit4]   2> 2325552 INFO  (jetty-launcher-13542-thread-1) [     ] o.a.s.h.c.HttpShardHandlerFactory Host whitelist initialized: WhitelistHostChecker [whitelistHosts=null, whitelistHostCheckingEnabled=true]
   [junit4]   2> 2325553 WARN  (jetty-launcher-13542-thread-1) [     ] o.e.j.u.s.S.config Trusting all certificates configured for Client@c41fe8[provider=null,keyStore=null,trustStore=null]
   [junit4]   2> 2325553 WARN  (jetty-launcher-13542-thread-1) [     ] o.e.j.u.s.S.config No Client EndPointIdentificationAlgorithm configured for Client@c41fe8[provider=null,keyStore=null,trustStore=null]
   [junit4]   2> 2325556 WARN  (jetty-launcher-13542-thread-1) [     ] o.e.j.u.s.S.config Trusting all certificates configured for Client@248a25c8[provider=null,keyStore=null,trustStore=null]
   [junit4]   2> 2325556 WARN  (jetty-launcher-13542-thread-1) [     ] o.e.j.u.s.S.config No Client EndPointIdentificationAlgorithm configured for Client@248a25c8[provider=null,keyStore=null,trustStore=null]
   [junit4]   2> 2325557 INFO  (jetty-launcher-13542-thread-1) [     ] o.a.s.c.ZkContainer Zookeeper client=127.0.0.1:56400/solr
   [junit4]   2> 2325558 INFO  (jetty-launcher-13542-thread-1) [     ] o.a.s.c.c.ConnectionManager Waiting for client to connect to ZooKeeper
   [junit4]   2> 2325560 INFO  (zkConnectionManagerCallback-13565-thread-1) [     ] o.a.s.c.c.ConnectionManager zkClient has connected
   [junit4]   2> 2325560 INFO  (jetty-launcher-13542-thread-1) [     ] o.a.s.c.c.ConnectionManager Client is connected to ZooKeeper
   [junit4]   2> 2325645 INFO  (jetty-launcher-13542-thread-4) [     ] o.a.s.h.c.HttpShardHandlerFactory Host whitelist initialized: WhitelistHostChecker [whitelistHosts=null, whitelistHostCheckingEnabled=true]
   [junit4]   2> 2325651 WARN  (jetty-launcher-13542-thread-4) [     ] o.e.j.u.s.S.config Trusting all certificates configured for Client@2f9d92cc[provider=null,keyStore=null,trustStore=null]
   [junit4]   2> 2325651 WARN  (jetty-launcher-13542-thread-4) [     ] o.e.j.u.s.S.config No Client EndPointIdentificationAlgorithm configured for Client@2f9d92cc[provider=null,keyStore=null,trustStore=null]
   [junit4]   2> 2325655 WARN  (jetty-launcher-13542-thread-4) [     ] o.e.j.u.s.S.config Trusting all certificates configured for Client@2d54aab9[provider=null,keyStore=null,trustStore=null]
   [junit4]   2> 2325655 WARN  (jetty-launcher-13542-thread-4) [     ] o.e.j.u.s.S.config No Client EndPointIdentificationAlgorithm configured for Client@2d54aab9[provider=null,keyStore=null,trustStore=null]
   [junit4]   2> 2325655 INFO  (jetty-launcher-13542-thread-4) [     ] o.a.s.c.ZkContainer Zookeeper client=127.0.0.1:56400/solr
   [junit4]   2> 2325656 INFO  (jetty-launcher-13542-thread-4) [     ] o.a.s.c.c.ConnectionManager Waiting for client to connect to ZooKeeper
   [junit4]   2> 2325659 INFO  (zkConnectionManagerCallback-13572-thread-1) [     ] o.a.s.c.c.ConnectionManager zkClient has connected
   [junit4]   2> 2325659 INFO  (jetty-launcher-13542-thread-4) [     ] o.a.s.c.c.ConnectionManager Client is connected to ZooKeeper
   [junit4]   2> 2325691 INFO  (jetty-launcher-13542-thread-3) [     ] o.a.s.h.c.HttpShardHandlerFactory Host whitelist initialized: WhitelistHostChecker [whitelistHosts=null, whitelistHostCheckingEnabled=true]
   [junit4]   2> 2325692 WARN  (jetty-launcher-13542-thread-3) [     ] o.e.j.u.s.S.config Trusting all certificates configured for Client@24d216f8[provider=null,keyStore=null,trustStore=null]
   [junit4]   2> 2325692 WARN  (jetty-launcher-13542-thread-3) [     ] o.e.j.u.s.S.config No Client EndPointIdentificationAlgorithm configured for Client@24d216f8[provider=null,keyStore=null,trustStore=null]
   [junit4]   2> 2325695 WARN  (jetty-launcher-13542-thread-3) [     ] o.e.j.u.s.S.config Trusting all certificates configured for Client@62eeec35[provider=null,keyStore=null,trustStore=null]
   [junit4]   2> 2325695 WARN  (jetty-launcher-13542-thread-3) [     ] o.e.j.u.s.S.config No Client EndPointIdentificationAlgorithm configured for Client@62eeec35[provider=null,keyStore=null,trustStore=null]
   [junit4]   2> 2325696 INFO  (jetty-launcher-13542-thread-3) [     ] o.a.s.c.ZkContainer Zookeeper client=127.0.0.1:56400/solr
   [junit4]   2> 2325697 INFO  (jetty-launcher-13542-thread-3) [     ] o.a.s.c.c.ConnectionManager Waiting for client to connect to ZooKeeper
   [junit4]   2> 2325700 INFO  (zkConnectionManagerCallback-13578-thread-1) [     ] o.a.s.c.c.ConnectionManager zkClient has connected
   [junit4]   2> 2325700 INFO  (jetty-launcher-13542-thread-3) [     ] o.a.s.c.c.ConnectionManager Client is connected to ZooKeeper
   [junit4]   2> 2325753 INFO  (jetty-launcher-13542-thread-2) [n:127.0.0.1:56405_solr     ] o.a.s.c.c.ConnectionManager Waiting for client to connect to ZooKeeper
   [junit4]   2> 2325755 INFO  (zkConnectionManagerCallback-13580-thread-1) [     ] o.a.s.c.c.ConnectionManager zkClient has connected
   [junit4]   2> 2325755 INFO  (jetty-launcher-13542-thread-2) [n:127.0.0.1:56405_solr     ] o.a.s.c.c.ConnectionManager Client is connected to ZooKeeper
   [junit4]   2> 2325858 INFO  (jetty-launcher-13542-thread-3) [n:127.0.0.1:56410_solr     ] o.a.s.c.c.ConnectionManager Waiting for client to connect to ZooKeeper
   [junit4]   2> 2325860 INFO  (zkConnectionManagerCallback-13582-thread-1) [     ] o.a.s.c.c.ConnectionManager zkClient has connected
   [junit4]   2> 2325860 INFO  (jetty-launcher-13542-thread-3) [n:127.0.0.1:56410_solr     ] o.a.s.c.c.ConnectionManager Client is connected to ZooKeeper
   [junit4]   2> 2325969 INFO  (jetty-launcher-13542-thread-1) [n:127.0.0.1:56406_solr     ] o.a.s.c.c.ConnectionManager Waiting for client to connect to ZooKeeper
   [junit4]   2> 2325972 INFO  (zkConnectionManagerCallback-13584-thread-1) [     ] o.a.s.c.c.ConnectionManager zkClient has connected
   [junit4]   2> 2325972 INFO  (jetty-launcher-13542-thread-1) [n:127.0.0.1:56406_solr     ] o.a.s.c.c.ConnectionManager Client is connected to ZooKeeper
   [junit4]   2> 2326098 INFO  (jetty-launcher-13542-thread-4) [n:127.0.0.1:56409_solr     ] o.a.s.c.c.ConnectionManager Waiting for client to connect to ZooKeeper
   [junit4]   2> 2326100 INFO  (zkConnectionManagerCallback-13586-thread-1) [     ] o.a.s.c.c.ConnectionManager zkClient has connected
   [junit4]   2> 2326100 INFO  (jetty-launcher-13542-thread-4) [n:127.0.0.1:56409_solr     ] o.a.s.c.c.ConnectionManager Client is connected to ZooKeeper
   [junit4]   2> 2326150 INFO  (jetty-launcher-13542-thread-4) [n:127.0.0.1:56409_solr     ] o.a.s.c.OverseerElectionContext I am going to be the leader 127.0.0.1:56409_solr
   [junit4]   2> 2326154 INFO  (jetty-launcher-13542-thread-4) [n:127.0.0.1:56409_solr     ] o.a.s.c.Overseer Overseer (id=72097340793356302-127.0.0.1:56409_solr-n_0000000000) starting
   [junit4]   2> 2326192 INFO  (jetty-launcher-13542-thread-4) [n:127.0.0.1:56409_solr     ] o.a.s.c.c.ConnectionManager Waiting for client to connect to ZooKeeper
   [junit4]   2> 2326193 INFO  (zkConnectionManagerCallback-13599-thread-1) [     ] o.a.s.c.c.ConnectionManager zkClient has connected
   [junit4]   2> 2326194 INFO  (jetty-launcher-13542-thread-4) [n:127.0.0.1:56409_solr     ] o.a.s.c.c.ConnectionManager Client is connected to ZooKeeper
   [junit4]   2> 2326211 INFO  (jetty-launcher-13542-thread-4) [n:127.0.0.1:56409_solr     ] o.a.s.c.s.i.ZkClientClusterStateProvider Cluster at 127.0.0.1:56400/solr ready
   [junit4]   2> 2326216 INFO  (OverseerStateUpdate-72097340793356302-127.0.0.1:56409_solr-n_0000000000) [n:127.0.0.1:56409_solr     ] o.a.s.c.Overseer Starting to work on the main queue : 127.0.0.1:56409_solr
   [junit4]   2> 2326235 INFO  (jetty-launcher-13542-thread-4) [n:127.0.0.1:56409_solr     ] o.a.s.c.ZkController Register node as live in ZooKeeper:/live_nodes/127.0.0.1:56409_solr
   [junit4]   2> 2326247 INFO  (zkCallback-13598-thread-1) [     ] o.a.s.c.c.ZkStateReader Updated live nodes from ZooKeeper... (0) -> (1)
   [junit4]   2> 2326248 INFO  (zkCallback-13585-thread-1) [     ] o.a.s.c.c.ZkStateReader Updated live nodes from ZooKeeper... (0) -> (1)
   [junit4]   2> 2326267 INFO  (jetty-launcher-13542-thread-2) [n:127.0.0.1:56405_solr     ] o.a.s.c.c.ZkStateReader Updated live nodes from ZooKeeper... (0) -> (1)
   [junit4]   2> 2326276 INFO  (jetty-launcher-13542-thread-2) [n:127.0.0.1:56405_solr     ] o.a.s.c.ZkController Publish node=127.0.0.1:56405_solr as DOWN
   [junit4]   2> 2326279 INFO  (jetty-launcher-13542-thread-2) [n:127.0.0.1:56405_solr     ] o.a.s.c.TransientSolrCoreCacheDefault Allocating transient cache for 2147483647 transient cores
   [junit4]   2> 2326279 INFO  (jetty-launcher-13542-thread-2) [n:127.0.0.1:56405_solr     ] o.a.s.c.ZkController Register node as live in ZooKeeper:/live_nodes/127.0.0.1:56405_solr
   [junit4]   2> 2326282 INFO  (zkCallback-13598-thread-1) [     ] o.a.s.c.c.ZkStateReader Updated live nodes from ZooKeeper... (1) -> (2)
   [junit4]   2> 2326282 INFO  (zkCallback-13585-thread-1) [     ] o.a.s.c.c.ZkStateReader Updated live nodes from ZooKeeper... (1) -> (2)
   [junit4]   2> 2326282 INFO  (zkCallback-13579-thread-1) [     ] o.a.s.c.c.ZkStateReader Updated live nodes from ZooKeeper... (1) -> (2)
   [junit4]   2> 2326285 INFO  (jetty-launcher-13542-thread-2) [n:127.0.0.1:56405_solr     ] o.a.s.c.c.ConnectionManager Waiting for client to connect to ZooKeeper
   [junit4]   2> 2326288 INFO  (zkConnectionManagerCallback-13604-thread-1) [     ] o.a.s.c.c.ConnectionManager zkClient has connected
   [junit4]   2> 2326288 INFO  (jetty-launcher-13542-thread-2) [n:127.0.0.1:56405_solr     ] o.a.s.c.c.ConnectionManager Client is connected to ZooKeeper
   [junit4]   2> 2326290 INFO  (jetty-launcher-13542-thread-2) [n:127.0.0.1:56405_solr     ] o.a.s.c.c.ZkStateReader Updated live nodes from ZooKeeper... (0) -> (2)
   [junit4]   2> 2326293 INFO  (jetty-launcher-13542-thread-2) [n:127.0.0.1:56405_solr     ] o.a.s.c.s.i.ZkClientClusterStateProvider Cluster at 127.0.0.1:56400/solr ready
   [junit4]   2> 2326325 INFO  (jetty-launcher-13542-thread-4) [n:127.0.0.1:56409_solr     ] o.a.s.h.a.MetricsHistoryHandler No .system collection, keeping metrics history in memory.
   [junit4]   2> 2326326 INFO  (jetty-launcher-13542-thread-2) [n:127.0.0.1:56405_solr     ] o.a.s.h.a.MetricsHistoryHandler No .system collection, keeping metrics history in memory.
   [junit4]   2> 2326355 INFO  (jetty-launcher-13542-thread-1) [n:127.0.0.1:56406_solr     ] o.a.s.c.c.ZkStateReader Updated live nodes from ZooKeeper... (0) -> (2)
   [junit4]   2> 2326355 INFO  (jetty-launcher-13542-thread-3) [n:127.0.0.1:56410_solr     ] o.a.s.c.c.ZkStateReader Updated live nodes from ZooKeeper... (0) -> (2)
   [junit4]   2> 2326370 INFO  (jetty-launcher-13542-thread-1) [n:127.0.0.1:56406_solr     ] o.a.s.c.ZkController Publish node=127.0.0.1:56406_solr as DOWN
   [junit4]   2> 2326371 INFO  (jetty-launcher-13542-thread-3) [n:127.0.0.1:56410_solr     ] o.a.s.c.ZkController Publish node=127.0.0.1:56410_solr as DOWN
   [junit4]   2> 2326373 INFO  (jetty-launcher-13542-thread-3) [n:127.0.0.1:56410_solr     ] o.a.s.c.TransientSolrCoreCacheDefault Allocating transient cache for 2147483647 transient cores
   [junit4]   2> 2326373 INFO  (jetty-launcher-13542-thread-3) [n:127.0.0.1:56410_solr     ] o.a.s.c.ZkController Register node as live in ZooKeeper:/live_nodes/127.0.0.1:56410_solr
   [junit4]   2> 2326373 INFO  (jetty-launcher-13542-thread-1) [n:127.0.0.1:56406_solr     ] o.a.s.c.TransientSolrCoreCacheDefault Allocating transient cache for 2147483647 transient cores
   [junit4]   2> 2326373 INFO  (jetty-launcher-13542-thread-1) [n:127.0.0.1:56406_solr     ] o.a.s.c.ZkController Register node as live in ZooKeeper:/live_nodes/127.0.0.1:56406_solr
   [junit4]   2> 2326376 INFO  (zkCallback-13585-thread-1) [     ] o.a.s.c.c.ZkStateReader Updated live nodes from ZooKeeper... (2) -> (4)
   [junit4]   2> 2326377 INFO  (zkCallback-13579-thread-1) [     ] o.a.s.c.c.ZkStateReader Updated live nodes from ZooKeeper... (2) -> (4)
   [junit4]   2> 2326377 INFO  (zkCallback-13598-thread-1) [     ] o.a.s.c.c.ZkStateReader Updated live nodes from ZooKeeper... (2) -> (4)
   [junit4]   2> 2326377 INFO  (zkCallback-13581-thread-1) [     ] o.a.s.c.c.ZkStateReader Updated live nodes from ZooKeeper... (2) -> (4)
   [junit4]   2> 2326378 INFO  (zkCallback-13603-thread-1) [     ] o.a.s.c.c.ZkStateReader Updated live nodes from ZooKeeper... (2) -> (4)
   [junit4]   2> 2326378 INFO  (zkCallback-13583-thread-1) [     ] o.a.s.c.c.ZkStateReader Updated live nodes from ZooKeeper... (2) -> (4)
   [junit4]   2> 2326380 INFO  (jetty-launcher-13542-thread-3) [n:127.0.0.1:56410_solr     ] o.a.s.c.c.ConnectionManager Waiting for client to connect to ZooKeeper
   [junit4]   2> 2326381 INFO  (jetty-launcher-13542-thread-1) [n:127.0.0.1:56406_solr     ] o.a.s.c.c.ConnectionManager Waiting for client to connect to ZooKeeper
   [junit4]   2> 2326383 INFO  (zkConnectionManagerCallback-13611-thread-1) [     ] o.a.s.c.c.ConnectionManager zkClient has connected
   [junit4]   2> 2326384 INFO  (jetty-launcher-13542-thread-3) [n:127.0.0.1:56410_solr     ] o.a.s.c.c.ConnectionManager Client is connected to ZooKeeper
   [junit4]   2> 2326384 INFO  (zkConnectionManagerCallback-13616-thread-1) [     ] o.a.s.c.c.ConnectionManager zkClient has connected
   [junit4]   2> 2326384 INFO  (jetty-launcher-13542-thread-1) [n:127.0.0.1:56406_solr     ] o.a.s.c.c.ConnectionManager Client is connected to ZooKeeper
   [junit4]   2> 2326386 INFO  (jetty-launcher-13542-thread-4) [n:127.0.0.1:56409_solr     ] o.a.s.m.r.SolrJmxReporter JMX monitoring for 'solr_56409.solr.node' (registry 'solr.node') enabled at server: com.sun.jmx.mbeanserver.JmxMBeanServer@7f530916
   [junit4]   2> 2326390 INFO  (jetty-launcher-13542-thread-3) [n:127.0.0.1:56410_solr     ] o.a.s.c.c.ZkStateReader Updated live nodes from ZooKeeper... (0) -> (4)
   [junit4]   2> 2326391 INFO  (jetty-launcher-13542-thread-2) [n:127.0.0.1:56405_solr     ] o.a.s.m.r.SolrJmxReporter JMX monitoring for 'solr_56405.solr.node' (registry 'solr.node') enabled at server: com.sun.jmx.mbeanserver.JmxMBeanServer@7f530916
   [junit4]   2> 2326391 INFO  (jetty-launcher-13542-thread-1) [n:127.0.0.1:56406_solr     ] o.a.s.c.c.ZkStateReader Updated live nodes from ZooKeeper... (0) -> (4)
   [junit4]   2> 2326393 INFO  (jetty-launcher-13542-thread-3) [n:127.0.0.1:56410_solr     ] o.a.s.c.s.i.ZkClientClusterStateProvider Cluster at 127.0.0.1:56400/solr ready
   [junit4]   2> 2326394 INFO  (jetty-launcher-13542-thread-1) [n:127.0.0.1:56406_solr     ] o.a.s.c.s.i.ZkClientClusterStateProvider Cluster at 127.0.0.1:56400/solr ready
   [junit4]   2> 2326480 INFO  (jetty-launcher-13542-thread-4) [n:127.0.0.1:56409_solr     ] o.a.s.m.r.SolrJmxReporter JMX monitoring for 'solr_56409.solr.jvm' (registry 'solr.jvm') enabled at server: com.sun.jmx.mbeanserver.JmxMBeanServer@7f530916
   [junit4]   2> 2326480 INFO  (jetty-launcher-13542-thread-4) [n:127.0.0.1:56409_solr     ] o.a.s.m.r.SolrJmxReporter JMX monitoring for 'solr_56409.solr.jetty' (registry 'solr.jetty') enabled at server: com.sun.jmx.mbeanserver.JmxMBeanServer@7f530916
   [junit4]   2> 2326492 INFO  (jetty-launcher-13542-thread-3) [n:127.0.0.1:56410_solr     ] o.a.s.h.a.MetricsHistoryHandler No .system collection, keeping metrics history in memory.
   [junit4]   2> 2326494 INFO  (jetty-launcher-13542-thread-4) [n:127.0.0.1:56409_solr     ] o.a.s.c.CorePropertiesLocator Found 0 core definitions underneath /Users/jenkins/workspace/Lucene-Solr-8.x-MacOSX/solr/build/solr-core/test/J0/temp/solr.cloud.DeleteReplicaTest_17D2A2A6F4337909-001/tempDir-001/node4/.
   [junit4]   2> 2326495 INFO  (jetty-launcher-13542-thread-2) [n:127.0.0.1:56405_solr     ] o.a.s.m.r.SolrJmxReporter JMX monitoring for 'solr_56405.solr.jvm' (registry 'solr.jvm') enabled at server: com.sun.jmx.mbeanserver.JmxMBeanServer@7f530916
   [junit4]   2> 2326495 INFO  (jetty-launcher-13542-thread-2) [n:127.0.0.1:56405_solr     ] o.a.s.m.r.SolrJmxReporter JMX monitoring for 'solr_56405.solr.jetty' (registry 'solr.jetty') enabled at server: com.sun.jmx.mbeanserver.JmxMBeanServer@7f530916
   [junit4]   2> 2326495 INFO  (jetty-launcher-13542-thread-1) [n:127.0.0.1:56406_solr     ] o.a.s.h.a.MetricsHistoryHandler No .system collection, keeping metrics history in memory.
   [junit4]   2> 2326512 INFO  (jetty-launcher-13542-thread-2) [n:127.0.0.1:56405_solr     ] o.a.s.c.CorePropertiesLocator Found 0 core definitions underneath /Users/jenkins/workspace/Lucene-Solr-8.x-MacOSX/solr/build/solr-core/test/J0/temp/solr.cloud.DeleteReplicaTest_17D2A2A6F4337909-001/tempDir-001/node2/.
   [junit4]   2> 2326570 INFO  (jetty-launcher-13542-thread-3) [n:127.0.0.1:56410_solr     ] o.a.s.m.r.SolrJmxReporter JMX monitoring for 'solr_56410.solr.node' (registry 'solr.node') enabled at server: com.sun.jmx.mbeanserver.JmxMBeanServer@7f530916
   [junit4]   2> 2326612 INFO  (jetty-launcher-13542-thread-1) [n:127.0.0.1:56406_solr     ] o.a.s.m.r.SolrJmxReporter JMX monitoring for 'solr_56406.solr.node' (registry 'solr.node') enabled at server: com.sun.jmx.mbeanserver.JmxMBeanServer@7f530916
   [junit4]   2> 2326629 INFO  (jetty-launcher-13542-thread-3) [n:127.0.0.1:56410_solr     ] o.a.s.m.r.SolrJmxReporter JMX monitoring for 'solr_56410.solr.jvm' (registry 'solr.jvm') enabled at server: com.sun.jmx.mbeanserver.JmxMBeanServer@7f530916
   [junit4]   2> 2326629 INFO  (jetty-launcher-13542-thread-3) [n:127.0.0.1:56410_solr     ] o.a.s.m.r.SolrJmxReporter JMX monitoring for 'solr_56410.solr.jetty' (registry 'solr.jetty') enabled at server: com.sun.jmx.mbeanserver.JmxMBeanServer@7f530916
   [junit4]   2> 2326634 INFO  (jetty-launcher-13542-thread-3) [n:127.0.0.1:56410_solr     ] o.a.s.c.CorePropertiesLocator Found 0 core definitions underneath /Users/jenkins/workspace/Lucene-Solr-8.x-MacOSX/solr/build/solr-core/test/J0/temp/solr.cloud.DeleteReplicaTest_17D2A2A6F4337909-001/tempDir-001/node3/.
   [junit4]   2> 2326646 INFO  (jetty-launcher-13542-thread-1) [n:127.0.0.1:56406_solr     ] o.a.s.m.r.SolrJmxReporter JMX monitoring for 'solr_56406.solr.jvm' (registry 'solr.jvm') enabled at server: com.sun.jmx.mbeanserver.JmxMBeanServer@7f530916
   [junit4]   2> 2326647 INFO  (jetty-launcher-13542-thread-1) [n:127.0.0.1:56406_solr     ] o.a.s.m.r.SolrJmxReporter JMX monitoring for 'solr_56406.solr.jetty' (registry 'solr.jetty') enabled at server: com.sun.jmx.mbeanserver.JmxMBeanServer@7f530916
   [junit4]   2> 2326648 INFO  (jetty-launcher-13542-thread-1) [n:127.0.0.1:56406_solr     ] o.a.s.c.CorePropertiesLocator Found 0 core definitions underneath /Users/jenkins/workspace/Lucene-Solr-8.x-MacOSX/solr/build/solr-core/test/J0/temp/solr.cloud.DeleteReplicaTest_17D2A2A6F4337909-001/tempDir-001/node1/.
   [junit4]   2> 2326785 INFO  (TEST-DeleteReplicaTest.raceConditionOnDeleteAndRegisterReplica

[...truncated too long message...]

olrMetricManager Closing metric reporters for registry=solr.jetty, tag=null
   [junit4]   2> 301223 INFO  (jetty-closer-2130-thread-3) [     ] o.a.s.m.r.SolrJmxReporter Closing reporter [org.apache.solr.metrics.reporters.SolrJmxReporter@98203fa: rootName = solr_58386, domain = solr.jetty, service url = null, agent id = null] for registry solr.jetty / com.codahale.metrics.MetricRegistry@5bea7a55
   [junit4]   2> 301224 INFO  (jetty-closer-2130-thread-3) [     ] o.a.s.m.SolrMetricManager Closing metric reporters for registry=solr.cluster, tag=null
   [junit4]   2> 301224 INFO  (jetty-closer-2130-thread-2) [     ] o.a.s.m.r.SolrJmxReporter Closing reporter [org.apache.solr.metrics.reporters.SolrJmxReporter@713746c0: rootName = solr_58384, domain = solr.jetty, service url = null, agent id = null] for registry solr.jetty / com.codahale.metrics.MetricRegistry@5bea7a55
   [junit4]   2> 301224 INFO  (jetty-closer-2130-thread-2) [     ] o.a.s.m.SolrMetricManager Closing metric reporters for registry=solr.cluster, tag=null
   [junit4]   2> 301236 INFO  (closeThreadPool-2146-thread-1) [     ] o.a.s.c.Overseer Overseer (id=72097585442455565-127.0.0.1:58384_solr-n_0000000000) closing
   [junit4]   2> 301237 INFO  (OverseerStateUpdate-72097585442455565-127.0.0.1:58384_solr-n_0000000000) [n:127.0.0.1:58384_solr     ] o.a.s.c.Overseer Overseer Loop exiting : 127.0.0.1:58384_solr
   [junit4]   2> 301246 INFO  (OverseerAutoScalingTriggerThread-72097585442455565-127.0.0.1:58384_solr-n_0000000000) [     ] o.a.s.c.a.OverseerTriggerThread OverseerTriggerThread woken up but we are closed, exiting.
   [junit4]   2> 301248 INFO  (closeThreadPool-2146-thread-2) [     ] o.a.s.c.Overseer Overseer (id=72097585442455565-127.0.0.1:58384_solr-n_0000000000) closing
   [junit4]   2> 301341 INFO  (zkCallback-2101-thread-1) [     ] o.a.s.c.c.ZkStateReader Updated live nodes from ZooKeeper... (2) -> (1)
   [junit4]   2> 301341 INFO  (zkCallback-2090-thread-1) [     ] o.a.s.c.c.ZkStateReader Updated live nodes from ZooKeeper... (2) -> (1)
   [junit4]   2> 301417 INFO  (jetty-closer-2130-thread-3) [     ] o.e.j.s.AbstractConnector Stopped ServerConnector@5ac94e87{ssl,[ssl, alpn, http/1.1, h2]}{127.0.0.1:0}
   [junit4]   2> 301417 INFO  (jetty-closer-2130-thread-3) [     ] o.e.j.s.h.ContextHandler Stopped o.e.j.s.ServletContextHandler@70e1ee0{/solr,null,UNAVAILABLE}
   [junit4]   2> 301418 INFO  (jetty-closer-2130-thread-3) [     ] o.e.j.s.session node0 Stopped scavenging
   [junit4]   2> 301552 INFO  (jetty-closer-2130-thread-2) [     ] o.a.s.c.Overseer Overseer (id=72097585442455565-127.0.0.1:58384_solr-n_0000000000) closing
   [junit4]   2> 301554 INFO  (jetty-closer-2130-thread-2) [     ] o.e.j.s.AbstractConnector Stopped ServerConnector@2e3d9708{ssl,[ssl, alpn, http/1.1, h2]}{127.0.0.1:0}
   [junit4]   2> 301555 INFO  (jetty-closer-2130-thread-2) [     ] o.e.j.s.h.ContextHandler Stopped o.e.j.s.ServletContextHandler@119abacf{/solr,null,UNAVAILABLE}
   [junit4]   2> 301555 INFO  (jetty-closer-2130-thread-2) [     ] o.e.j.s.session node0 Stopped scavenging
   [junit4]   2> 301629 INFO  (jetty-closer-2130-thread-1) [     ] o.e.j.s.AbstractConnector Stopped ServerConnector@3f847871{ssl,[ssl, alpn, http/1.1, h2]}{127.0.0.1:0}
   [junit4]   2> 301629 INFO  (jetty-closer-2130-thread-1) [     ] o.e.j.s.h.ContextHandler Stopped o.e.j.s.ServletContextHandler@4fce4197{/solr,null,UNAVAILABLE}
   [junit4]   2> 301630 INFO  (jetty-closer-2130-thread-1) [     ] o.e.j.s.session node0 Stopped scavenging
   [junit4]   2> 301733 INFO  (jetty-closer-2130-thread-4) [     ] o.e.j.s.AbstractConnector Stopped ServerConnector@2d8e6630{ssl,[ssl, alpn, http/1.1, h2]}{127.0.0.1:0}
   [junit4]   2> 301733 INFO  (jetty-closer-2130-thread-4) [     ] o.e.j.s.h.ContextHandler Stopped o.e.j.s.ServletContextHandler@2638f77d{/solr,null,UNAVAILABLE}
   [junit4]   2> 301734 INFO  (jetty-closer-2130-thread-4) [     ] o.e.j.s.session node0 Stopped scavenging
   [junit4]   2> 301735 INFO  (TEST-DeleteReplicaTest.deleteReplicaFromClusterState-seed#[17D2A2A6F4337909]) [     ] o.a.s.c.ZkTestServer Shutting down ZkTestServer.
   [junit4]   2> 301953 WARN  (ZkTestServer Run Thread) [     ] o.a.s.c.ZkTestServer Watch limit violations: 
   [junit4]   2> Maximum concurrent create/delete watches above limit:
   [junit4]   2> 
   [junit4]   2> 	18	/solr/collections/deleteFromClusterState_false/terms/shard1
   [junit4]   2> 	9	/solr/aliases.json
   [junit4]   2> 	4	/solr/security.json
   [junit4]   2> 	3	/solr/collections/deleteFromClusterState_false/collectionprops.json
   [junit4]   2> 	3	/solr/collections/deleteFromClusterState_false/state.json
   [junit4]   2> 	3	/solr/configs/conf
   [junit4]   2> 
   [junit4]   2> Maximum concurrent data watches above limit:
   [junit4]   2> 
   [junit4]   2> 	43	/solr/collections/deleteFromClusterState_false/state.json
   [junit4]   2> 	27	/solr/clusterprops.json
   [junit4]   2> 	9	/solr/clusterstate.json
   [junit4]   2> 	2	/solr/overseer_elect/election/72097585442455565-127.0.0.1:58384_solr-n_0000000000
   [junit4]   2> 
   [junit4]   2> Maximum concurrent children watches above limit:
   [junit4]   2> 
   [junit4]   2> 	40	/solr/live_nodes
   [junit4]   2> 	36	/solr/overseer/queue
   [junit4]   2> 	27	/solr/collections
   [junit4]   2> 	8	/solr/overseer/collection-queue-work
   [junit4]   2> 
   [junit4]   2> 302144 INFO  (TEST-DeleteReplicaTest.deleteReplicaFromClusterState-seed#[17D2A2A6F4337909]) [     ] o.a.s.c.ZkTestServer parse host and port list: 127.0.0.1:58378
   [junit4]   2> 302144 INFO  (TEST-DeleteReplicaTest.deleteReplicaFromClusterState-seed#[17D2A2A6F4337909]) [     ] o.a.s.c.ZkTestServer connecting to 127.0.0.1 58378
   [junit4]   2> 302145 INFO  (TEST-DeleteReplicaTest.deleteReplicaFromClusterState-seed#[17D2A2A6F4337909]) [     ] o.a.s.SolrTestCaseJ4 ###Ending deleteReplicaFromClusterState
   [junit4] OK      9.23s J0 | DeleteReplicaTest.deleteReplicaFromClusterState
   [junit4]   2> NOTE: leaving temporary files on disk at: /Users/jenkins/workspace/Lucene-Solr-8.x-MacOSX/solr/build/solr-core/test/J0/temp/solr.cloud.DeleteReplicaTest_17D2A2A6F4337909-001
   [junit4]   2> Jul 02, 2019 7:41:21 PM com.carrotsearch.randomizedtesting.ThreadLeakControl checkThreadLeaks
   [junit4]   2> WARNING: Will linger awaiting termination of 1 leaked thread(s).
   [junit4]   2> NOTE: test params are: codec=Asserting(Lucene80): {_root_=FST50, id=PostingsFormat(name=LuceneFixedGap)}, docValues:{}, maxPointsInLeafNode=1486, maxMBSortInHeap=6.8690050739734865, sim=Asserting(org.apache.lucene.search.similarities.AssertingSimilarity@74cbaf9d), locale=de-LU, timezone=Africa/Harare
   [junit4]   2> NOTE: Mac OS X 10.11.6 x86_64/AdoptOpenJDK 12.0.1 (64-bit)/cpus=3,threads=1,free=88058496,total=173953024
   [junit4]   2> NOTE: All tests run in this JVM: [DeleteReplicaTest, DeleteReplicaTest]
   [junit4] Completed [4/5 (2!)] on J0 in 191.21s, 9 tests, 1 error <<< FAILURES!

[...truncated 1 lines...]
   [junit4] JVM J0: stderr was not empty, see: /Users/jenkins/workspace/Lucene-Solr-8.x-MacOSX/solr/build/solr-core/test/temp/junit4-J0-20190702_193618_59111346309058895172757.syserr
   [junit4] >>> JVM J0 emitted unexpected output (verbatim) ----
   [junit4] OpenJDK 64-Bit Server VM warning: Option UseConcMarkSweepGC was deprecated in version 9.0 and will likely be removed in a future release.
   [junit4] <<< JVM J0: EOF ----

[...truncated 12 lines...]
   [junit4] JVM J1: stderr was not empty, see: /Users/jenkins/workspace/Lucene-Solr-8.x-MacOSX/solr/build/solr-core/test/temp/junit4-J1-20190702_193618_5916257510254948717840.syserr
   [junit4] >>> JVM J1 emitted unexpected output (verbatim) ----
   [junit4] OpenJDK 64-Bit Server VM warning: Option UseConcMarkSweepGC was deprecated in version 9.0 and will likely be removed in a future release.
   [junit4] <<< JVM J1: EOF ----

[...truncated 10 lines...]
BUILD FAILED
/Users/jenkins/workspace/Lucene-Solr-8.x-MacOSX/lucene/common-build.xml:1572: The following error occurred while executing this line:
/Users/jenkins/workspace/Lucene-Solr-8.x-MacOSX/lucene/common-build.xml:1099: There were test failures: 5 suites, 45 tests, 2 errors [seed: 17D2A2A6F4337909]

Total time: 6 minutes 19 seconds

[repro] Setting last failure code to 256

[repro] Failures:
[repro]   2/5 failed: org.apache.solr.cloud.DeleteReplicaTest
[repro] Exiting with code 256
+ mv lucene/build lucene/build.repro
+ mv solr/build solr/build.repro
+ mv lucene/build.orig lucene/build
+ mv solr/build.orig solr/build
Archiving artifacts
Setting ANT_1_8_2_HOME=/Users/jenkins/tools/hudson.tasks.Ant_AntInstallation/ANT_1.8.2
[WARNINGS] Parsing warnings in console log with parser Java Compiler (javac)
Setting ANT_1_8_2_HOME=/Users/jenkins/tools/hudson.tasks.Ant_AntInstallation/ANT_1.8.2
No credentials specified
Setting ANT_1_8_2_HOME=/Users/jenkins/tools/hudson.tasks.Ant_AntInstallation/ANT_1.8.2
<Git Blamer> Using GitBlamer to create author and commit information for all warnings.
<Git Blamer> GIT_COMMIT=5974586b87fec18f0a1a5f092ff5b335600c50a8, workspace=/Users/jenkins/workspace/Lucene-Solr-8.x-MacOSX
[WARNINGS] Computing warning deltas based on reference build #218
Recording test results
Setting ANT_1_8_2_HOME=/Users/jenkins/tools/hudson.tasks.Ant_AntInstallation/ANT_1.8.2
Build step 'Publish JUnit test result report' changed build result to UNSTABLE
Email was triggered for: Unstable (Test Failures)
Sending email for trigger: Unstable (Test Failures)
Setting ANT_1_8_2_HOME=/Users/jenkins/tools/hudson.tasks.Ant_AntInstallation/ANT_1.8.2
Setting ANT_1_8_2_HOME=/Users/jenkins/tools/hudson.tasks.Ant_AntInstallation/ANT_1.8.2
Setting ANT_1_8_2_HOME=/Users/jenkins/tools/hudson.tasks.Ant_AntInstallation/ANT_1.8.2
Setting ANT_1_8_2_HOME=/Users/jenkins/tools/hudson.tasks.Ant_AntInstallation/ANT_1.8.2
Setting ANT_1_8_2_HOME=/Users/jenkins/tools/hudson.tasks.Ant_AntInstallation/ANT_1.8.2
Setting ANT_1_8_2_HOME=/Users/jenkins/tools/hudson.tasks.Ant_AntInstallation/ANT_1.8.2

Mime
View raw message