lucene-dev mailing list archives

Site index · List index
Message view « Date » · « Thread »
Top « Date » · « Thread »
From Policeman Jenkins Server <jenk...@thetaphi.de>
Subject [JENKINS] Lucene-Solr-8.2-Linux (64bit/jdk1.8.0_201) - Build # 468 - Unstable!
Date Thu, 25 Jul 2019 03:10:38 GMT
Build: https://jenkins.thetaphi.de/job/Lucene-Solr-8.2-Linux/468/
Java: 64bit/jdk1.8.0_201 -XX:-UseCompressedOops -XX:+UseParallelGC

1 tests failed.
FAILED:  org.apache.solr.cloud.autoscaling.AutoAddReplicasIntegrationTest.testSimple

Error Message:
Waiting for collection testSimple2 Timeout waiting to see state for collection=testSimple2 :DocCollection(testSimple2//collections/testSimple2/state.json/27)={   "pullReplicas":"0",   "replicationFactor":"2",   "shards":{     "shard1":{       "range":"80000000-ffffffff",       "state":"active",       "replicas":{         "core_node3":{           "core":"testSimple2_shard1_replica_n1",           "base_url":"http://127.0.0.1:45075/solr",           "node_name":"127.0.0.1:45075_solr",           "state":"down",           "type":"NRT",           "force_set_state":"false"},         "core_node5":{           "core":"testSimple2_shard1_replica_n2",           "base_url":"http://127.0.0.1:33851/solr",           "node_name":"127.0.0.1:33851_solr",           "state":"active",           "type":"NRT",           "force_set_state":"false",           "leader":"true"},         "core_node12":{           "core":"testSimple2_shard1_replica_n11",           "base_url":"http://127.0.0.1:33851/solr",           "state":"down",           "node_name":"127.0.0.1:33851_solr",           "type":"NRT"}}},     "shard2":{       "range":"0-7fffffff",       "state":"active",       "replicas":{         "core_node8":{           "core":"testSimple2_shard2_replica_n6",           "base_url":"http://127.0.0.1:33851/solr",           "node_name":"127.0.0.1:33851_solr",           "state":"active",           "type":"NRT",           "force_set_state":"false",           "leader":"true"},         "core_node10":{           "core":"testSimple2_shard2_replica_n9",           "base_url":"http://127.0.0.1:33851/solr",           "node_name":"127.0.0.1:33851_solr",           "state":"active",           "type":"NRT",           "force_set_state":"false"}}}},   "router":{"name":"compositeId"},   "maxShardsPerNode":"2",   "autoAddReplicas":"true",   "nrtReplicas":"2",   "tlogReplicas":"0"} Live Nodes: [127.0.0.1:33851_solr, 127.0.0.1:40491_solr] Last available state: DocCollection(testSimple2//collections/testSimple2/state.json/27)={   "pullReplicas":"0",   "replicationFactor":"2",   "shards":{     "shard1":{       "range":"80000000-ffffffff",       "state":"active",       "replicas":{         "core_node3":{           "core":"testSimple2_shard1_replica_n1",           "base_url":"http://127.0.0.1:45075/solr",           "node_name":"127.0.0.1:45075_solr",           "state":"down",           "type":"NRT",           "force_set_state":"false"},         "core_node5":{           "core":"testSimple2_shard1_replica_n2",           "base_url":"http://127.0.0.1:33851/solr",           "node_name":"127.0.0.1:33851_solr",           "state":"active",           "type":"NRT",           "force_set_state":"false",           "leader":"true"},         "core_node12":{           "core":"testSimple2_shard1_replica_n11",           "base_url":"http://127.0.0.1:33851/solr",           "state":"down",           "node_name":"127.0.0.1:33851_solr",           "type":"NRT"}}},     "shard2":{       "range":"0-7fffffff",       "state":"active",       "replicas":{         "core_node8":{           "core":"testSimple2_shard2_replica_n6",           "base_url":"http://127.0.0.1:33851/solr",           "node_name":"127.0.0.1:33851_solr",           "state":"active",           "type":"NRT",           "force_set_state":"false",           "leader":"true"},         "core_node10":{           "core":"testSimple2_shard2_replica_n9",           "base_url":"http://127.0.0.1:33851/solr",           "node_name":"127.0.0.1:33851_solr",           "state":"active",           "type":"NRT",           "force_set_state":"false"}}}},   "router":{"name":"compositeId"},   "maxShardsPerNode":"2",   "autoAddReplicas":"true",   "nrtReplicas":"2",   "tlogReplicas":"0"}

Stack Trace:
java.lang.AssertionError: Waiting for collection testSimple2
Timeout waiting to see state for collection=testSimple2 :DocCollection(testSimple2//collections/testSimple2/state.json/27)={
  "pullReplicas":"0",
  "replicationFactor":"2",
  "shards":{
    "shard1":{
      "range":"80000000-ffffffff",
      "state":"active",
      "replicas":{
        "core_node3":{
          "core":"testSimple2_shard1_replica_n1",
          "base_url":"http://127.0.0.1:45075/solr",
          "node_name":"127.0.0.1:45075_solr",
          "state":"down",
          "type":"NRT",
          "force_set_state":"false"},
        "core_node5":{
          "core":"testSimple2_shard1_replica_n2",
          "base_url":"http://127.0.0.1:33851/solr",
          "node_name":"127.0.0.1:33851_solr",
          "state":"active",
          "type":"NRT",
          "force_set_state":"false",
          "leader":"true"},
        "core_node12":{
          "core":"testSimple2_shard1_replica_n11",
          "base_url":"http://127.0.0.1:33851/solr",
          "state":"down",
          "node_name":"127.0.0.1:33851_solr",
          "type":"NRT"}}},
    "shard2":{
      "range":"0-7fffffff",
      "state":"active",
      "replicas":{
        "core_node8":{
          "core":"testSimple2_shard2_replica_n6",
          "base_url":"http://127.0.0.1:33851/solr",
          "node_name":"127.0.0.1:33851_solr",
          "state":"active",
          "type":"NRT",
          "force_set_state":"false",
          "leader":"true"},
        "core_node10":{
          "core":"testSimple2_shard2_replica_n9",
          "base_url":"http://127.0.0.1:33851/solr",
          "node_name":"127.0.0.1:33851_solr",
          "state":"active",
          "type":"NRT",
          "force_set_state":"false"}}}},
  "router":{"name":"compositeId"},
  "maxShardsPerNode":"2",
  "autoAddReplicas":"true",
  "nrtReplicas":"2",
  "tlogReplicas":"0"}
Live Nodes: [127.0.0.1:33851_solr, 127.0.0.1:40491_solr]
Last available state: DocCollection(testSimple2//collections/testSimple2/state.json/27)={
  "pullReplicas":"0",
  "replicationFactor":"2",
  "shards":{
    "shard1":{
      "range":"80000000-ffffffff",
      "state":"active",
      "replicas":{
        "core_node3":{
          "core":"testSimple2_shard1_replica_n1",
          "base_url":"http://127.0.0.1:45075/solr",
          "node_name":"127.0.0.1:45075_solr",
          "state":"down",
          "type":"NRT",
          "force_set_state":"false"},
        "core_node5":{
          "core":"testSimple2_shard1_replica_n2",
          "base_url":"http://127.0.0.1:33851/solr",
          "node_name":"127.0.0.1:33851_solr",
          "state":"active",
          "type":"NRT",
          "force_set_state":"false",
          "leader":"true"},
        "core_node12":{
          "core":"testSimple2_shard1_replica_n11",
          "base_url":"http://127.0.0.1:33851/solr",
          "state":"down",
          "node_name":"127.0.0.1:33851_solr",
          "type":"NRT"}}},
    "shard2":{
      "range":"0-7fffffff",
      "state":"active",
      "replicas":{
        "core_node8":{
          "core":"testSimple2_shard2_replica_n6",
          "base_url":"http://127.0.0.1:33851/solr",
          "node_name":"127.0.0.1:33851_solr",
          "state":"active",
          "type":"NRT",
          "force_set_state":"false",
          "leader":"true"},
        "core_node10":{
          "core":"testSimple2_shard2_replica_n9",
          "base_url":"http://127.0.0.1:33851/solr",
          "node_name":"127.0.0.1:33851_solr",
          "state":"active",
          "type":"NRT",
          "force_set_state":"false"}}}},
  "router":{"name":"compositeId"},
  "maxShardsPerNode":"2",
  "autoAddReplicas":"true",
  "nrtReplicas":"2",
  "tlogReplicas":"0"}
	at __randomizedtesting.SeedInfo.seed([52323D96BB7A3C25:6A8119689C89E8F4]:0)
	at org.junit.Assert.fail(Assert.java:88)
	at org.apache.solr.cloud.SolrCloudTestCase.waitForState(SolrCloudTestCase.java:310)
	at org.apache.solr.cloud.autoscaling.AutoAddReplicasIntegrationTest.testSimple(AutoAddReplicasIntegrationTest.java:169)
	at sun.reflect.NativeMethodAccessorImpl.invoke0(Native Method)
	at sun.reflect.NativeMethodAccessorImpl.invoke(NativeMethodAccessorImpl.java:62)
	at sun.reflect.DelegatingMethodAccessorImpl.invoke(DelegatingMethodAccessorImpl.java:43)
	at java.lang.reflect.Method.invoke(Method.java:498)
	at com.carrotsearch.randomizedtesting.RandomizedRunner.invoke(RandomizedRunner.java:1750)
	at com.carrotsearch.randomizedtesting.RandomizedRunner$8.evaluate(RandomizedRunner.java:938)
	at com.carrotsearch.randomizedtesting.RandomizedRunner$9.evaluate(RandomizedRunner.java:974)
	at com.carrotsearch.randomizedtesting.RandomizedRunner$10.evaluate(RandomizedRunner.java:988)
	at com.carrotsearch.randomizedtesting.rules.SystemPropertiesRestoreRule$1.evaluate(SystemPropertiesRestoreRule.java:57)
	at org.apache.lucene.util.TestRuleSetupTeardownChained$1.evaluate(TestRuleSetupTeardownChained.java:49)
	at org.apache.lucene.util.AbstractBeforeAfterRule$1.evaluate(AbstractBeforeAfterRule.java:45)
	at org.apache.lucene.util.TestRuleThreadAndTestName$1.evaluate(TestRuleThreadAndTestName.java:48)
	at org.apache.lucene.util.TestRuleIgnoreAfterMaxFailures$1.evaluate(TestRuleIgnoreAfterMaxFailures.java:64)
	at org.apache.lucene.util.TestRuleMarkFailure$1.evaluate(TestRuleMarkFailure.java:47)
	at com.carrotsearch.randomizedtesting.rules.StatementAdapter.evaluate(StatementAdapter.java:36)
	at com.carrotsearch.randomizedtesting.ThreadLeakControl$StatementRunner.run(ThreadLeakControl.java:368)
	at com.carrotsearch.randomizedtesting.ThreadLeakControl.forkTimeoutingTask(ThreadLeakControl.java:817)
	at com.carrotsearch.randomizedtesting.ThreadLeakControl$3.evaluate(ThreadLeakControl.java:468)
	at com.carrotsearch.randomizedtesting.RandomizedRunner.runSingleTest(RandomizedRunner.java:947)
	at com.carrotsearch.randomizedtesting.RandomizedRunner$5.evaluate(RandomizedRunner.java:832)
	at com.carrotsearch.randomizedtesting.RandomizedRunner$6.evaluate(RandomizedRunner.java:883)
	at com.carrotsearch.randomizedtesting.RandomizedRunner$7.evaluate(RandomizedRunner.java:894)
	at com.carrotsearch.randomizedtesting.rules.StatementAdapter.evaluate(StatementAdapter.java:36)
	at com.carrotsearch.randomizedtesting.rules.SystemPropertiesRestoreRule$1.evaluate(SystemPropertiesRestoreRule.java:57)
	at org.apache.lucene.util.AbstractBeforeAfterRule$1.evaluate(AbstractBeforeAfterRule.java:45)
	at com.carrotsearch.randomizedtesting.rules.StatementAdapter.evaluate(StatementAdapter.java:36)
	at org.apache.lucene.util.TestRuleStoreClassName$1.evaluate(TestRuleStoreClassName.java:41)
	at com.carrotsearch.randomizedtesting.rules.NoShadowingOrOverridesOnMethodsRule$1.evaluate(NoShadowingOrOverridesOnMethodsRule.java:40)
	at com.carrotsearch.randomizedtesting.rules.NoShadowingOrOverridesOnMethodsRule$1.evaluate(NoShadowingOrOverridesOnMethodsRule.java:40)
	at com.carrotsearch.randomizedtesting.rules.StatementAdapter.evaluate(StatementAdapter.java:36)
	at com.carrotsearch.randomizedtesting.rules.StatementAdapter.evaluate(StatementAdapter.java:36)
	at com.carrotsearch.randomizedtesting.rules.StatementAdapter.evaluate(StatementAdapter.java:36)
	at org.apache.lucene.util.TestRuleAssertionsRequired$1.evaluate(TestRuleAssertionsRequired.java:53)
	at org.apache.lucene.util.TestRuleMarkFailure$1.evaluate(TestRuleMarkFailure.java:47)
	at org.apache.lucene.util.TestRuleIgnoreAfterMaxFailures$1.evaluate(TestRuleIgnoreAfterMaxFailures.java:64)
	at org.apache.lucene.util.TestRuleIgnoreTestSuites$1.evaluate(TestRuleIgnoreTestSuites.java:54)
	at com.carrotsearch.randomizedtesting.rules.StatementAdapter.evaluate(StatementAdapter.java:36)
	at com.carrotsearch.randomizedtesting.ThreadLeakControl$StatementRunner.run(ThreadLeakControl.java:368)
	at java.lang.Thread.run(Thread.java:748)




Build Log:
[...truncated 13656 lines...]
   [junit4] Suite: org.apache.solr.cloud.autoscaling.AutoAddReplicasIntegrationTest
   [junit4]   2> 330772 INFO  (SUITE-AutoAddReplicasIntegrationTest-seed#[52323D96BB7A3C25]-worker) [     ] o.a.s.SolrTestCaseJ4 SecureRandom sanity checks: test.solr.allowed.securerandom=null & java.security.egd=file:/dev/./urandom
   [junit4]   2> Creating dataDir: /home/jenkins/workspace/Lucene-Solr-8.2-Linux/solr/build/solr-core/test/J2/temp/solr.cloud.autoscaling.AutoAddReplicasIntegrationTest_52323D96BB7A3C25-001/init-core-data-001
   [junit4]   2> 330772 WARN  (SUITE-AutoAddReplicasIntegrationTest-seed#[52323D96BB7A3C25]-worker) [     ] o.a.s.SolrTestCaseJ4 startTrackingSearchers: numOpens=23 numCloses=23
   [junit4]   2> 330772 INFO  (SUITE-AutoAddReplicasIntegrationTest-seed#[52323D96BB7A3C25]-worker) [     ] o.a.s.SolrTestCaseJ4 Using PointFields (NUMERIC_POINTS_SYSPROP=true) w/NUMERIC_DOCVALUES_SYSPROP=false
   [junit4]   2> 330773 INFO  (SUITE-AutoAddReplicasIntegrationTest-seed#[52323D96BB7A3C25]-worker) [     ] o.a.s.SolrTestCaseJ4 Randomized ssl (false) and clientAuth (true) via: @org.apache.solr.util.RandomizeSSL(reason=, ssl=NaN, value=NaN, clientAuth=NaN)
   [junit4]   2> 330776 INFO  (TEST-AutoAddReplicasIntegrationTest.testSimple-seed#[52323D96BB7A3C25]) [     ] o.a.s.SolrTestCaseJ4 ###Starting testSimple
   [junit4]   2> 330777 INFO  (TEST-AutoAddReplicasIntegrationTest.testSimple-seed#[52323D96BB7A3C25]) [     ] o.a.s.c.MiniSolrCloudCluster Starting cluster of 3 servers in /home/jenkins/workspace/Lucene-Solr-8.2-Linux/solr/build/solr-core/test/J2/temp/solr.cloud.autoscaling.AutoAddReplicasIntegrationTest_52323D96BB7A3C25-001/tempDir-001
   [junit4]   2> 330777 INFO  (TEST-AutoAddReplicasIntegrationTest.testSimple-seed#[52323D96BB7A3C25]) [     ] o.a.s.c.ZkTestServer STARTING ZK TEST SERVER
   [junit4]   2> 330778 INFO  (ZkTestServer Run Thread) [     ] o.a.s.c.ZkTestServer client port:0.0.0.0/0.0.0.0:0
   [junit4]   2> 330778 INFO  (ZkTestServer Run Thread) [     ] o.a.s.c.ZkTestServer Starting server
   [junit4]   2> 330878 INFO  (TEST-AutoAddReplicasIntegrationTest.testSimple-seed#[52323D96BB7A3C25]) [     ] o.a.s.c.ZkTestServer start zk server on port:39679
   [junit4]   2> 330878 INFO  (TEST-AutoAddReplicasIntegrationTest.testSimple-seed#[52323D96BB7A3C25]) [     ] o.a.s.c.ZkTestServer parse host and port list: 127.0.0.1:39679
   [junit4]   2> 330878 INFO  (TEST-AutoAddReplicasIntegrationTest.testSimple-seed#[52323D96BB7A3C25]) [     ] o.a.s.c.ZkTestServer connecting to 127.0.0.1 39679
   [junit4]   2> 330879 INFO  (TEST-AutoAddReplicasIntegrationTest.testSimple-seed#[52323D96BB7A3C25]) [     ] o.a.s.c.c.ConnectionManager Waiting for client to connect to ZooKeeper
   [junit4]   2> 330881 INFO  (zkConnectionManagerCallback-2188-thread-1) [     ] o.a.s.c.c.ConnectionManager zkClient has connected
   [junit4]   2> 330881 INFO  (TEST-AutoAddReplicasIntegrationTest.testSimple-seed#[52323D96BB7A3C25]) [     ] o.a.s.c.c.ConnectionManager Client is connected to ZooKeeper
   [junit4]   2> 330888 INFO  (TEST-AutoAddReplicasIntegrationTest.testSimple-seed#[52323D96BB7A3C25]) [     ] o.a.s.c.c.ConnectionManager Waiting for client to connect to ZooKeeper
   [junit4]   2> 330890 INFO  (zkConnectionManagerCallback-2190-thread-1) [     ] o.a.s.c.c.ConnectionManager zkClient has connected
   [junit4]   2> 330890 INFO  (TEST-AutoAddReplicasIntegrationTest.testSimple-seed#[52323D96BB7A3C25]) [     ] o.a.s.c.c.ConnectionManager Client is connected to ZooKeeper
   [junit4]   2> 330894 INFO  (TEST-AutoAddReplicasIntegrationTest.testSimple-seed#[52323D96BB7A3C25]) [     ] o.a.s.c.c.ConnectionManager Waiting for client to connect to ZooKeeper
   [junit4]   2> 330897 INFO  (zkConnectionManagerCallback-2192-thread-1) [     ] o.a.s.c.c.ConnectionManager zkClient has connected
   [junit4]   2> 330897 INFO  (TEST-AutoAddReplicasIntegrationTest.testSimple-seed#[52323D96BB7A3C25]) [     ] o.a.s.c.c.ConnectionManager Client is connected to ZooKeeper
   [junit4]   2> 331005 WARN  (jetty-launcher-2193-thread-3) [     ] o.e.j.s.AbstractConnector Ignoring deprecated socket close linger time
   [junit4]   2> 331005 WARN  (jetty-launcher-2193-thread-2) [     ] o.e.j.s.AbstractConnector Ignoring deprecated socket close linger time
   [junit4]   2> 331005 WARN  (jetty-launcher-2193-thread-1) [     ] o.e.j.s.AbstractConnector Ignoring deprecated socket close linger time
   [junit4]   2> 331005 INFO  (jetty-launcher-2193-thread-1) [     ] o.a.s.c.s.e.JettySolrRunner Start Jetty (original configured port=0)
   [junit4]   2> 331005 INFO  (jetty-launcher-2193-thread-2) [     ] o.a.s.c.s.e.JettySolrRunner Start Jetty (original configured port=0)
   [junit4]   2> 331005 INFO  (jetty-launcher-2193-thread-3) [     ] o.a.s.c.s.e.JettySolrRunner Start Jetty (original configured port=0)
   [junit4]   2> 331005 INFO  (jetty-launcher-2193-thread-1) [     ] o.a.s.c.s.e.JettySolrRunner Trying to start Jetty on port 0 try number 1 ...
   [junit4]   2> 331005 INFO  (jetty-launcher-2193-thread-3) [     ] o.a.s.c.s.e.JettySolrRunner Trying to start Jetty on port 0 try number 1 ...
   [junit4]   2> 331005 INFO  (jetty-launcher-2193-thread-2) [     ] o.a.s.c.s.e.JettySolrRunner Trying to start Jetty on port 0 try number 1 ...
   [junit4]   2> 331005 INFO  (jetty-launcher-2193-thread-1) [     ] o.e.j.s.Server jetty-9.4.19.v20190610; built: 2019-06-10T16:30:51.723Z; git: afcf563148970e98786327af5e07c261fda175d3; jvm 1.8.0_201-b09
   [junit4]   2> 331005 INFO  (jetty-launcher-2193-thread-2) [     ] o.e.j.s.Server jetty-9.4.19.v20190610; built: 2019-06-10T16:30:51.723Z; git: afcf563148970e98786327af5e07c261fda175d3; jvm 1.8.0_201-b09
   [junit4]   2> 331005 INFO  (jetty-launcher-2193-thread-3) [     ] o.e.j.s.Server jetty-9.4.19.v20190610; built: 2019-06-10T16:30:51.723Z; git: afcf563148970e98786327af5e07c261fda175d3; jvm 1.8.0_201-b09
   [junit4]   2> 331006 INFO  (jetty-launcher-2193-thread-3) [     ] o.e.j.s.session DefaultSessionIdManager workerName=node0
   [junit4]   2> 331006 INFO  (jetty-launcher-2193-thread-3) [     ] o.e.j.s.session No SessionScavenger set, using defaults
   [junit4]   2> 331006 INFO  (jetty-launcher-2193-thread-3) [     ] o.e.j.s.session node0 Scavenging every 600000ms
   [junit4]   2> 331006 INFO  (jetty-launcher-2193-thread-1) [     ] o.e.j.s.session DefaultSessionIdManager workerName=node0
   [junit4]   2> 331006 INFO  (jetty-launcher-2193-thread-1) [     ] o.e.j.s.session No SessionScavenger set, using defaults
   [junit4]   2> 331006 INFO  (jetty-launcher-2193-thread-1) [     ] o.e.j.s.session node0 Scavenging every 600000ms
   [junit4]   2> 331006 INFO  (jetty-launcher-2193-thread-2) [     ] o.e.j.s.session DefaultSessionIdManager workerName=node0
   [junit4]   2> 331006 INFO  (jetty-launcher-2193-thread-2) [     ] o.e.j.s.session No SessionScavenger set, using defaults
   [junit4]   2> 331006 INFO  (jetty-launcher-2193-thread-2) [     ] o.e.j.s.session node0 Scavenging every 600000ms
   [junit4]   2> 331006 INFO  (jetty-launcher-2193-thread-3) [     ] o.e.j.s.h.ContextHandler Started o.e.j.s.ServletContextHandler@403158b1{/solr,null,AVAILABLE}
   [junit4]   2> 331006 INFO  (jetty-launcher-2193-thread-1) [     ] o.e.j.s.h.ContextHandler Started o.e.j.s.ServletContextHandler@6ac5462d{/solr,null,AVAILABLE}
   [junit4]   2> 331007 INFO  (jetty-launcher-2193-thread-2) [     ] o.e.j.s.h.ContextHandler Started o.e.j.s.ServletContextHandler@3b29e68a{/solr,null,AVAILABLE}
   [junit4]   2> 331007 INFO  (jetty-launcher-2193-thread-3) [     ] o.e.j.s.AbstractConnector Started ServerConnector@4e818a91{HTTP/1.1,[http/1.1, h2c]}{127.0.0.1:33851}
   [junit4]   2> 331007 INFO  (jetty-launcher-2193-thread-3) [     ] o.e.j.s.Server Started @331059ms
   [junit4]   2> 331007 INFO  (jetty-launcher-2193-thread-3) [     ] o.a.s.c.s.e.JettySolrRunner Jetty properties: {hostContext=/solr, hostPort=33851}
   [junit4]   2> 331007 INFO  (jetty-launcher-2193-thread-1) [     ] o.e.j.s.AbstractConnector Started ServerConnector@6d668869{HTTP/1.1,[http/1.1, h2c]}{127.0.0.1:45075}
   [junit4]   2> 331007 INFO  (jetty-launcher-2193-thread-1) [     ] o.e.j.s.Server Started @331059ms
   [junit4]   2> 331007 INFO  (jetty-launcher-2193-thread-1) [     ] o.a.s.c.s.e.JettySolrRunner Jetty properties: {hostContext=/solr, hostPort=45075}
   [junit4]   2> 331007 INFO  (jetty-launcher-2193-thread-2) [     ] o.e.j.s.AbstractConnector Started ServerConnector@7af4cfae{HTTP/1.1,[http/1.1, h2c]}{127.0.0.1:40491}
   [junit4]   2> 331007 INFO  (jetty-launcher-2193-thread-2) [     ] o.e.j.s.Server Started @331059ms
   [junit4]   2> 331007 INFO  (jetty-launcher-2193-thread-2) [     ] o.a.s.c.s.e.JettySolrRunner Jetty properties: {hostContext=/solr, hostPort=40491}
   [junit4]   2> 331007 ERROR (jetty-launcher-2193-thread-3) [     ] o.a.s.u.StartupLoggingUtils Missing Java Option solr.log.dir. Logging may be missing or incomplete.
   [junit4]   2> 331007 INFO  (jetty-launcher-2193-thread-3) [     ] o.a.s.s.SolrDispatchFilter Using logger factory org.apache.logging.slf4j.Log4jLoggerFactory
   [junit4]   2> 331007 INFO  (jetty-launcher-2193-thread-3) [     ] o.a.s.s.SolrDispatchFilter  ___      _       Welcome to Apache Solr™ version 8.2.0
   [junit4]   2> 331007 ERROR (jetty-launcher-2193-thread-1) [     ] o.a.s.u.StartupLoggingUtils Missing Java Option solr.log.dir. Logging may be missing or incomplete.
   [junit4]   2> 331007 INFO  (jetty-launcher-2193-thread-1) [     ] o.a.s.s.SolrDispatchFilter Using logger factory org.apache.logging.slf4j.Log4jLoggerFactory
   [junit4]   2> 331007 INFO  (jetty-launcher-2193-thread-3) [     ] o.a.s.s.SolrDispatchFilter / __| ___| |_ _   Starting in cloud mode on port null
   [junit4]   2> 331007 INFO  (jetty-launcher-2193-thread-3) [     ] o.a.s.s.SolrDispatchFilter \__ \/ _ \ | '_|  Install dir: null
   [junit4]   2> 331007 INFO  (jetty-launcher-2193-thread-1) [     ] o.a.s.s.SolrDispatchFilter  ___      _       Welcome to Apache Solr™ version 8.2.0
   [junit4]   2> 331007 ERROR (jetty-launcher-2193-thread-2) [     ] o.a.s.u.StartupLoggingUtils Missing Java Option solr.log.dir. Logging may be missing or incomplete.
   [junit4]   2> 331007 INFO  (jetty-launcher-2193-thread-2) [     ] o.a.s.s.SolrDispatchFilter Using logger factory org.apache.logging.slf4j.Log4jLoggerFactory
   [junit4]   2> 331007 INFO  (jetty-launcher-2193-thread-3) [     ] o.a.s.s.SolrDispatchFilter |___/\___/_|_|    Start time: 2019-07-25T02:10:59.392Z
   [junit4]   2> 331007 INFO  (jetty-launcher-2193-thread-1) [     ] o.a.s.s.SolrDispatchFilter / __| ___| |_ _   Starting in cloud mode on port null
   [junit4]   2> 331007 INFO  (jetty-launcher-2193-thread-2) [     ] o.a.s.s.SolrDispatchFilter  ___      _       Welcome to Apache Solr™ version 8.2.0
   [junit4]   2> 331007 INFO  (jetty-launcher-2193-thread-1) [     ] o.a.s.s.SolrDispatchFilter \__ \/ _ \ | '_|  Install dir: null
   [junit4]   2> 331007 INFO  (jetty-launcher-2193-thread-2) [     ] o.a.s.s.SolrDispatchFilter / __| ___| |_ _   Starting in cloud mode on port null
   [junit4]   2> 331007 INFO  (jetty-launcher-2193-thread-2) [     ] o.a.s.s.SolrDispatchFilter \__ \/ _ \ | '_|  Install dir: null
   [junit4]   2> 331007 INFO  (jetty-launcher-2193-thread-1) [     ] o.a.s.s.SolrDispatchFilter |___/\___/_|_|    Start time: 2019-07-25T02:10:59.392Z
   [junit4]   2> 331007 INFO  (jetty-launcher-2193-thread-2) [     ] o.a.s.s.SolrDispatchFilter |___/\___/_|_|    Start time: 2019-07-25T02:10:59.392Z
   [junit4]   2> 331008 INFO  (jetty-launcher-2193-thread-3) [     ] o.a.s.c.c.ConnectionManager Waiting for client to connect to ZooKeeper
   [junit4]   2> 331008 INFO  (jetty-launcher-2193-thread-2) [     ] o.a.s.c.c.ConnectionManager Waiting for client to connect to ZooKeeper
   [junit4]   2> 331008 INFO  (jetty-launcher-2193-thread-1) [     ] o.a.s.c.c.ConnectionManager Waiting for client to connect to ZooKeeper
   [junit4]   2> 331009 INFO  (zkConnectionManagerCallback-2196-thread-1) [     ] o.a.s.c.c.ConnectionManager zkClient has connected
   [junit4]   2> 331009 INFO  (jetty-launcher-2193-thread-3) [     ] o.a.s.c.c.ConnectionManager Client is connected to ZooKeeper
   [junit4]   2> 331009 INFO  (zkConnectionManagerCallback-2199-thread-1) [     ] o.a.s.c.c.ConnectionManager zkClient has connected
   [junit4]   2> 331009 INFO  (jetty-launcher-2193-thread-1) [     ] o.a.s.c.c.ConnectionManager Client is connected to ZooKeeper
   [junit4]   2> 331009 INFO  (zkConnectionManagerCallback-2197-thread-1) [     ] o.a.s.c.c.ConnectionManager zkClient has connected
   [junit4]   2> 331009 INFO  (jetty-launcher-2193-thread-2) [     ] o.a.s.c.c.ConnectionManager Client is connected to ZooKeeper
   [junit4]   2> 331009 INFO  (jetty-launcher-2193-thread-3) [     ] o.a.s.s.SolrDispatchFilter solr.xml found in ZooKeeper. Loading...
   [junit4]   2> 331009 INFO  (jetty-launcher-2193-thread-1) [     ] o.a.s.s.SolrDispatchFilter solr.xml found in ZooKeeper. Loading...
   [junit4]   2> 331009 INFO  (jetty-launcher-2193-thread-2) [     ] o.a.s.s.SolrDispatchFilter solr.xml found in ZooKeeper. Loading...
   [junit4]   2> 331012 INFO  (jetty-launcher-2193-thread-3) [     ] o.a.s.c.SolrXmlConfig Configuration parameter autoReplicaFailoverWorkLoopDelay is ignored
   [junit4]   2> 331012 INFO  (jetty-launcher-2193-thread-2) [     ] o.a.s.c.SolrXmlConfig Configuration parameter autoReplicaFailoverWorkLoopDelay is ignored
   [junit4]   2> 331012 INFO  (jetty-launcher-2193-thread-3) [     ] o.a.s.c.SolrXmlConfig Configuration parameter autoReplicaFailoverBadNodeExpiration is ignored
   [junit4]   2> 331012 INFO  (jetty-launcher-2193-thread-2) [     ] o.a.s.c.SolrXmlConfig Configuration parameter autoReplicaFailoverBadNodeExpiration is ignored
   [junit4]   2> 331012 INFO  (jetty-launcher-2193-thread-1) [     ] o.a.s.c.SolrXmlConfig Configuration parameter autoReplicaFailoverWorkLoopDelay is ignored
   [junit4]   2> 331012 INFO  (jetty-launcher-2193-thread-1) [     ] o.a.s.c.SolrXmlConfig Configuration parameter autoReplicaFailoverBadNodeExpiration is ignored
   [junit4]   2> 331013 INFO  (jetty-launcher-2193-thread-2) [     ] o.a.s.c.SolrXmlConfig MBean server found: com.sun.jmx.mbeanserver.JmxMBeanServer@29ca8410, but no JMX reporters were configured - adding default JMX reporter.
   [junit4]   2> 331013 INFO  (jetty-launcher-2193-thread-1) [     ] o.a.s.c.SolrXmlConfig MBean server found: com.sun.jmx.mbeanserver.JmxMBeanServer@29ca8410, but no JMX reporters were configured - adding default JMX reporter.
   [junit4]   2> 331013 INFO  (jetty-launcher-2193-thread-3) [     ] o.a.s.c.SolrXmlConfig MBean server found: com.sun.jmx.mbeanserver.JmxMBeanServer@29ca8410, but no JMX reporters were configured - adding default JMX reporter.
   [junit4]   2> 331153 INFO  (jetty-launcher-2193-thread-2) [     ] o.a.s.h.c.HttpShardHandlerFactory Host whitelist initialized: WhitelistHostChecker [whitelistHosts=null, whitelistHostCheckingEnabled=true]
   [junit4]   2> 331154 WARN  (jetty-launcher-2193-thread-2) [     ] o.e.j.u.s.S.config Trusting all certificates configured for Client@1f51f7d1[provider=null,keyStore=null,trustStore=null]
   [junit4]   2> 331154 WARN  (jetty-launcher-2193-thread-2) [     ] o.e.j.u.s.S.config No Client EndPointIdentificationAlgorithm configured for Client@1f51f7d1[provider=null,keyStore=null,trustStore=null]
   [junit4]   2> 331158 WARN  (jetty-launcher-2193-thread-2) [     ] o.e.j.u.s.S.config Trusting all certificates configured for Client@6fc6992c[provider=null,keyStore=null,trustStore=null]
   [junit4]   2> 331158 WARN  (jetty-launcher-2193-thread-2) [     ] o.e.j.u.s.S.config No Client EndPointIdentificationAlgorithm configured for Client@6fc6992c[provider=null,keyStore=null,trustStore=null]
   [junit4]   2> 331158 INFO  (jetty-launcher-2193-thread-2) [     ] o.a.s.c.ZkContainer Zookeeper client=127.0.0.1:39679/solr
   [junit4]   2> 331159 INFO  (jetty-launcher-2193-thread-2) [     ] o.a.s.c.c.ConnectionManager Waiting for client to connect to ZooKeeper
   [junit4]   2> 331160 INFO  (zkConnectionManagerCallback-2206-thread-1) [     ] o.a.s.c.c.ConnectionManager zkClient has connected
   [junit4]   2> 331160 INFO  (jetty-launcher-2193-thread-2) [     ] o.a.s.c.c.ConnectionManager Client is connected to ZooKeeper
   [junit4]   2> 331349 INFO  (jetty-launcher-2193-thread-1) [     ] o.a.s.h.c.HttpShardHandlerFactory Host whitelist initialized: WhitelistHostChecker [whitelistHosts=null, whitelistHostCheckingEnabled=true]
   [junit4]   2> 331350 WARN  (jetty-launcher-2193-thread-1) [     ] o.e.j.u.s.S.config Trusting all certificates configured for Client@17b50385[provider=null,keyStore=null,trustStore=null]
   [junit4]   2> 331350 WARN  (jetty-launcher-2193-thread-1) [     ] o.e.j.u.s.S.config No Client EndPointIdentificationAlgorithm configured for Client@17b50385[provider=null,keyStore=null,trustStore=null]
   [junit4]   2> 331352 WARN  (jetty-launcher-2193-thread-1) [     ] o.e.j.u.s.S.config Trusting all certificates configured for Client@667e1038[provider=null,keyStore=null,trustStore=null]
   [junit4]   2> 331352 WARN  (jetty-launcher-2193-thread-1) [     ] o.e.j.u.s.S.config No Client EndPointIdentificationAlgorithm configured for Client@667e1038[provider=null,keyStore=null,trustStore=null]
   [junit4]   2> 331353 INFO  (jetty-launcher-2193-thread-1) [     ] o.a.s.c.ZkContainer Zookeeper client=127.0.0.1:39679/solr
   [junit4]   2> 331356 INFO  (jetty-launcher-2193-thread-1) [     ] o.a.s.c.c.ConnectionManager Waiting for client to connect to ZooKeeper
   [junit4]   2> 331356 INFO  (zkConnectionManagerCallback-2214-thread-1) [     ] o.a.s.c.c.ConnectionManager zkClient has connected
   [junit4]   2> 331356 INFO  (jetty-launcher-2193-thread-1) [     ] o.a.s.c.c.ConnectionManager Client is connected to ZooKeeper
   [junit4]   2> 331421 INFO  (jetty-launcher-2193-thread-3) [     ] o.a.s.h.c.HttpShardHandlerFactory Host whitelist initialized: WhitelistHostChecker [whitelistHosts=null, whitelistHostCheckingEnabled=true]
   [junit4]   2> 331421 INFO  (jetty-launcher-2193-thread-2) [n:127.0.0.1:40491_solr     ] o.a.s.c.c.ConnectionManager Waiting for client to connect to ZooKeeper
   [junit4]   2> 331421 INFO  (zkConnectionManagerCallback-2216-thread-1) [     ] o.a.s.c.c.ConnectionManager zkClient has connected
   [junit4]   2> 331421 INFO  (jetty-launcher-2193-thread-2) [n:127.0.0.1:40491_solr     ] o.a.s.c.c.ConnectionManager Client is connected to ZooKeeper
   [junit4]   2> 331422 WARN  (jetty-launcher-2193-thread-3) [     ] o.e.j.u.s.S.config Trusting all certificates configured for Client@6ed53d77[provider=null,keyStore=null,trustStore=null]
   [junit4]   2> 331422 WARN  (jetty-launcher-2193-thread-3) [     ] o.e.j.u.s.S.config No Client EndPointIdentificationAlgorithm configured for Client@6ed53d77[provider=null,keyStore=null,trustStore=null]
   [junit4]   2> 331426 WARN  (jetty-launcher-2193-thread-3) [     ] o.e.j.u.s.S.config Trusting all certificates configured for Client@4bd748bc[provider=null,keyStore=null,trustStore=null]
   [junit4]   2> 331426 WARN  (jetty-launcher-2193-thread-3) [     ] o.e.j.u.s.S.config No Client EndPointIdentificationAlgorithm configured for Client@4bd748bc[provider=null,keyStore=null,trustStore=null]
   [junit4]   2> 331427 INFO  (jetty-launcher-2193-thread-3) [     ] o.a.s.c.ZkContainer Zookeeper client=127.0.0.1:39679/solr
   [junit4]   2> 331427 INFO  (jetty-launcher-2193-thread-3) [     ] o.a.s.c.c.ConnectionManager Waiting for client to connect to ZooKeeper
   [junit4]   2> 331428 INFO  (zkConnectionManagerCallback-2224-thread-1) [     ] o.a.s.c.c.ConnectionManager zkClient has connected
   [junit4]   2> 331428 INFO  (jetty-launcher-2193-thread-3) [     ] o.a.s.c.c.ConnectionManager Client is connected to ZooKeeper
   [junit4]   2> 331493 INFO  (jetty-launcher-2193-thread-2) [n:127.0.0.1:40491_solr     ] o.a.s.c.OverseerElectionContext I am going to be the leader 127.0.0.1:40491_solr
   [junit4]   2> 331494 INFO  (jetty-launcher-2193-thread-2) [n:127.0.0.1:40491_solr     ] o.a.s.c.Overseer Overseer (id=72058186381525000-127.0.0.1:40491_solr-n_0000000000) starting
   [junit4]   2> 331506 INFO  (jetty-launcher-2193-thread-2) [n:127.0.0.1:40491_solr     ] o.a.s.c.c.ConnectionManager Waiting for client to connect to ZooKeeper
   [junit4]   2> 331510 INFO  (zkConnectionManagerCallback-2229-thread-1) [     ] o.a.s.c.c.ConnectionManager zkClient has connected
   [junit4]   2> 331510 INFO  (jetty-launcher-2193-thread-2) [n:127.0.0.1:40491_solr     ] o.a.s.c.c.ConnectionManager Client is connected to ZooKeeper
   [junit4]   2> 331520 INFO  (jetty-launcher-2193-thread-2) [n:127.0.0.1:40491_solr     ] o.a.s.c.s.i.ZkClientClusterStateProvider Cluster at 127.0.0.1:39679/solr ready
   [junit4]   2> 331527 INFO  (jetty-launcher-2193-thread-1) [n:127.0.0.1:45075_solr     ] o.a.s.c.c.ConnectionManager Waiting for client to connect to ZooKeeper
   [junit4]   2> 331529 INFO  (OverseerStateUpdate-72058186381525000-127.0.0.1:40491_solr-n_0000000000) [n:127.0.0.1:40491_solr     ] o.a.s.c.Overseer Starting to work on the main queue : 127.0.0.1:40491_solr
   [junit4]   2> 331534 INFO  (jetty-launcher-2193-thread-2) [n:127.0.0.1:40491_solr     ] o.a.s.c.ZkController Register node as live in ZooKeeper:/live_nodes/127.0.0.1:40491_solr
   [junit4]   2> 331534 INFO  (zkConnectionManagerCallback-2231-thread-1) [     ] o.a.s.c.c.ConnectionManager zkClient has connected
   [junit4]   2> 331534 INFO  (jetty-launcher-2193-thread-1) [n:127.0.0.1:45075_solr     ] o.a.s.c.c.ConnectionManager Client is connected to ZooKeeper
   [junit4]   2> 331538 INFO  (zkCallback-2215-thread-1) [     ] o.a.s.c.c.ZkStateReader Updated live nodes from ZooKeeper... (0) -> (1)
   [junit4]   2> 331542 INFO  (zkCallback-2228-thread-1) [     ] o.a.s.c.c.ZkStateReader Updated live nodes from ZooKeeper... (0) -> (1)
   [junit4]   2> 331560 INFO  (jetty-launcher-2193-thread-1) [n:127.0.0.1:45075_solr     ] o.a.s.c.c.ZkStateReader Updated live nodes from ZooKeeper... (0) -> (1)
   [junit4]   2> 331564 INFO  (jetty-launcher-2193-thread-1) [n:127.0.0.1:45075_solr     ] o.a.s.c.ZkController Publish node=127.0.0.1:45075_solr as DOWN
   [junit4]   2> 331564 INFO  (jetty-launcher-2193-thread-1) [n:127.0.0.1:45075_solr     ] o.a.s.c.TransientSolrCoreCacheDefault Allocating transient cache for 4 transient cores
   [junit4]   2> 331564 INFO  (jetty-launcher-2193-thread-1) [n:127.0.0.1:45075_solr     ] o.a.s.c.ZkController Register node as live in ZooKeeper:/live_nodes/127.0.0.1:45075_solr
   [junit4]   2> 331582 INFO  (jetty-launcher-2193-thread-2) [n:127.0.0.1:40491_solr     ] o.a.s.h.a.MetricsHistoryHandler No .system collection, keeping metrics history in memory.
   [junit4]   2> 331583 INFO  (zkCallback-2228-thread-1) [     ] o.a.s.c.c.ZkStateReader Updated live nodes from ZooKeeper... (1) -> (2)
   [junit4]   2> 331584 INFO  (zkCallback-2230-thread-1) [     ] o.a.s.c.c.ZkStateReader Updated live nodes from ZooKeeper... (1) -> (2)
   [junit4]   2> 331600 INFO  (jetty-launcher-2193-thread-2) [n:127.0.0.1:40491_solr     ] o.a.s.m.r.SolrJmxReporter JMX monitoring for 'solr.node' (registry 'solr.node') enabled at server: com.sun.jmx.mbeanserver.JmxMBeanServer@29ca8410
   [junit4]   2> 331606 INFO  (zkCallback-2215-thread-2) [     ] o.a.s.c.c.ZkStateReader Updated live nodes from ZooKeeper... (1) -> (2)
   [junit4]   2> 331608 INFO  (jetty-launcher-2193-thread-2) [n:127.0.0.1:40491_solr     ] o.a.s.m.r.SolrJmxReporter JMX monitoring for 'solr.jvm' (registry 'solr.jvm') enabled at server: com.sun.jmx.mbeanserver.JmxMBeanServer@29ca8410
   [junit4]   2> 331608 INFO  (jetty-launcher-2193-thread-2) [n:127.0.0.1:40491_solr     ] o.a.s.m.r.SolrJmxReporter JMX monitoring for 'solr.jetty' (registry 'solr.jetty') enabled at server: com.sun.jmx.mbeanserver.JmxMBeanServer@29ca8410
   [junit4]   2> 331609 INFO  (jetty-launcher-2193-thread-2) [n:127.0.0.1:40491_solr     ] o.a.s.c.CorePropertiesLocator Found 0 core definitions underneath /home/jenkins/workspace/Lucene-Solr-8.2-Linux/solr/build/solr-core/test/J2/temp/solr.cloud.autoscaling.AutoAddReplicasIntegrationTest_52323D96BB7A3C25-001/tempDir-001/node2/.
   [junit4]   2> 331610 INFO  (jetty-launcher-2193-thread-1) [n:127.0.0.1:45075_solr     ] o.a.s.c.c.ConnectionManager Waiting for client to connect to ZooKeeper
   [junit4]   2> 331654 INFO  (zkConnectionManagerCallback-2239-thread-1) [     ] o.a.s.c.c.ConnectionManager zkClient has connected
   [junit4]   2> 331654 INFO  (jetty-launcher-2193-thread-3) [n:127.0.0.1:33851_solr     ] o.a.s.c.c.ConnectionManager Waiting for client to connect to ZooKeeper
   [junit4]   2> 331654 INFO  (jetty-launcher-2193-thread-1) [n:127.0.0.1:45075_solr     ] o.a.s.c.c.ConnectionManager Client is connected to ZooKeeper
   [junit4]   2> 331662 INFO  (zkConnectionManagerCallback-2241-thread-1) [     ] o.a.s.c.c.ConnectionManager zkClient has connected
   [junit4]   2> 331662 INFO  (jetty-launcher-2193-thread-3) [n:127.0.0.1:33851_solr     ] o.a.s.c.c.ConnectionManager Client is connected to ZooKeeper
   [junit4]   2> 331670 INFO  (jetty-launcher-2193-thread-1) [n:127.0.0.1:45075_solr     ] o.a.s.c.c.ZkStateReader Updated live nodes from ZooKeeper... (0) -> (2)
   [junit4]   2> 331671 INFO  (jetty-launcher-2193-thread-3) [n:127.0.0.1:33851_solr     ] o.a.s.c.c.ZkStateReader Updated live nodes from ZooKeeper... (0) -> (2)
   [junit4]   2> 331671 INFO  (jetty-launcher-2193-thread-1) [n:127.0.0.1:45075_solr     ] o.a.s.c.s.i.ZkClientClusterStateProvider Cluster at 127.0.0.1:39679/solr ready
   [junit4]   2> 331674 INFO  (jetty-launcher-2193-thread-3) [n:127.0.0.1:33851_solr     ] o.a.s.c.ZkController Publish node=127.0.0.1:33851_solr as DOWN
   [junit4]   2> 331675 INFO  (jetty-launcher-2193-thread-3) [n:127.0.0.1:33851_solr     ] o.a.s.c.TransientSolrCoreCacheDefault Allocating transient cache for 4 transient cores
   [junit4]   2> 331675 INFO  (jetty-launcher-2193-thread-3) [n:127.0.0.1:33851_solr     ] o.a.s.c.ZkController Register node as live in ZooKeeper:/live_nodes/127.0.0.1:33851_solr
   [junit4]   2> 331676 INFO  (zkCallback-2215-thread-2) [     ] o.a.s.c.c.ZkStateReader Updated live nodes from ZooKeeper... (2) -> (3)
   [junit4]   2> 331676 INFO  (zkCallback-2228-thread-1) [     ] o.a.s.c.c.ZkStateReader Updated live nodes from ZooKeeper... (2) -> (3)
   [junit4]   2> 331676 INFO  (zkCallback-2230-thread-1) [     ] o.a.s.c.c.ZkStateReader Updated live nodes from ZooKeeper... (2) -> (3)
   [junit4]   2> 331678 INFO  (zkCallback-2240-thread-1) [     ] o.a.s.c.c.ZkStateReader Updated live nodes from ZooKeeper... (2) -> (3)
   [junit4]   2> 331692 INFO  (jetty-launcher-2193-thread-3) [n:127.0.0.1:33851_solr     ] o.a.s.c.c.ConnectionManager Waiting for client to connect to ZooKeeper
   [junit4]   2> 331694 INFO  (zkCallback-2238-thread-1) [     ] o.a.s.c.c.ZkStateReader Updated live nodes from ZooKeeper... (2) -> (3)
   [junit4]   2> 331698 INFO  (jetty-launcher-2193-thread-1) [n:127.0.0.1:45075_solr     ] o.a.s.h.a.MetricsHistoryHandler No .system collection, keeping metrics history in memory.
   [junit4]   2> 331706 INFO  (zkConnectionManagerCallback-2248-thread-1) [     ] o.a.s.c.c.ConnectionManager zkClient has connected
   [junit4]   2> 331706 INFO  (jetty-launcher-2193-thread-3) [n:127.0.0.1:33851_solr     ] o.a.s.c.c.ConnectionManager Client is connected to ZooKeeper
   [junit4]   2> 331714 INFO  (jetty-launcher-2193-thread-3) [n:127.0.0.1:33851_solr     ] o.a.s.c.c.ZkStateReader Updated live nodes from ZooKeeper... (0) -> (3)
   [junit4]   2> 331715 INFO  (jetty-launcher-2193-thread-1) [n:127.0.0.1:45075_solr     ] o.a.s.m.r.SolrJmxReporter JMX monitoring for 'solr.node' (registry 'solr.node') enabled at server: com.sun.jmx.mbeanserver.JmxMBeanServer@29ca8410
   [junit4]   2> 331716 INFO  (jetty-launcher-2193-thread-3) [n:127.0.0.1:33851_solr     ] o.a.s.c.s.i.ZkClientClusterStateProvider Cluster at 127.0.0.1:39679/solr ready
   [junit4]   2> 331724 INFO  (jetty-launcher-2193-thread-1) [n:127.0.0.1:45075_solr     ] o.a.s.m.r.SolrJmxReporter JMX monitoring for 'solr.jvm' (registry 'solr.jvm') enabled at server: com.sun.jmx.mbeanserver.JmxMBeanServer@29ca8410
   [junit4]   2> 331724 INFO  (jetty-launcher-2193-thread-1) [n:127.0.0.1:45075_solr     ] o.a.s.m.r.SolrJmxReporter JMX monitoring for 'solr.jetty' (registry 'solr.jetty') enabled at server: com.sun.jmx.mbeanserver.JmxMBeanServer@29ca8410
   [junit4]   2> 331725 INFO  (jetty-launcher-2193-thread-1) [n:127.0.0.1:45075_solr     ] o.a.s.c.CorePropertiesLocator Found 0 core definitions underneath /home/jenkins/workspace/Lucene-Solr-8.2-Linux/solr/build/solr-core/test/J2/temp/solr.cloud.autoscaling.AutoAddReplicasIntegrationTest_52323D96BB7A3C25-001/tempDir-001/node1/.
   [junit4]   2> 331734 INFO  (jetty-launcher-2193-thread-3) [n:127.0.0.1:33851_solr     ] o.a.s.h.a.MetricsHistoryHandler No .system collection, keeping metrics history in memory.
   [junit4]   2> 331751 INFO  (jetty-launcher-2193-thread-3) [n:127.0.0.1:33851_solr     ] o.a.s.m.r.SolrJmxReporter JMX monitoring for 'solr.node' (registry 'solr.node') enabled at server: com.sun.jmx.mbeanserver.JmxMBeanServer@29ca8410
   [junit4]   2> 331756 WARN  (jetty-launcher-2193-thread-1) [n:127.0.0.1:45075_solr     ] o.a.s.m.r.j.JmxMetricsReporter Unable to register gauge
   [junit4]   2>           => javax.management.InstanceNotFoundException: solr:dom1=jvm,name0=memory,name1=pools,name2=PS-Survivor-Space,name=max
   [junit4]   2> 	at com.sun.jmx.interceptor.DefaultMBeanServerInterceptor.getMBean(DefaultMBeanServerInterceptor.java:1095)
   [junit4]   2> javax.management.InstanceNotFoundException: solr:dom1=jvm,name0=memory,name1=pools,name2=PS-Survivor-Space,name=max
   [junit4]   2> 	at com.sun.jmx.interceptor.DefaultMBeanServerInterceptor.getMBean(DefaultMBeanServerInterceptor.java:1095) ~[?:1.8.0_201]
   [junit4]   2> 	at com.sun.jmx.interceptor.DefaultMBeanServerInterceptor.exclusiveUnregisterMBean(DefaultMBeanServerInterceptor.java:427) ~[?:1.8.0_201]
   [junit4]   2> 	at com.sun.jmx.interceptor.DefaultMBeanServerInterceptor.unregisterMBean(DefaultMBeanServerInterceptor.java:415) ~[?:1.8.0_201]
   [junit4]   2> 	at com.sun.jmx.mbeanserver.JmxMBeanServer.unregisterMBean(JmxMBeanServer.java:546) ~[?:1.8.0_201]
   [junit4]   2> 	at org.apache.solr.metrics.reporters.jmx.JmxMetricsReporter$JmxListener.registerMBean(JmxMetricsReporter.java:531) ~[java/:?]
   [junit4]   2> 	at org.apache.solr.metrics.reporters.jmx.JmxMetricsReporter$JmxListener.onGaugeAdded(JmxMetricsReporter.java:569) ~[java/:?]
   [junit4]   2> 	at com.codahale.metrics.MetricRegistry.notifyListenerOfAddedMetric(MetricRegistry.java:468) ~[metrics-core-4.0.5.jar:4.0.5]
   [junit4]   2> 	at com.codahale.metrics.MetricRegistry.onMetricAdded(MetricRegistry.java:462) ~[metrics-core-4.0.5.jar:4.0.5]
   [junit4]   2> 	at com.codahale.metrics.MetricRegistry.register(MetricRegistry.java:95) ~[metrics-core-4.0.5.jar:4.0.5]
   [junit4]   2> 	at org.apache.solr.metrics.SolrMetricManager.registerAll(SolrMetricManager.java:521) ~[java/:?]
   [junit4]   2> 	at org.apache.solr.servlet.SolrDispatchFilter.setupJvmMetrics(SolrDispatchFilter.java:212) ~[java/:?]
   [junit4]   2> 	at org.apache.solr.servlet.SolrDispatchFilter.init(SolrDispatchFilter.java:184) ~[java/:?]
   [junit4]   2> 	at org.eclipse.jetty.servlet.FilterHolder.initialize(FilterHolder.java:136) ~[jetty-servlet-9.4.19.v20190610.jar:9.4.19.v20190610]
   [junit4]   2> 	at org.eclipse.jetty.servlet.ServletHandler.lambda$initialize$0(ServletHandler.java:750) ~[jetty-servlet-9.4.19.v20190610.jar:9.4.19.v20190610]
   [junit4]   2> 	at java.util.Spliterators$ArraySpliterator.forEachRemaining(Spliterators.java:948) ~[?:1.8.0_201]
   [junit4]   2> 	at java.util.stream.Streams$ConcatSpliterator.forEachRemaining(Streams.java:742) ~[?:1.8.0_201]
   [junit4]   2> 	at java.util.stream.Streams$ConcatSpliterator.forEachRemaining(Streams.java:742) ~[?:1.8.0_201]
   [junit4]   2> 	at java.util.stream.ReferencePipeline$Head.forEach(ReferencePipeline.java:580) ~[?:1.8.0_201]
   [junit4]   2> 	at org.eclipse.jetty.servlet.ServletHandler.initialize(ServletHandler.java:744) ~[jetty-servlet-9.4.19.v20190610.jar:9.4.19.v20190610]
   [junit4]   2> 	at org.eclipse.jetty.servlet.ServletHandler.updateMappings(ServletHandler.java:1449) ~[jetty-servlet-9.4.19.v20190610.jar:9.4.19.v20190610]
   [junit4]   2> 	at org.eclipse.jetty.servlet.ServletHandler.setFilterMappings(ServletHandler.java:1513) ~[jetty-servlet-9.4.19.v20190610.jar:9.4.19.v20190610]
   [junit4]   2> 	at org.eclipse.jetty.servlet.ServletHandler.addFilterMapping(ServletHandler.java:1158) ~[jetty-servlet-9.4.19.v20190610.jar:9.4.19.v20190610]
   [junit4]   2> 	at org.eclipse.jetty.servlet.ServletHandler.addFilterWithMapping(ServletHandler.java:995) ~[jetty-servlet-9.4.19.v20190610.jar:9.4.19.v20190610]
   [junit4]   2> 	at org.eclipse.jetty.servlet.ServletContextHandler.addFilter(ServletContextHandler.java:468) ~[jetty-servlet-9.4.19.v20190610.jar:9.4.19.v20190610]
   [junit4]   2> 	at org.apache.solr.client.solrj.embedded.JettySolrRunner$1.lifeCycleStarted(JettySolrRunner.java:384) ~[java/:?]
   [junit4]   2> 	at org.eclipse.jetty.util.component.AbstractLifeCycle.setStarted(AbstractLifeCycle.java:179) ~[jetty-util-9.4.19.v20190610.jar:9.4.19.v20190610]
   [junit4]   2> 	at org.eclipse.jetty.util.component.AbstractLifeCycle.start(AbstractLifeCycle.java:69) ~[jetty-util-9.4.19.v20190610.jar:9.4.19.v20190610]
   [junit4]   2> 	at org.apache.solr.client.solrj.embedded.JettySolrRunner.retryOnPortBindFailure(JettySolrRunner.java:558) ~[java/:?]
   [junit4]   2> 	at org.apache.solr.client.solrj.embedded.JettySolrRunner.start(JettySolrRunner.java:497) ~[java/:?]
   [junit4]   2> 	at org.apache.solr.client.solrj.embedded.JettySolrRunner.start(JettySolrRunner.java:465) ~[java/:?]
   [junit4]   2> 	at org.apache.solr.cloud.MiniSolrCloudCluster.startJettySolrRunner(MiniSolrCloudCluster.java:467) ~[java/:?]
   [junit4]   2> 	at org.apache.solr.cloud.MiniSolrCloudCluster.lambda$new$0(MiniSolrCloudCluster.java:300) ~[java/:?]
   [junit4]   2> 	at java.util.concurrent.FutureTask.run(FutureTask.java:266) ~[?:1.8.0_201]
   [junit4]   2> 	at org.apache.solr.common.util.ExecutorUtil$MDCAwareThreadPoolExecutor.lambda$execute$0(ExecutorUtil.java:209) ~[java/:?]
   [junit4]   2> 	at java.util.concurrent.ThreadPoolExecutor.runWorker(ThreadPoolExecutor.java:1149) ~[?:1.8.0_201]
   [junit4]   2> 	at java.util.concurrent.ThreadPoolExecutor$Worker.run(ThreadPoolExecutor.java:624) ~[?:1.8.0_201]
   [junit4]   2> 	at java.lang.Thread.run(Thread.java:748) [?:1.8.0_201]
   [junit4]   2> 331757 WARN  (jetty-launcher-2193-thread-1) [n:127.0.0.1:45075_solr     ] o.a.s.m.r.j.JmxMetricsReporter Unable to register gauge
   [junit4]   2>           => javax.management.InstanceNotFoundException: solr:dom1=jvm,name0=memory,name1=pools,name2=PS-Old-Gen,name=usage
   [junit4]   2> 	at com.sun.jmx.interceptor.DefaultMBeanServerInterceptor.getMBean(DefaultMBeanServerInterceptor.java:1095)
   [junit4]   2> javax.management.InstanceNotFoundException: solr:dom1=jvm,name0=memory,name1=pools,name2=PS-Old-Gen,name=usage
   [junit4]   2> 	at com.sun.jmx.interceptor.DefaultMBeanServerInterceptor.getMBean(DefaultMBeanServerInterceptor.java:1095) ~[?:1.8.0_201]
   [junit4]   2> 	at com.sun.jmx.interceptor.DefaultMBeanServerInterceptor.exclusiveUnregisterMBean(DefaultMBeanServerInterceptor.java:427) ~[?:1.8.0_201]
   [junit4]   2> 	at com.sun.jmx.interceptor.DefaultMBeanServerInterceptor.unregisterMBean(DefaultMBeanServerInterceptor.java:415) ~[?:1.8.0_201]
   [junit4]   2> 	at com.sun.jmx.mbeanserver.JmxMBeanServer.unregisterMBean(JmxMBeanServer.java:546) ~[?:1.8.0_201]
   [junit4]   2> 	at org.apache.solr.metrics.reporters.jmx.JmxMetricsReporter$JmxListener.registerMBean(JmxMetricsReporter.java:531) ~[java/:?]
   [junit4]   2> 	at org.apache.solr.metrics.reporters.jmx.JmxMetricsReporter$JmxListener.onGaugeAdded(JmxMetricsReporter.java:569) ~[java/:?]
   [junit4]   2> 	at com.codahale.metrics.MetricRegistry.notifyListenerOfAddedMetric(MetricRegistry.java:468) ~[metrics-core-4.0.5.jar:4.0.5]
   [junit4]   2> 	at com.codahale.metrics.MetricRegistry.onMetricAdded(MetricRegistry.java:462) ~[metrics-core-4.0.5.jar:4.0.5]
   [junit4]   2> 	at com.codahale.metrics.MetricRegistry.register(MetricRegistry.java:95) ~[metrics-core-4.0.5.jar:4.0.5]
   [junit4]   2> 	at org.apache.solr.metrics.SolrMetricManager.registerAll(SolrMetricManager.java:521) ~[java/:?]
   [junit4]   2> 	at org.apache.solr.servlet.SolrDispatchFilter.setupJvmMetrics(SolrDispatchFilter.java:212) ~[java/:?]
   [junit4]   2> 	at org.apache.solr.servlet.SolrDispatchFilter.init(SolrDispatchFilter.java:184) ~[java/:?]
   [junit4]   2> 	at org.eclipse.jetty.servlet.FilterHolder.initialize(FilterHolder.java:136) ~[jetty-servlet-9.4.19.v20190610.jar:9.4.19.v20190610]
   [junit4]   2> 	at org.eclipse.jetty.servlet.ServletHandler.lambda$initialize$0(ServletHandler.java:750) ~[jetty-servlet-9.4.19.v20190610.jar:9.4.19.v20190610]
   [junit4]   2> 	at java.util.Spliterators$ArraySpliterator.forEachRemaining(Spliterators.java:948) ~[?:1.8.0_201]
   [junit4]   2> 	at java.util.stream.Streams$ConcatSpliterator.forEachRemaining(Streams.java:742) ~[?:1.8.0_201]
   [junit4]   2> 	at java.util.stream.Streams$ConcatSpliterator.forEachRemaining(Streams.java:742) ~[?:1.8.0_201]
   [junit4]   2> 	at java.util.stream.ReferencePipeline$Head.forEach(ReferencePipeline.java:580) ~[?:1.8.0_201]
   [junit4]   2> 	at org.eclipse.jetty.servlet.ServletHandler.initialize(ServletHandler.java:744) ~[jetty-servlet-9.4.19.v20190610.jar:9.4.19.v20190610]
   [junit4]   2> 	at org.eclipse.jetty.servlet.ServletHandler.updateMappings(ServletHandler.java:1449) ~[jetty-servlet-9.4.19.v20190610.jar:9.4.19.v20190610]
   [junit4]   2> 	at org.eclipse.jetty.servlet.ServletHandler.setFilterMappings(ServletHandler.java:1513) ~[jetty-servlet-9.4.19.v20190610.jar:9.4.19.v20190610]
   [junit4]   2> 	at org.eclipse.jetty.servlet.ServletHandler.addFilterMapping(ServletHandler.java:1158) ~[jetty-servlet-9.4.19.v20190610.jar:9.4.19.v20190610]
   [junit4]   2> 	at org.eclipse.jetty.servlet.ServletHandler.addFilterWithMapping(ServletHandler.java:995) ~[jetty-servlet-9.4.19.v20190610.jar:9.4.19.v20190610]
   [junit4]   2> 	at org.eclipse.jetty.servlet.ServletContextHandler.addFilter(ServletContextHandler.java:468) ~[jetty-servlet-9.4.19.v20190610.jar:9.4.19.v20190610]
   [junit4]   2> 	at org.apache.solr.client.solrj.embedded.JettySolrRunner$1.lifeCycleStarted(JettySolrRunner.java:384) ~[java/:?]
   [junit4]   2> 	at org.eclipse.jetty.util.component.AbstractLifeCycle.setStarted(AbstractLifeCycle.java:179) ~[jetty-util-9.4.19.v20190610.jar:9.4.19.v20190610]
   [junit4]   2> 	at org.eclipse.jetty.util.component.AbstractLifeCycle.start(AbstractLifeCycle.java:69) ~[jetty-util-9.4.19.v20190610.jar:9.4.19.v20190610]
   [junit4]   2> 	at org.apache.solr.client.solrj.embedded.JettySolrRunner.retryOnPortBindFailure(JettySolrRunner.java:558) ~[java/:?]
   [junit4]   2> 	at org.apache.solr.client.solrj.embedded.JettySolrRunner.start(JettySolrRunner.java:497) ~[java/:?]
   [junit4]   2> 	at org.apache.solr.client.solrj.embedded.JettySolrRunner.start(JettySolrRunner.java:465) ~[java/:?]
   [junit4]   2> 	at org.apache.solr.cloud.MiniSolrCloudCluster.startJettySolrRunner(MiniSolrCloudCluster.java:467) ~[java/:?]
   [junit4]   2> 	at org.apache.solr.cloud.MiniSolrCloudCluster.lambda$new$0(MiniSolrCloudCluster.java:300) ~[java/:?]
   [junit4]   2> 	at java.util.concurrent.FutureTask.run(FutureTask.java:266) ~[?:1.8.0_201]
   [junit4]   2> 	at org.apache.solr.common.util.ExecutorUtil$MDCAwareThreadPoolExecutor.lambda$execute$0(ExecutorUtil.java:209) ~[java/:?]
   [junit4]   2> 	at java.util.concurrent.ThreadPoolExecutor.runWorker(ThreadPoolExecutor.java:1149) ~[?:1.8.0_201]
   [junit4]   2> 	at java.util.concurrent.ThreadPoolExecutor$Worker.run(ThreadPoolExecutor.java:624) ~[?:1.8.0_201]
   [junit4]   2> 	at java.lang.Thread.run(Thread.java:748) [?:1.8.0_201]
   [junit4]   2> 331768 INFO  (jetty-launcher-2193-thread-3) [n:127.0.0.1:33851_solr     ] o.a.s.m.r.SolrJmxReporter JMX monitoring for 'solr.jvm' (registry 'solr.jvm') enabled at server: com.sun.jmx.mbeanserver.JmxMBeanServer@29ca8410
   [junit4]   2> 331768 INFO  (jetty-launcher-2193-thread-3) [n:127.0.0.1:33851_solr     ] o.a.s.m.r.SolrJmxReporter JMX monitoring for 'solr.jetty' (registry 'solr.jetty') enabled at server: com.sun.jmx.mbeanserver.JmxMBeanServer@29ca8410
   [junit4]   2> 331769 INFO  (jetty-launcher-2193-thread-3) [n:127.0.0.1:33851_solr     ] o.a.s.c.CorePropertiesLocator Found 0 core definitions underneath /home/jenkins/workspace/Lucene-Solr-8.2-Linux/solr/build/solr-core/test/J2/temp/solr.cloud.autoscaling.AutoAddReplicasIntegrationTest_52323D96BB7A3C25-001/tempDir-001/node3/.
   [junit4]   2> 331802 INFO  (TEST-AutoAddReplicasIntegrationTest.testSimple-seed#[52323D96BB7A3C25]) [     ] o.a.s.c.c.ConnectionManager Waiting for client to connect to ZooKeeper
   [junit4]   2> 331802 INFO  (zkConnectionManagerCallback-2255-thread-1) [     ] o.a.s.c.c.ConnectionManager zkClient has connected
   [junit4]   2> 331802 INFO  (TEST-AutoAddReplicasIntegrationTest.testSimple-seed#[52323D96BB7A3C25]) [     ] o.a.s.c.c.ConnectionManager Client is connected to ZooKeeper
   [junit4]   2> 331803 INFO  (TEST-AutoAddReplicasIntegrationTest.testSimple-seed#[52323D96BB7A3C25]) [     ] o.a.s.c.c.ZkStateReader Updated live nodes from ZooKeeper... (0) -> (3)
   [junit4]   2> 331803 INFO  (TEST-AutoAddReplicasIntegrationTest.testSimple-seed#[52323D96BB7A3C25]) [     ] o.a.s.c.s.i.ZkClientClusterStateProvider Cluster at 127.0.0.1:39679/solr ready
   [junit4]   2> 331813 INFO  (qtp1078361321-8657) [n:127.0.0.1:33851_solr     ] o.a.s.s.HttpSolrCall [admin] webapp=null path=/cluster params={wt=javabin&version=2} status=0 QTime=2
   [junit4]   2> 331819 INFO  (qtp1078361321-8661) [n:127.0.0.1:33851_solr     ] o.a.s.h.a.CollectionsHandler Invoked Collection Action :create with params collection.configName=conf&maxShardsPerNode=2&autoAddReplicas=true&name=testSimple1&nrtReplicas=2&action=CREATE&numShards=2&createNodeSet=127.0.0.1:40491_solr,127.0.0.1:45075_solr&wt=javabin&version=2 and sendToOCPQueue=true
   [junit4]   2> 331823 INFO  (OverseerThreadFactory-1801-thread-1-processing-n:127.0.0.1:40491_solr) [n:127.0.0.1:40491_solr     ] o.a.s.c.a.c.CreateCollectionCmd Create collection testSimple1
   [junit4]   2> 331931 INFO  (OverseerStateUpdate-72058186381525000-127.0.0.1:40491_solr-n_0000000000) [n:127.0.0.1:40491_solr     ] o.a.s.c.o.SliceMutator createReplica() {
   [junit4]   2>   "operation":"ADDREPLICA",
   [junit4]   2>   "collection":"testSimple1",
   [junit4]   2>   "shard":"shard1",
   [junit4]   2>   "core":"testSimple1_shard1_replica_n1",
   [junit4]   2>   "state":"down",
   [junit4]   2>   "base_url":"http://127.0.0.1:40491/solr",
   [junit4]   2>   "type":"NRT",
   [junit4]   2>   "waitForFinalState":"false"} 
   [junit4]   2> 331936 INFO  (OverseerStateUpdate-72058186381525000-127.0.0.1:40491_solr-n_0000000000) [n:127.0.0.1:40491_solr     ] o.a.s.c.o.SliceMutator createReplica() {
   [junit4]   2>   "operation":"ADDREPLICA",
   [junit4]   2>   "collection":"testSimple1",
   [junit4]   2>   "shard":"shard1",
   [junit4]   2>   "core":"testSimple1_shard1_replica_n3",
   [junit4]   2>   "state":"down",
   [junit4]   2>   "base_url":"http://127.0.0.1:45075/solr",
   [junit4]   2>   "type":"NRT",
   [junit4]   2>   "waitForFinalState":"false"} 
   [junit4]   2> 331939 INFO  (OverseerStateUpdate-72058186381525000-127.0.0.1:40491_solr-n_0000000000) [n:127.0.0.1:40491_solr     ] o.a.s.c.o.SliceMutator createReplica() {
   [junit4]   2>   "operation":"ADDREPLICA",
   [junit4]   2>   "collection":"testSimple1",
   [junit4]   2>   "shard":"shard2",
   [junit4]   2>   "core":"testSimple1_shard2_replica_n5",
   [junit4]   2>   "state":"down",
   [junit4]   2>   "base_url":"http://127.0.0.1:40491/solr",
   [junit4]   2>   "type":"NRT",
   [junit4]   2>   "waitForFinalState":"false"} 
   [junit4]   2> 331941 INFO  (OverseerStateUpdate-72058186381525000-127.0.0.1:40491_solr-n_0000000000) [n:127.0.0.1:40491_solr     ] o.a.s.c.o.SliceMutator createReplica() {
   [junit4]   2>   "operation":"ADDREPLICA",
   [junit4]   2>   "collection":"testSimple1",
   [junit4]   2>   "shard":"shard2",
   [junit4]   2>   "core":"testSimple1_shard2_replica_n6",
   [junit4]   2>   "state":"down",
   [junit4]   2>   "base_url":"http://127.0.0.1:45075/solr",
   [junit4]   2>   "type":"NRT",
   [junit4]   2>   "waitForFinalState":"false"} 
   [junit4]   2> 332145 INFO  (qtp1671522925-8658) [n:127.0.0.1:45075_solr    x:testSimple1_shard1_replica_n3 ] o.a.s.h.a.CoreAdminOperation core create command qt=/admin/cores&coreNodeName=core_node4&collection.configName=conf&newCollection=true&name=testSimple1_shard1_replica_n3&action=CREATE&numShards=2&collection=testSimple1&shard=shard1&wt=javabin&version=2&replicaType=NRT
   [junit4]   2> 332146 INFO  (qtp1671522925-8660) [n:127.0.0.1:45075_solr    x:testSimple1_shard2_replica_n6 ] o.a.s.h.a.CoreAdminOperation core create command qt=/admin/cores&coreNodeName=core_node8&collection.configName=conf&newCollection=true&name=testSimple1_shard2_replica_n6&action=CREATE&numShards=2&collection=testSimple1&shard=shard2&wt=javabin&version=2&replicaType=NRT
   [junit4]   2> 332163 INFO  (qtp1949511512-8663) [n:127.0.0.1:40491_solr    x:testSimple1_shard1_replica_n1 ] o.a.s.h.a.CoreAdminOperation core create command qt=/admin/cores&coreNodeName=core_node2&collection.configName=conf&newCollection=true&name=testSimple1_shard1_replica_n1&action=CREATE&numShards=2&collection=testSimple1&shard=shard1&wt=javabin&version=2&replicaType=NRT
   [junit4]   2> 332163 INFO  (qtp1949511512-8666) [n:127.0.0.1:40491_solr    x:testSimple1_shard2_replica_n5 ] o.a.s.h.a.CoreAdminOperation core create command qt=/admin/cores&coreNodeName=core_node7&collection.configName=conf&newCollection=true&name=testSimple1_shard2_replica_n5&action=CREATE&numShards=2&collection=testSimple1&shard=shard2&wt=javabin&version=2&replicaType=NRT
   [junit4]   2> 332163 INFO  (qtp1949511512-8663) [n:127.0.0.1:40491_solr    x:testSimple1_shard1_replica_n1 ] o.a.s.c.TransientSolrCoreCacheDefault Allocating transient cache for 4 transient cores
   [junit4]   2> 333179 INFO  (qtp1671522925-8660) [n:127.0.0.1:45075_solr c:testSimple1 s:shard2 r:core_node8 x:testSimple1_shard2_replica_n6 ] o.a.s.c.SolrConfig Using Lucene MatchVersion: 8.2.0
   [junit4]   2> 333578 INFO  (qtp1671522925-8658) [n:127.0.0.1:45075_solr c:testSimple1 s:shard1 r:core_node4 x:testSimple1_shard1_replica_n3 ] o.a.s.c.SolrConfig Using Lucene MatchVersion: 8.2.0
   [junit4]   2> 333578 INFO  (qtp1949511512-8666) [n:127.0.0.1:40491_solr c:testSimple1 s:shard2 r:core_node7 x:testSimple1_shard2_replica_n5 ] o.a.s.c.SolrConfig Using Lucene MatchVersion: 8.2.0
   [junit4]   2> 333586 INFO  (qtp1949511512-8666) [n:127.0.0.1:40491_solr c:testSimple1 s:shard2 r:core_node7 x:testSimple1_shard2_replica_n5 ] o.a.s.s.IndexSchema [testSimple1_shard2_replica_n5] Schema name=minimal
   [junit4]   2> 333586 INFO  (qtp1671522925-8660) [n:127.0.0.1:45075_solr c:testSimple1 s:shard2 r:core_node8 x:testSimple1_shard2_replica_n6 ] o.a.s.s.IndexSchema [testSimple1_shard2_replica_n6] Schema name=minimal
   [junit4]   2> 333586 INFO  (qtp1671522925-8658) [n:127.0.0.1:45075_solr c:testSimple1 s:shard1 r:core_node4 x:testSimple1_shard1_replica_n3 ] o.a.s.s.IndexSchema [testSimple1_shard1_replica_n3] Schema name=minimal
   [junit4]   2> 333587 INFO  (qtp1949511512-8663) [n:127.0.0.1:40491_solr c:testSimple1 s:shard1 r:core_node2 x:testSimple1_shard1_replica_n1 ] o.a.s.c.SolrConfig Using Lucene MatchVersion: 8.2.0
   [junit4]   2> 333588 INFO  (qtp1671522925-8658) [n:127.0.0.1:45075_solr c:testSimple1 s:shard1 r:core_node4 x:testSimple1_shard1_replica_n3 ] o.a.s.s.IndexSchema Loaded schema minimal/1.1 with uniqueid field id
   [junit4]   2> 333588 INFO  (qtp1671522925-8660) [n:127.0.0.1:45075_solr c:testSimple1 s:shard2 r:core_node8 x:testSimple1_shard2_replica_n6 ] o.a.s.s.IndexSchema Loaded schema minimal/1.1 with uniqueid field id
   [junit4]   2> 333589 INFO  (qtp1671522925-8658) [n:127.0.0.1:45075_solr c:testSimple1 s:shard1 r:core_node4 x:testSimple1_shard1_replica_n3 ] o.a.s.c.CoreContainer Creating SolrCore 'testSimple1_shard1_replica_n3' using configuration from collection testSimple1, trusted=true
   [junit4]   2> 333589 INFO  (qtp1671522925-8660) [n:127.0.0.1:45075_solr c:testSimple1 s:shard2 r:core_node8 x:testSimple1_shard2_replica_n6 ] o.a.s.c.CoreContainer Creating SolrCore 'testSimple1_shard2_replica_n6' using configuration from collection testSimple1, trusted=true
   [junit4]   2> 333589 INFO  (qtp1671522925-8658) [n:127.0.0.1:45075_solr c:testSimple1 s:shard1 r:core_node4 x:testSimple1_shard1_replica_n3 ] o.a.s.m.r.SolrJmxReporter JMX monitoring for 'solr.core.testSimple1.shard1.replica_n3' (registry 'solr.core.testSimple1.shard1.replica_n3') enabled at server: com.sun.jmx.mbeanserver.JmxMBeanServer@29ca8410
   [junit4]   2> 333589 INFO  (qtp1671522925-8660) [n:127.0.0.1:45075_solr c:testSimple1 s:shard2 r:core_node8 x:testSimple1_shard2_replica_n6 ] o.a.s.m.r.SolrJmxReporter JMX monitoring for 'solr.core.testSimple1.shard2.replica_n6' (registry 'solr.core.testSimple1.shard2.replica_n6') enabled at server: com.sun.jmx.mbeanserver.JmxMBeanServer@29ca8410
   [junit4]   2> 333589 INFO  (qtp1671522925-8660) [n:127.0.0.1:45075_solr c:testSimple1 s:shard2 r:core_node8 x:testSimple1_shard2_replica_n6 ] o.a.s.c.SolrCore [[testSimple1_shard2_replica_n6] ] Opening new SolrCore at [/home/jenkins/workspace/Lucene-Solr-8.2-Linux/solr/build/solr-core/test/J2/temp/solr.cloud.autoscaling.AutoAddReplicasIntegrationTest_52323D96BB7A3C25-001/tempDir-001/node1/testSimple1_shard2_replica_n6], dataDir=[/home/jenkins/workspace/Lucene-Solr-8.2-Linux/solr/build/solr-core/test/J2/temp/solr.cloud.autoscaling.AutoAddReplicasIntegrationTest_52323D96BB7A3C25-001/tempDir-001/node1/./testSimple1_shard2_replica_n6/data/]
   [junit4]   2> 333596 INFO  (qtp1671522925-8658) [n:127.0.0.1:45075_solr c:testSimple1 s:shard1 r:core_node4 x:testSimple1_shard1_replica_n3 ] o.a.s.c.SolrCore [[testSimple1_shard1_replica_n3] ] Opening new SolrCore at [/home/jenkins/workspace/Lucene-Solr-8.2-Linux/solr/build/solr-core/test/J2/temp/solr.cloud.autoscaling.AutoAddReplicasIntegrationTest_52323D96BB7A3C25-001/tempDir-001/node1/testSimple1_shard1_replica_n3], dataDir=[/home/jenkins/workspace/Lucene-Solr-8.2-Linux/solr/build/solr-core/test/J2/temp/solr.cloud.autoscaling.AutoAddReplicasIntegrationTest_52323D96BB7A3C25-001/tempDir-001/node1/./testSimple1_shard1_replica_n3/data/]
   [junit4]   2> 333597 INFO  (qtp1949511512-8666) [n:127.0.0.1:40491_solr c:testSimple1 s:shard2 r:core_node7 x:testSimple1_shard2_replica_n5 ] o.a.s.s.IndexSchema Loaded schema minimal/1.1 with uniqueid field id
   [junit4]   2> 333597 INFO  (qtp1949511512-8666) [n:127.0.0.1:40491_solr c:testSimple1 s:shard2 r:core_node7 x:testSimple1_shard2_replica_n5 ] o.a.s.c.CoreContainer Creating SolrCore 'testSimple1_shard2_replica_n5' using configuration from collection testSimple1, trusted=true
   [junit4]   2> 333598 INFO  (qtp1949511512-8666) [n:127.0.0.1:40491_solr c:testSimple1 s:shard2 r:core_node7 x:testSimple1_shard2_replica_n5 ] o.a.s.m.r.SolrJmxReporter JMX monitoring for 'solr.core.testSimple1.shard2.replica_n5' (registry 'solr.core.testSimple1.shard2.replica_n5') enabled at server: com.sun.jmx.mbeanserver.JmxMBeanServer@29ca8410
   [junit4]   2> 333598 INFO  (qtp1949511512-8666) [n:127.0.0.1:40491_solr c:testSimple1 s:shard2 r:core_node7 x:testSimple1_shard2_replica_n5 ] o.a.s.c.SolrCore [[testSimple1_shard2_replica_n5] ] Opening new SolrCore at [/home/jenkins/workspace/Lucene-Solr-8.2-Linux/solr/build/solr-core/test/J2/temp/solr.cloud.autoscaling.AutoAddReplicasIntegrationTest_52323D96BB7A3C25-001/tempDir-001/node2/testSimple1_shard2_replica_n5], dataDir=[/home/jenkins/workspace/Lucene-Solr-8.2-Linux/solr/build/solr-core/test/J2/temp/solr.cloud.autoscaling.AutoAddReplicasIntegrationTest_52323D96BB7A3C25-001/tempDir-001/node2/./testSimple1_shard2_replica_n5/data/]
   [junit4]   2> 333599 INFO  (qtp1949511512-8663) [n:127.0.0.1:40491_solr c:testSimple1 s:shard1 r:core_node2 x:testSimple1_shard1_replica_n1 ] o.a.s.s.IndexSchema [testSimple1_shard1_replica_n1] Schema name=minimal
   [junit4]   2> 333601 INFO  (qtp1949511512-8663) [n:127.0.0.1:40491_solr c:testSimple1 s:shard1 r:core_node2 x:testSimple1_shard1_replica_n1 ] o.a.s.s.IndexSchema Loaded schema minimal/1.1 with uniqueid field id
   [junit4]   2> 333601 INFO  (qtp1949511512-8663) [n:127.0.0.1:40491_solr c:testSimple1 s:shard1 r:core_node2 x:testSimple1_shard1_replica_n1 ] o.a.s.c.CoreContainer Creating SolrCore 'testSimple1_shard1_replica_n1' using configuration from collection testSimple1, trusted=true
   [junit4]   2> 333601 INFO  (qtp1949511512-8663) [n:127.0.0.1:40491_solr c:testSimple1 s:shard1 r:core_node2 x:testSimple1_shard1_replica_n1 ] o.a.s.m.r.SolrJmxReporter JMX monitoring for 'solr.core.testSimple1.shard1.replica_n1' (registry 'solr.core.testSimple1.shard1.replica_n1') enabled at server: com.sun.jmx.mbeanserver.JmxMBeanServer@29ca8410
   [junit4]   2> 333601 INFO  (qtp1949511512-8663) [n:127.0.0.1:40491_solr c:testSimple1 s:shard1 r:core_node2 x:testSimple1_shard1_replica_n1 ] o.a.s.c.SolrCore [[testSimple1_shard1_replica_n1] ] Opening new SolrCore at [/home/jenkins/workspace/Lucene-Solr-8.2-Linux/solr/build/solr-core/test/J2/temp/solr.cloud.autoscaling.AutoAddReplicasIntegrationTest_52323D96BB7A3C25-001/tempDir-001/node2/testSimple1_shard1_replica_n1], dataDir=[/home/jenkins/workspace/Lucene-Solr-8.2-Linux/solr/build/solr-core/test/J2/temp/solr.cloud.autoscaling.AutoAddReplicasIntegrationTest_52323D96BB7A3C25-001/tempDir-001/node2/./testSimple1_shard1_replica_n1/data/]
   [junit4]   2> 333634 INFO  (qtp1949511512-8663) [n:127.0.0.1:40491_solr c:testSimple1 s:shard1 r:core_node2 x:testSimple1_shard1_replica_n1 ] o.a.s.u.UpdateHandler Using UpdateLog implementation: org.apache.solr.update.UpdateLog
   [junit4]   2> 333634 INFO  (qtp1949511512-8663) [n:127.0.0.1:40491_solr c:testSimple1 s:shard1 r:core_node2 x:testSimple1_shard1_replica_n1 ] o.a.s.u.UpdateLog Initializing UpdateLog: dataDir=null defaultSyncLevel=FLUSH numRecordsToKeep=100 maxNumLogsToKeep=10 numVersionBuckets=65536
   [junit4]   2> 333635 INFO  (qtp1949511512-8663) [n:127.0.0.1:40491_solr c:testSimple1 s:shard1 r:core_node2 x:testSimple1_shard1_replica_n1 ] o.a.s.u.CommitTracker Hard AutoCommit: disabled
   [junit4]   2> 333635 INFO  (qtp1949511512-8663) [n:127.0.0.1:40491_solr c:testSimple1 s:shard1 r:core_node2 x:testSimple1_shard1_replica_n1 ] o.a.s.u.CommitTracker Soft AutoCommit: disabled
   [junit4]   2> 333635 INFO  (qtp1949511512-8666) [n:127.0.0.1:40491_solr c:testSimple1 s:shard2 r:core_node7 x:testSimple1_shard2_replica_n5 ] o.a.s.u.UpdateHandler Using UpdateLog implementation: org.apache.solr.update.UpdateLog
   [junit4]   2> 333635 INFO  (qtp1949511512-8666) [n:127.0.0.1:40491_solr c:testSimple1 s:shard2 r:core_node7 x:testSimple1_shard2_replica_n5 ] o.a.s.u.UpdateLog Initializing UpdateLog: dataDir=null defaultSyncLevel=FLUSH numRecordsToKeep=100 maxNumLogsToKeep=10 numVersionBuckets=65536
   [junit4]   2> 333636 INFO  (qtp1671522925-8658) [n:127.0.0.1:45075_solr c:testSimple1 s:shard1 r:core_node4 x:testSimple1_shard1_replica_n3 ] o.a.s.u.UpdateHandler Using UpdateLog implementation: org.apache.solr.update.UpdateLog
   [junit4]   2> 333636 INFO  (qtp1671522925-8658) [n:127.0.0.1:45075_solr c:testSimple1 s:shard1 r:core_node4 x:testSimple1_shard1_replica_n3 ] o.a.s.u.UpdateLog Initializing UpdateLog: dataDir=null defaultSyncLevel=FLUSH numRecordsToKeep=100 maxNumLogsToKeep=10 numVersionBuckets=65536
   [junit4]   2> 333636 INFO  (qtp1949511512-8663) [n:127.0.0.1:40491_solr c:testSimple1 s:shard1 r:core_node2 x:testSimple1_shard1_replica_n1 ] o.a.s.s.SolrIndexSearcher Opening [Searcher@21bc1b0d[testSimple1_shard1_replica_n1] main]
   [junit4]   2> 333636 INFO  (qtp1949511512-8666) [n:127.0.0.1:40491_solr c:testSimple1 s:shard2 r:core_node7 x:testSimple1_shard2_replica_n5 ] o.a.s.u.CommitTracker Hard AutoCommit: disabled
   [junit4]   2> 333637 INFO  (qtp1949511512-8666) [n:127.0.0.1:40491_solr c:testSimple1 s:shard2 r:core_node7 x:testSimple1_shard2_replica_n5 ] o.a.s.u.CommitTracker Soft AutoCommit: disabled
   [junit4]   2> 333637 INFO  (qtp1671522925-8660) [n:127.0.0.1:45075_solr c:testSimple1 s:shard2 r:core_node8 x:testSimple1_shard2_replica_n6 ] o.a.s.u.UpdateHandler Using UpdateLog implementation: org.apache.solr.update.UpdateLog
   [junit4]   2> 333637 INFO  (qtp1671522925-8660) [n:127.0.0.1:45075_solr c:testSimple1 s:shard2 r:core_node8 x:testSimple1_shard2_replica_n6 ] o.a.s.u.UpdateLog Initializing UpdateLog: dataDir=null defaultSyncLevel=FLUSH numRecordsToKeep=100 maxNumLogsToKeep=10 numVersionBuckets=65536
   [junit4]   2> 333637 INFO  (qtp1671522925-8658) [n:127.0.0.1:45075_solr c:testSimple1 s:shard1 r:core_node4 x:testSimple1_shard1_replica_n3 ] o.a.s.u.CommitTracker Hard AutoCommit: disabled
   [junit4]   2> 333637 INFO  (qtp1671522925-8658) [n:127.0.0.1:45075_solr c:testSimple1 s:shard1 r:core_node4 x:testSimple1_shard1_replica_n3 ] o.a.s.u.CommitTracker Soft AutoCommit: disabled
   [junit4]   2> 333638 INFO  (qtp1949511512-8663) [n:127.0.0.1:40491_solr c:testSimple1 s:shard1 r:core_node2 x:testSimple1_shard1_replica_n1 ] o.a.s.r.ManagedResourceStorage Configured ZooKeeperStorageIO with znodeBase: /configs/conf
   [junit4]   2> 333638 INFO  (qtp1949511512-8666) [n:127.0.0.1:40491_solr c:testSimple1 s:shard2 r:core_node7 x:testSimple1_shard2_replica_n5 ] o.a.s.s.SolrIndexSearcher Opening [Searcher@4565335b[testSimple1_shard2_replica_n5] main]
   [junit4]   2> 333638 INFO  (qtp1949511512-8663) [n:127.0.0.1:40491_solr c:testSimple1 s:shard1 r:core_node2 x:testSimple1_shard1_replica_n1 ] o.a.s.r.ManagedResourceStorage Loaded null at path _rest_managed.json using ZooKeeperStorageIO:path=/configs/conf
   [junit4]   2> 333638 INFO  (qtp1671522925-8658) [n:127.0.0.1:45075_solr c:testSimple1 s:shard1 r:core_node4 x:testSimple1_shard1_replica_n3 ] o.a.s.s.SolrIndexSearcher Opening [Searcher@13ac9cf1[testSimple1_shard1_replica_n3] main]
   [junit4]   2> 333638 INFO  (qtp1671522925-8660) [n:127.0.0.1:45075_solr c:testSimple1 s:shard2 r:core_node8 x:testSimple1_shard2_replica_n6 ] o.a.s.u.CommitTracker Hard AutoCommit: disabled
   [junit4]   2> 333638 INFO  (qtp1671522925-8660) [n:127.0.0.1:45075_solr c:testSimple1 s:shard2 r:core_node8 x:testSimple1_shard2_replica_n6 ] o.a.s.u.CommitTracker Soft AutoCommit: disabled
   [junit4]   2> 333638 INFO  (qtp1949511512-8663) [n:127.0.0.1:40491_solr c:testSimple1 s:shard1 r:core_node2 x:testSimple1_shard1_replica_n1 ] o.a.s.h.ReplicationHandler Commits will be reserved for 10000ms.
   [junit4]   2> 333638 INFO  (qtp1949511512-8663) [n:127.0.0.1:40491_solr c:testSimple1 s:shard1 r:core_node2 x:testSimple1_shard1_replica_n1 ] o.a.s.u.UpdateLog Could not find max version in index or recent updates, using new clock 1639994529701429248
   [junit4]   2> 333639 INFO  (qtp1949511512-8666) [n:127.0.0.1:40491_solr c:testSimple1 s:shard2 r:core_node7 x:testSimple1_shard2_replica_n5 ] o.a.s.r.ManagedResourceStorage Configured ZooKeeperStorageIO with znodeBase: /configs/conf
   [junit4]   2> 333639 INFO  (qtp1671522925-8658) [n:127.0.0.1:45075_solr c:testSimple1 s:shard1 r:core_node4 x:testSimple1_shard1_replica_n3 ] o.a.s.r.ManagedResourceStorage Configured ZooKeeperStorageIO with znodeBase: /configs/conf
   [junit4]   2> 333639 INFO  (qtp1671522925-8658) [n:127.0.0.1:45075_solr c:testSimple1 s:shard1 r:core_node4 x:testSimple1_shard1_replica_n3 ] o.a.s.r.ManagedResourceStorage Loaded null at path _rest_managed.json using ZooKeeperStorageIO:path=/configs/conf
   [junit4]   2> 333639 INFO  (qtp1671522925-8660) [n:127.0.0.1:45075_solr c:testSimple1 s:shard2 r:core_node8 x:testSimple1_shard2_replica_n6 ] o.a.s.s.SolrIndexSearcher Opening [Searcher@6bb95067[testSimple1_shard2_replica_n6] main]
   [junit4]   2> 333639 INFO  (qtp1671522925-8658) [n:127.0.0.1:45075_solr c:testSimple1 s:shard1 r:core_node4 x:testSimple1_shard1_replica_n3 ] o.a.s.h.ReplicationHandler Commits will be reserved for 10000ms.
   [junit4]   2> 333639 INFO  (qtp1949511512-8666) [n:127.0.0.1:40491_solr c:testSimple1 s:shard2 r:core_node7 x:testSimple1_shard2_replica_n5 ] o.a.s.r.ManagedResourceStorage Loaded null at path _rest_managed.json using ZooKeeperStorageIO:path=/configs/conf
   [junit4]   2> 333639 INFO  (qtp1671522925-8658) [n:127.0.0.1:45075_solr c:testSimple1 s:shard1 r:core_node4 x:testSimple1_shard1_replica_n3 ] o.a.s.u.UpdateLog Could not find max version in index or recent updates, using new clock 1639994529702477824
   [junit4]   2> 333639 INFO  (qtp1949511512-8666) [n:127.0.0.1:40491_solr c:testSimple1 s:shard2 r:core_node7 x:testSimple1_shard2_replica_n5 ] o.a.s.h.ReplicationHandler Commits will be reserved for 10000ms.
   [junit4]   2> 333640 INFO  (qtp1949511512-8666) [n:127.0.0.1:40491_solr c:testSimple1 s:shard2 r:core_node7 x:testSimple1_shard2_replica_n5 ] o.a.s.u.UpdateLog Could not find max version in index or recent updates, using new clock 1639994529703526400
   [junit4]   2> 333640 INFO  (qtp1671522925-8660) [n:127.0.0.1:45075_solr c:testSimple1 s:shard2 r:core_node8 x:testSimple1_shard2_replica_n6 ] o.a.s.r.ManagedResourceStorage Configured ZooKeeperStorageIO with znodeBase: /configs/conf
   [junit4]   2> 333640 INFO  (qtp1671522925-8660) [n:127.0.0.1:45075_solr c:testSimple1 s:shard2 r:core_node8 x:testSimple1_shard2_replica_n6 ] o.a.s.r.ManagedResourceStorage Loaded null at path _rest_managed.json using ZooKeeperStorageIO:path=/configs/conf
   [junit4]   2> 333641 INFO  (qtp1671522925-8660) [n:127.0.0.1:45075_solr c:testSimple1 s:shard2 r:core_node8 x:testSimple1_shard2_replica_n6 ] o.a.s.h.ReplicationHandler Commits will be reserved for 10000ms.
   [junit4]   2> 333642 INFO  (searcherExecutor-1817-thread-1-processing-n:127.0.0.1:40491_solr x:testSimple1_shard1_replica_n1 c:testSimple1 s:shard1 r:core_node2) [n:127.0.0.1:40491_solr c:testSimple1 s:shard1 r:core_node2 x:testSimple1_shard1_replica_n1 ] o.a.s.c.SolrCore [testSimple1_shard1_replica_n1] Registered new searcher Searcher@21bc1b0d[testSimple1_shard1_replica_n1] main{ExitableDirectoryReader(UninvertingDirectoryReader())}
   [junit4]   2> 333642 INFO  (qtp1671522925-8660) [n:127.0.0.1:45075_solr c:testSimple1 s:shard2 r:core_node8 x:testSimple1_shard2_replica_n6 ] o.a.s.u.UpdateLog Could not find max version in index or recent updates, using new clock 1639994529705623552
   [junit4]   2> 333642 INFO  (searcherExecutor-1815-thread-1-processing-n:127.0.0.1:45075_solr x:testSimple1_shard1_replica_n3 c:testSimple1 s:shard1 r:core_node4) [n:127.0.0.1:45075_solr c:testSimple1 s:shard1 r:core_node4 x:testSimple1_shard1_replica_n3 ] o.a.s.c.SolrCore [testSimple1_shard1_replica_n3] Registered new searcher Searcher@13ac9cf1[testSimple1_shard1_replica_n3] main{ExitableDirectoryReader(UninvertingDirectoryReader())}
   [junit4]   2> 333644 INFO  (qtp1949511512-8663) [n:127.0.0.1:40491_solr c:testSimple1 s:shard1 r:core_node2 x:testSimple1_shard1_replica_n1 ] o.a.s.c.ZkShardTerms Successful update of terms at /collections/testSimple1/terms/shard1 to Terms{values={core_node2=0}, version=0}
   [junit4]   2> 333644 INFO  (qtp1949511512-8663) [n:127.0.0.1:40491_solr c:testSimple1 s:shard1 r:core_node2 x:testSimple1_shard1_replica_n1 ] o.a.s.c.ShardLeaderElectionContextBase make sure parent is created /collections/testSimple1/leaders/shard1
   [junit4]   2> 333644 INFO  (qtp1671522925-8658) [n:127.0.0.1:45075_solr c:testSimple1 s:shard1 r:core_node4 x:testSimple1_shard1_replica_n3 ] o.a.s.c.ZkShardTerms Failed to save terms, version is not a match, retrying
   [junit4]   2> 333645 INFO  (searcherExecutor-1816-thread-1-processing-n:127.0.0.1:40491_solr x:testSimple1_shard2_replica_n5 c:testSimple1 s:shard2 r:core_node7) [n:127.0.0.1:40491_solr c:testSimple1 s:shard2 r:core_node7 x:testSimple1_shard2_replica_n5 ] o.a.s.c.SolrCore [testSimple1_shard2_replica_n5] Registered new searcher Searcher@4565335b[testSimple1_shard2_replica_n5] main{ExitableDirectoryReader(UninvertingDirectoryReader())}
   [junit4]   2> 333645 INFO  (searcherExecutor-1814-thread-1-processing-n:127.0.0.1:45075_solr x:testSimple1_shard2_replica_n6 c:testSimple1 s:shard2 r:core_node8) [n:127.0.0.1:45075_solr c:testSimple1 s:shard2 r:core_node8 x:testSimple1_shard2_replica_n6 ] o.a.s.c.SolrCore [testSimple1_shard2_replica_n6] Registered new searcher Searcher@6bb95067[testSimple1_shard2_replica_n6] main{ExitableDirectoryReader(UninvertingDirectoryReader())}
   [junit4]   2> 333645 INFO  (qtp1671522925-8658) [n:127.0.0.1:45075_solr c:testSimple1 s:shard1 r:core_node4 x:testSimple1_shard1_replica_n3 ] o.a.s.c.ZkShardTerms Successful update of terms at /collections/testSimple1/terms/shard1 to Terms{values={core_node2=0, core_node4=0}, version=1}
   [junit4]   2> 333645 INFO  (qtp1671522925-8658) [n:127.0.0.1:45075_solr c:testSimple1 s:shard1 r:core_node4 x:testSimple1_shard1_replica_n3 ] o.a.s.c.ShardLeaderElectionContextBase make sure parent is created /collections/testSimple1/leaders/shard1
   [junit4]   2> 333647 INFO  (qtp1949511512-8666) [n:127.0.0.1:40491_solr c:testSimple1 s:shard2 r:core_node7 x:testSimple1_shard2_replica_n5 ] o.a.s.c.ZkShardTerms Successful update of terms at /collections/testSimple1/terms/shard2 to Terms{values={core_node7=0}, version=0}
   [junit4]   2> 333647 INFO  (qtp1949511512-8666) [n:127.0.0.1:40491_solr c:testSimple1 s:shard2 r:core_node7 x:testSimple1_shard2_replica_n5 ] o.a.s.c.ShardLeaderElectionContextBase make sure parent is created /collections/testSimple1/leaders/shard2
   [junit4]   2> 333647 INFO  (qtp1671522925-8660) [n:127.0.0.1:45075_solr c:testSimple1 s:shard2 r:core_node8 x:testSimple1_shard2_replica_n6 ] o.a.s.c.ZkShardTerms Failed to save terms, version is not a match, retrying
   [junit4]   2> 333648 INFO  (qtp1671522925-8660) [n:127.0.0.1:45075_solr c:testSimple1 s:shard2 r:core_node8 x:testSimple1_shard2_replica_n6 ] o.a.s.c.ZkShardTerms Successful update of terms at /collections/testSimple1/terms/shard2 to Terms{values={core_node7=0, core_node8=0}, version=1}
   [junit4]   2> 333648 INFO  (qtp1671522925-8660) [n:127.0.0.1:45075_solr c:testSimple1 s:shard2 r:core_node8 x:testSimple1_shard2_replica_n6 ] o.a.s.c.ShardLeaderElectionContextBase make sure parent is created /collections/testSimple1/leaders/shard2
   [junit4]   2> 333649 INFO  (qtp1949511512-8663) [n:127.0.0.1:40491_solr c:testSimple1 s:shard1 r:core_node2 x:testSimple1_shard1_replica_n1 ] o.a.s.c.ShardLeaderElectionContext Enough replicas found to continue.
   [junit4]   2> 333649 INFO  (qtp1949511512-8663) [n:127.0.0.1:40491_solr c:testSimple1 s:shard1 r:core_node2 x:testSimple1_shard1_replica_n1 ] o.a.s.c.ShardLeaderElectionContext I may be the new leader - try and sync
   [junit4]   2> 333649 INFO  (qtp1949511512-8663) [n:127.0.0.1:40491_solr c:testSimple1 s:shard1 r:core_node2 x:testSimple1_shard1_replica_n1 ] o.a.s.c.SyncStrategy Sync replicas to http://127.0.0.1:40491/solr/testSimple1_shard1_replica_n1/
   [junit4]   2> 333650 INFO  (qtp1949511512-8663) [n:127.0.0.1:40491_solr c:testSimple1 s:shard1 r:core_node2 x:testSimple1_shard1_replica_n1 ] o.a.s.u.PeerSync PeerSync: core=testSimple1_shard1_replica_n1 url=http://127.0.0.1:40491/solr START replicas=[http://127.0.0.1:45075/solr/testSimple1_shard1_replica_n3/] nUpdates=100
   [junit4]   2> 333650 INFO  (qtp1949511512-8663) [n:127.0.0.1:40491_solr c:testSimple1 s:shard1 r:core_node2 x:testSimple1_shard1_replica_n1 ] o.a.s.u.PeerSync PeerSync: core=testSimple1_shard1_replica_n1 url=http://127.0.0.1:40491/solr DONE.  We have no versions.  sync failed.
   [junit4]   2> 333651 INFO  (qtp1949511512-8666) [n:127.0.0.1:40491_solr c:testSimple1 s:shard2 r:core_node7 x:testSimple1_shard2_replica_n5 ] o.a.s.c.ShardLeaderElectionContext Enough replicas found to continue.
   [junit4]   2> 333651 INFO  (qtp1949511512-8666) [n:127.0.0.1:40491_solr c:testSimple1 s:shard2 r:core_node7 x:testSimple1_shard2_replica_n5 ] o.a.s.c.ShardLeaderElectionContext I may be the new leader - try and sync
   [junit4]   2> 333651 INFO  (qtp1949511512-8666) [n:127.0.0.1:40491_solr c:testSimple1 s:shard2 r:core_node7 x:testSimple1_shard2_replica_n5 ] o.a.s.c.SyncStrategy Sync replicas to http://127.0.0.1:40491/solr/testSimple1_shard2_replica_n5/
   [junit4]   2> 333651 INFO  (qtp1949511512-8666) [n:127.0.0.1:40491_solr c:testSimple1 s:shard2 r:core_node7 x:testSimple1_shard2_replica_n5 ] o.a.s.u.PeerSync PeerSync: core=testSimple1_shard2_replica_n5 url=http://127.0.0.1:40491/solr START replicas=[http://127.0.0.1:45075/solr/testSimple1_shard2_replica_n6/] nUpdates=100
   [junit4]   2> 333651 INFO  (qtp1949511512-8666) [n:127.0.0.1:40491_solr c:testSimple1 s:shard2 r:core_node7 x:testSimple1_shard2_replica_n5 ] o.a.s.u.PeerSync PeerSync: core=testSimple1_shard2_replica_n5 url=http://127.0.0.1:40491/solr DONE.  We have no versions.  sync failed.
   [junit4]   2> 333652 INFO  (qtp1671522925-8662) [n:127.0.0.1:45075_solr c:testSimple1 s:shard1 r:core_node4 x:testSimple1_shard1_replica_n3 ] o.a.s.c.S.Request [testSimple1_shard1_replica_n3]  webapp=/solr path=/get params={distrib=false&qt=/get&fingerprint=false&getVersions=100&wt=javabin&version=2} status=0 QTime=0
   [junit4]   2> 333652 INFO  (qtp1949511512-8663) [n:127.0.0.1:40491_solr c:testSimple1 s:shard1 r:core_node2 x:testSimple1_shard1_replica_n1 ] o.a.s.c.SyncStrategy Leader's attempt to sync with shard failed, moving to the next candidate
   [junit4]   2> 333652 INFO  (qtp1949511512-8663) [n:127.0.0.1:40491_solr c:testSimple1 s:shard1 r:core_node2 x:testSimple1_shard1_replica_n1 ] o.a.s.c.ShardLeaderElectionContext We failed sync, but we have no versions - we can't sync in that case - we were active before, so become leader anyway
   [junit4]   2> 333652 INFO  (qtp1949511512-8663) [n:127.0.0.1:40491_solr c:testSimple1 s:shard1 r:core_node2 x:testSimple1_shard1_replica_n1 ] o.a.s.c.ShardLeaderElectionContextBase Creating leader registration node /collections/testSimple1/leaders/shard1/leader after winning as /collections/testSimple1/leader_elect/shard1/election/72058186381525000-core_node2-n_0000000000
   [junit4]   2> 333653 INFO  (qtp1671522925-8662) [n:127.0.0.1:45075_solr c:testSimple1 s:shard2 r:core_node8 x:testSimple1_shard2_replica_n6 ] o.a.s.c.S.Request [testSimple1_shard2_replica_n6]  webapp=/solr path=/get params={distrib=false&qt=/get&fingerprint=false&getVersions=100&wt=javabin&version=2} status=0 QTime=0
   [junit4]   2> 333653 INFO  (qtp1949511512-8666) [n:127.0.0.1:40491_solr c:testSimple1 s:shard2 r:core_node7 x:testSimple1_shard2_replica_n5 ] o.a.s.c.SyncStrategy Leader's attempt to sync with shard failed, moving to the next candidate
   [junit4]   2> 333653 INFO  (qtp1949511512-8666) [n:127.0.0.1:40491_solr c:testSimple1 s:shard2 r:core_node7 x:testSimple1_shard2_replica_n5 ] o.a.s.c.ShardLeaderElectionContext We failed sync, but we have no versions - we can't sync in that case - we were active before, so become leader anyway
   [junit4]   2> 333653 INFO  (qtp1949511512-8666) [n:127.0.0.1:40491_solr c:testSimple1 s:shard2 r:core_node7 x:testSimple1_shard2_replica_n5 ] o.a.s.c.ShardLeaderElectionContextBase Creating leader registration node /collections/testSimple1/leaders/shard2/leader after winning as /collections/testSimple1/leader_elect/shard2/election/72058186381525000-core_node7-n_0000000000
   [junit4]   2> 333653 INFO  (qtp1949511512-8663) [n:127.0.0.1:40491_solr c:testSimple1 s:shard1 r:core_node2 x:testSimple1_shard1_replica_n1 ] o.a.s.c.ShardLeaderElectionContext I am the new leader: http://127.0.0.1:40491/solr/testSimple1_shard1_replica_n1/ shard1
   [junit4]   2> 333654 INFO  (qtp1949511512-8666) [n:127.0.0.1:40491_solr c:testSimple1 s:shard2 r:core_node7 x:testSimple1_shard2_replica_n5 ] o.a.s.c.ShardLeaderElectionContext I am the new leader: http://127.0.0.1:40491/solr/testSimple1_shard2_replica_n5/ shard2
   [junit4]   2> 333755 INFO  (zkCallback-2215-thread-1) [     ] o.a.s.c.c.ZkStateReader A cluster state change: [WatchedEvent state:SyncConnected type:NodeDataChanged path:/collections/testSimple1/state.json] for collection [testSimple1] has occurred - updating... (live nodes size: [3])
   [junit4]   2> 333756 INFO  (qtp1949511512-8663) [n:127.0.0.1:40491_solr c:testSimple1 s:shard1 r:core_node2 x:testSimple1_shard1_replica_n1 ] o.a.s.c.ZkController I am the leader, no recovery necessary
   [junit4]   2> 333756 INFO  (qtp1949511512-8666) [n:127.0.0.1:40491_solr c:testSimple1 s:shard2 r:core_node7 x:testSimple1_shard2_replica_n5 ] o.a.s.c.ZkController I am the leader, no recovery necessary
   [junit4]   2> 333759 INFO  (qtp1949511512-8663) [n:127.0.0.1:40491_solr c:testSimple1 s:shard1 r:core_node2 x:testSimple1_shard1_replica_n1 ] o.a.s.s.HttpSolrCall [admin] webapp=null path=/admin/cores params={qt=/admin/cores&coreNodeName=core_node2&collection.configName=conf&newCollection=true&name=testSimple1_shard1_replica_n1&action=CREATE&numShards=2&collection=testSimple1&shard=shard1&wt=javabin&version=2&replicaType=NRT} status=0 QTime=1595
   [junit4]   2> 333759 INFO  (qtp1949511512-8666) [n:127.0.0.1:40491_solr c:testSimple1 s:shard2 r:core_node7 x:testSimple1_shard2_replica_n5 ] o.a.s.s.HttpSolrCall [admin] webapp=null path=/admin/cores params={qt=/admin/cores&coreNodeName=core_node7&collection.configName=conf&newCollection=true&name=testSimple1_shard2_replica_n5&action=CREATE&numShards=2&collection=testSimple1&shard=shard2&wt=javabin&version=2&replicaType=NRT} status=0 QTime=1595
   [junit4]   2> 333859 INFO  (zkCallback-2215-thread-1) [     ] o.a.s.c.c.ZkStateReader A cluster state change: [WatchedEvent state:SyncConnected type:NodeDataChanged path:/collections/testSimple1/state.json] for collection [testSimple1] has occurred - updating... (live nodes size: [3])
   [junit4]   2> 333859 INFO  (zkCallback-2215-thread-2) [     ] o.a.s.c.c.ZkStateReader A cluster state change: [WatchedEvent state:SyncConnected type:NodeDataChanged path:/collections/testSimple1/state.json] for collection [testSimple1] has occurred - updating... (live nodes size: [3])
   [junit4]   2> 334701 INFO  (qtp1671522925-8658) [n:127.0.0.1:45075_solr c:testSimple1 s:shard1 r:core_node4 x:testSimple1_shard1_replica_n3 ] o.a.s.s.HttpSolrCall [admin] webapp=null path=/admin/cores params={qt=/admin/cores&coreNodeName=core_node4&collection.configName=conf&newCollection=true&name=testSimple1_shard1_replica_n3&action=CREATE&numShards=2&collection=testSimple1&shard=shard1&wt=javabin&version=2&replicaType=NRT} status=0 QTime=2555
   [junit4]   2> 334701 INFO  (qtp1671522925-8660) [n:127.0.0.1:45075_solr c:testSimple1 s:shard2 r:core_node8 x:testSimple1_shard2_replica_n6 ] o.a.s.s.HttpSolrCall [admin] webapp=null path=/admin/cores params={qt=/admin/cores&coreNodeName=core_node8&collection.configName=conf&newCollection=true&name=testSimple1_shard2_replica_n6&action=CREATE&numShards=2&collection=testSimple1&shard=shard2&wt=javabin&version=2&replicaType=NRT} status=0 QTime=2555
   [junit4]   2> 334703 INFO  (qtp1078361321-8661) [n:127.0.0.1:33851_solr     ] o.a.s.h.a.CollectionsHandler Wait for new collection to be active for at most 45 seconds. Check all shard replicas
   [junit4]   2> 334754 INFO  (zkCallback-2215-thread-2) [     ] o.a.s.c.c.ZkStateReader A cluster state change: [WatchedEvent state:SyncConnected type:NodeDataChanged path:/collections/testSimple1/state.json] for collection [testSimple1] has occurred - updating... (live nodes size: [3])
   [junit4]   2> 334754 INFO  (zkCallback-2215-thread-1) [     ] o.a.s.c.c.ZkStateReader A cluster state change: [WatchedEvent state:SyncConnected type:NodeDataChanged path:/collections/testSimple1/state.json] for collection [testSimple1] has occurred - updating... (live nodes size: [3])
   [junit4]   2> 334754 INFO  (zkCallback-2230-thread-2) [     ] o.a.s.c.c.ZkStateReader A cluster state change: [WatchedEvent state:SyncConnected type:NodeDataChanged path:/collections/testSimple1/state.json] for collection [testSimple1] has occurred - updating... (live nodes size: [3])
   [junit4]   2> 334754 INFO  (zkCallback-2230-thread-1) [     ] o.a.s.c.c.ZkStateReader A cluster state change: [WatchedEvent state:SyncConnected type:NodeDataChanged path:/collections/testSimple1/state.json] for collection [testSimple1] has occurred - updating... (live nodes size: [3])
   [junit4]   2> 334755 INFO  (zkCallback-2240-thread-1) [     ] o.a.s.c.c.ZkStateReader A cluster state change: [WatchedEvent state:SyncConnected type:NodeDataChanged path:/collections/testSimple1/state.json] for collection [testSimple1] has occurred - updating... (live nodes size: [3])
   [junit4]   2> 334755 INFO  (qtp1078361321-8661) [n:127.0.0.1:33851_solr     ] o.a.s.s.HttpSolrCall [admin] webapp=null path=/admin/collections params={collection.configName=conf&maxShardsPerNode=2&autoAddReplicas=true&name=testSimple1&nrtReplicas=2&action=CREATE&numShards=2&createNodeSet=127.0.0.1:40491_solr,127.0.0.1:45075_solr&wt=javabin&version=2} status=0 QTime=2936
   [junit4]   2> 334757 INFO  (qtp1078361321-8654) [n:127.0.0.1:33851_solr     ] o.a.s.h.a.CollectionsHandler Invoked Collection Action :create with params collection.configName=conf&maxShardsPerNode=2&autoAddReplicas=false&name=testSimple2&nrtReplicas=2&action=CREATE&numShards=2&createNodeSet=127.0.0.1:45075_solr,127.0.0.1:33851_solr&wt=javabin&version=2 and sendToOCPQueue=true
   [junit4]   2> 334762 INFO  (OverseerThreadFactory-1801-thread-2-processing-n:127.0.0.1:40491_solr) [n:127.0.0.1:40491_solr     ] o.a.s.c.a.c.CreateCollectionCmd Create collection testSimple2
   [junit4]   2> 334763 INFO  (OverseerCollectionConfigSetProcessor-72058

[...truncated too long message...]

.disable:

-clover.load:

-clover.classpath:

-clover.setup:

clover:

compile-core:

init:

-clover.disable:

-clover.load:

-clover.classpath:

-clover.setup:

clover:

common.compile-core:
    [javac] Compiling 3 source files to /home/jenkins/workspace/Lucene-Solr-8.2-Linux/solr/build/solr-core/classes/java

common-solr.compile-core:

compile-core:

compile-test-framework:

-check-git-state:

-git-cleanroot:

-copy-git-state:

git-autoclean:

ivy-availability-check:
[loadresource] Do not set property disallowed.ivy.jars.list as its length is 0.

-ivy-fail-disallowed-ivy-version:

ivy-fail:

ivy-configure:
[ivy:configure] :: loading settings :: file = /home/jenkins/workspace/Lucene-Solr-8.2-Linux/lucene/top-level-ivy-settings.xml

resolve:

init:

compile-lucene-core:

compile-codecs:

-check-git-state:

-git-cleanroot:

-copy-git-state:

git-autoclean:

ivy-availability-check:
[loadresource] Do not set property disallowed.ivy.jars.list as its length is 0.

-ivy-fail-disallowed-ivy-version:

ivy-fail:

ivy-configure:
[ivy:configure] :: loading settings :: file = /home/jenkins/workspace/Lucene-Solr-8.2-Linux/lucene/top-level-ivy-settings.xml

resolve:

common.init:

compile-lucene-core:

init:

-clover.disable:

-clover.load:

-clover.classpath:

-clover.setup:

clover:

compile-core:

-clover.disable:

-clover.load:

-clover.classpath:

-clover.setup:

clover:

common.compile-core:

compile-core:

common.compile-test:
    [mkdir] Created dir: /home/jenkins/workspace/Lucene-Solr-8.2-Linux/solr/build/solr-core/classes/test
    [javac] Compiling 962 source files to /home/jenkins/workspace/Lucene-Solr-8.2-Linux/solr/build/solr-core/classes/test
    [javac] Note: Some input files use or override a deprecated API.
    [javac] Note: Recompile with -Xlint:deprecation for details.
    [javac] Note: Some input files use unchecked or unsafe operations.
    [javac] Note: Recompile with -Xlint:unchecked for details.
     [copy] Copying 1 file to /home/jenkins/workspace/Lucene-Solr-8.2-Linux/solr/build/solr-core/classes/test

common-solr.compile-test:

compile-test:

BUILD SUCCESSFUL
Total time: 1 minute 2 seconds
[repro] ant test-nocompile -Dtests.dups=5 -Dtests.maxfailures=5 -Dtests.class="*.AutoAddReplicasIntegrationTest" -Dtests.showOutput=onerror "-Dargs=-XX:-UseCompressedOops -XX:+UseParallelGC" -Dtests.seed=52323D96BB7A3C25 -Dtests.multiplier=3 -Dtests.slow=true -Dtests.locale=es-PR -Dtests.timezone=Indian/Comoro -Dtests.asserts=true -Dtests.file.encoding=UTF-8
Buildfile: /home/jenkins/workspace/Lucene-Solr-8.2-Linux/solr/core/build.xml

-clover.disable:

ivy-configure:
[ivy:configure] :: Apache Ivy 2.4.0 - 20141213170938 :: http://ant.apache.org/ivy/ ::
[ivy:configure] :: loading settings :: file = /home/jenkins/workspace/Lucene-Solr-8.2-Linux/lucene/top-level-ivy-settings.xml

install-junit4-taskdef:

ivy-availability-check:
[loadresource] Do not set property disallowed.ivy.jars.list as its length is 0.

-ivy-fail-disallowed-ivy-version:

ivy-fail:

resolve-groovy:
[ivy:cachepath] :: resolving dependencies :: org.codehaus.groovy#groovy-all-caller;working
[ivy:cachepath] 	confs: [default]
[ivy:cachepath] 	found org.codehaus.groovy#groovy-all;2.4.16 in public
[ivy:cachepath] :: resolution report :: resolve 16ms :: artifacts dl 1ms
	---------------------------------------------------------------------
	|                  |            modules            ||   artifacts   |
	|       conf       | number| search|dwnlded|evicted|| number|dwnlded|
	---------------------------------------------------------------------
	|      default     |   1   |   0   |   0   |   0   ||   1   |   0   |
	---------------------------------------------------------------------

-init-totals:

-test:
    [mkdir] Created dir: /home/jenkins/workspace/Lucene-Solr-8.2-Linux/solr/build/solr-core/test
[junit4:pickseed] Seed property 'tests.seed' already defined: 52323D96BB7A3C25
    [mkdir] Created dir: /home/jenkins/workspace/Lucene-Solr-8.2-Linux/solr/build/solr-core/test/temp
   [junit4] <JUnit4> says ¡Hola! Master seed: 52323D96BB7A3C25
   [junit4] Executing 5 suites with 3 JVMs.
   [junit4] 
   [junit4] Started J2 PID(26064@serv1.sd-datasolutions.de).
   [junit4] Started J1 PID(26065@serv1.sd-datasolutions.de).
   [junit4] Started J0 PID(26063@serv1.sd-datasolutions.de).
   [junit4] Suite: org.apache.solr.cloud.autoscaling.AutoAddReplicasIntegrationTest
   [junit4] OK      63.4s J0 | AutoAddReplicasIntegrationTest.testSimple
   [junit4] Completed [1/5] on J0 in 65.54s, 1 test
   [junit4] 
   [junit4] Suite: org.apache.solr.cloud.autoscaling.AutoAddReplicasIntegrationTest
   [junit4] OK      65.2s J1 | AutoAddReplicasIntegrationTest.testSimple
   [junit4] Completed [2/5] on J1 in 67.65s, 1 test
   [junit4] 
   [junit4] Suite: org.apache.solr.cloud.autoscaling.AutoAddReplicasIntegrationTest
   [junit4] OK      65.4s J2 | AutoAddReplicasIntegrationTest.testSimple
   [junit4] Completed [3/5] on J2 in 67.67s, 1 test
   [junit4] 
   [junit4] Suite: org.apache.solr.cloud.autoscaling.AutoAddReplicasIntegrationTest
   [junit4] OK      56.8s J0 | AutoAddReplicasIntegrationTest.testSimple
   [junit4] Completed [4/5] on J0 in 57.78s, 1 test
   [junit4] 
   [junit4] Suite: org.apache.solr.cloud.autoscaling.AutoAddReplicasIntegrationTest
   [junit4] OK      58.4s J1 | AutoAddReplicasIntegrationTest.testSimple
   [junit4] Completed [5/5] on J1 in 59.03s, 1 test
   [junit4] 
   [junit4] JVM J0:     0.66 ..   125.01 =   124.35s
   [junit4] JVM J1:     0.46 ..   127.93 =   127.47s
   [junit4] JVM J2:     0.46 ..    69.13 =    68.67s
   [junit4] Execution time total: 2 minutes 7 seconds
   [junit4] Tests summary: 5 suites, 5 tests
   [junit4] Could not remove temporary path: /home/jenkins/workspace/Lucene-Solr-8.2-Linux/solr/build/solr-core/test/J2 (java.nio.file.DirectoryNotEmptyException: Remaining files: [/home/jenkins/workspace/Lucene-Solr-8.2-Linux/solr/build/solr-core/test/J2/temp])
   [junit4] Could not remove temporary path: /home/jenkins/workspace/Lucene-Solr-8.2-Linux/solr/build/solr-core/test/J0 (java.nio.file.DirectoryNotEmptyException: Remaining files: [/home/jenkins/workspace/Lucene-Solr-8.2-Linux/solr/build/solr-core/test/J0/temp])
   [junit4] Could not remove temporary path: /home/jenkins/workspace/Lucene-Solr-8.2-Linux/solr/build/solr-core/test/J1 (java.nio.file.DirectoryNotEmptyException: Remaining files: [/home/jenkins/workspace/Lucene-Solr-8.2-Linux/solr/build/solr-core/test/J1/temp])
     [echo] 5 slowest tests:
[junit4:tophints] 261.61s | org.apache.solr.cloud.autoscaling.IndexSizeTriggerTest
[junit4:tophints] 206.59s | org.apache.solr.cloud.TestStressLiveNodes
[junit4:tophints] 190.98s | org.apache.solr.cloud.api.collections.ShardSplitTest
[junit4:tophints] 123.02s | org.apache.solr.cloud.CollectionsAPISolrJTest
[junit4:tophints] 116.85s | org.apache.solr.update.SoftAutoCommitTest

-check-totals:

test-nocompile:

BUILD SUCCESSFUL
Total time: 2 minutes 10 seconds
[repro] Failures:
[repro]   0/5 failed: org.apache.solr.cloud.autoscaling.AutoAddReplicasIntegrationTest
[repro] Exiting with code 0
+ mv lucene/build lucene/build.repro
+ mv solr/build solr/build.repro
+ mv lucene/build.orig lucene/build
+ mv solr/build.orig solr/build
Archiving artifacts
Setting ANT_1_8_2_HOME=/home/jenkins/tools/hudson.tasks.Ant_AntInstallation/ANT_1.8.2
java.lang.InterruptedException: no matches found within 10000
	at hudson.FilePath$ValidateAntFileMask.hasMatch(FilePath.java:2805)
	at hudson.FilePath$ValidateAntFileMask.invoke(FilePath.java:2684)
	at hudson.FilePath$ValidateAntFileMask.invoke(FilePath.java:2665)
	at hudson.FilePath.act(FilePath.java:1078)
	at hudson.FilePath.act(FilePath.java:1061)
	at hudson.FilePath.validateAntFileMask(FilePath.java:2663)
	at hudson.tasks.ArtifactArchiver.perform(ArtifactArchiver.java:248)
	at hudson.tasks.BuildStepCompatibilityLayer.perform(BuildStepCompatibilityLayer.java:79)
	at hudson.tasks.BuildStepMonitor$1.perform(BuildStepMonitor.java:20)
	at hudson.model.AbstractBuild$AbstractBuildExecution.perform(AbstractBuild.java:741)
	at hudson.model.AbstractBuild$AbstractBuildExecution.performAllBuildSteps(AbstractBuild.java:690)
	at hudson.model.Build$BuildExecution.post2(Build.java:186)
	at hudson.model.AbstractBuild$AbstractBuildExecution.post(AbstractBuild.java:635)
	at hudson.model.Run.execute(Run.java:1840)
	at hudson.model.FreeStyleBuild.run(FreeStyleBuild.java:43)
	at hudson.model.ResourceController.execute(ResourceController.java:97)
	at hudson.model.Executor.run(Executor.java:429)
No artifacts found that match the file pattern "**/*.events,heapdumps/**,**/*_pid*.log". Configuration error?
[WARNINGS] Parsing warnings in console log with parser Java Compiler (javac)
Setting ANT_1_8_2_HOME=/home/jenkins/tools/hudson.tasks.Ant_AntInstallation/ANT_1.8.2
No credentials specified
Setting ANT_1_8_2_HOME=/home/jenkins/tools/hudson.tasks.Ant_AntInstallation/ANT_1.8.2
<Git Blamer> Using GitBlamer to create author and commit information for all warnings.
<Git Blamer> GIT_COMMIT=31d7ec7bbfdcd2c4cc61d9d35e962165410b65fe, workspace=/home/jenkins/workspace/Lucene-Solr-8.2-Linux
[WARNINGS] Computing warning deltas based on reference build #467
Recording test results
Setting ANT_1_8_2_HOME=/home/jenkins/tools/hudson.tasks.Ant_AntInstallation/ANT_1.8.2
Build step 'Publish JUnit test result report' changed build result to UNSTABLE
Email was triggered for: Unstable (Test Failures)
Sending email for trigger: Unstable (Test Failures)
Setting ANT_1_8_2_HOME=/home/jenkins/tools/hudson.tasks.Ant_AntInstallation/ANT_1.8.2
Setting ANT_1_8_2_HOME=/home/jenkins/tools/hudson.tasks.Ant_AntInstallation/ANT_1.8.2
Setting ANT_1_8_2_HOME=/home/jenkins/tools/hudson.tasks.Ant_AntInstallation/ANT_1.8.2
Setting ANT_1_8_2_HOME=/home/jenkins/tools/hudson.tasks.Ant_AntInstallation/ANT_1.8.2
Setting ANT_1_8_2_HOME=/home/jenkins/tools/hudson.tasks.Ant_AntInstallation/ANT_1.8.2
Setting ANT_1_8_2_HOME=/home/jenkins/tools/hudson.tasks.Ant_AntInstallation/ANT_1.8.2

Mime
View raw message