mahout-user mailing list archives

Site index · List index
Message view « Date » · « Thread »
Top « Date » · « Thread »
From Kivanc Tuncsav <yemeksep...@gmail.com>
Subject Test Errors
Date Sun, 06 Jul 2014 15:36:30 GMT
Hello All;

I've just downloaded the latest repo of

http://svn.apache.org/repos/asf/mahout/trun

When I tried to compile en Ubuntu 14.4 - Java 1.8.0_05 enviroment

I get the error

-------------------------------------------------------------------------------
Test set: org.apache.mahout.math.random.MultinomialTest
-------------------------------------------------------------------------------
Tests run: 8, Failures: 1, Errors: 0, Skipped: 0, Time elapsed: 0.386 sec
<<< FAILURE! - in org.apache.mahout.math.random.MultinomialTest
testPrime(org.apache.mahout.math.random.MultinomialTest)  Time elapsed:
0.03 sec  <<< FAILURE!
java.lang.AssertionError: expected:<16> but was:<17>
at __randomizedtesting.SeedInfo.seed([8FD198F17D16D05C:B8651B6514DC819C]:0)
at org.junit.Assert.fail(Assert.java:88)
at org.junit.Assert.failNotEquals(Assert.java:743)
at org.junit.Assert.assertEquals(Assert.java:118)
at org.junit.Assert.assertEquals(Assert.java:555)
at org.junit.Assert.assertEquals(Assert.java:542)
at
org.apache.mahout.math.random.MultinomialTest.testPrime(MultinomialTest.java:143)

I guess something wrong with me not the code. Any recommendations ?

Kivanc

Mime
  • Unnamed multipart/alternative (inline, None, 0 bytes)
View raw message