maven-issues mailing list archives

Site index · List index
Message view « Date » · « Thread »
Top « Date » · « Thread »
From "Dan Fabulich (JIRA)" <j...@codehaus.org>
Subject [jira] Closed: (SUREFIRE-453) unable to run spring/jpa/dao test with derby starting with surefire 2.4.x
Date Sun, 10 Feb 2008 00:43:28 GMT

     [ http://jira.codehaus.org/browse/SUREFIRE-453?page=com.atlassian.jira.plugin.system.issuetabpanels:all-tabpanel
]

Dan Fabulich closed SUREFIRE-453.
---------------------------------

    Resolution: Cannot Reproduce

I can't reproduce this; I think I need more environment information.  When I run this test,
no matter whether I use Surefire 2.3.1 or 2.4.1, I get a failure in ConfigDaoTest.testConfigDao,
shown below.

Maven version: 2.0.8
Java version: 1.5.0_12
OS name: "windows xp" version: "5.1" arch: "x86" Family: "windows"

{noformat}
testConfigDao(com.mycomp.mytest.ConfigDaoTest)  Time elapsed: 0.391 sec  <<< ERROR!
org.springframework.beans.factory.xml.XmlBeanDefinitionStoreException: Line 15 in XML document
from class path resource [com/mycomp/applicationContext-mytest-persistence.xml] is invalid;
nested exception is org.xml.sax.SAXParseException: cvc-complex-type.2.4.c: The matching wildcard
is strict, but no declaration can be found for element 'aop:aspectj-autoproxy'.
Caused by: org.xml.sax.SAXParseException: cvc-complex-type.2.4.c: The matching wildcard is
strict, but no declaration can be found for element 'aop:aspectj-autoproxy'.
	at com.sun.org.apache.xerces.internal.util.ErrorHandlerWrapper.createSAXParseException(ErrorHandlerWrapper.java:236)
	at com.sun.org.apache.xerces.internal.util.ErrorHandlerWrapper.error(ErrorHandlerWrapper.java:172)
	at com.sun.org.apache.xerces.internal.impl.XMLErrorReporter.reportError(XMLErrorReporter.java:382)
	at com.sun.org.apache.xerces.internal.impl.XMLErrorReporter.reportError(XMLErrorReporter.java:316)
	at com.sun.org.apache.xerces.internal.impl.xs.XMLSchemaValidator$XSIErrorReporter.reportError(XMLSchemaValidator.java:429)
	at com.sun.org.apache.xerces.internal.impl.xs.XMLSchemaValidator.reportSchemaError(XMLSchemaValidator.java:3185)
	at com.sun.org.apache.xerces.internal.impl.xs.XMLSchemaValidator.handleStartElement(XMLSchemaValidator.java:1955)
	at com.sun.org.apache.xerces.internal.impl.xs.XMLSchemaValidator.emptyElement(XMLSchemaValidator.java:725)
	at com.sun.org.apache.xerces.internal.impl.XMLNSDocumentScannerImpl.scanStartElement(XMLNSDocumentScannerImpl.java:322)
	at com.sun.org.apache.xerces.internal.impl.XMLDocumentFragmentScannerImpl$FragmentContentDispatcher.dispatch(XMLDocumentFragmentScannerImpl.java:1693)
	at com.sun.org.apache.xerces.internal.impl.XMLDocumentFragmentScannerImpl.scanDocument(XMLDocumentFragmentScannerImpl.java:368)
	at com.sun.org.apache.xerces.internal.parsers.XML11Configuration.parse(XML11Configuration.java:834)
	at com.sun.org.apache.xerces.internal.parsers.XML11Configuration.parse(XML11Configuration.java:764)
	at com.sun.org.apache.xerces.internal.parsers.XMLParser.parse(XMLParser.java:148)
	at com.sun.org.apache.xerces.internal.parsers.DOMParser.parse(DOMParser.java:250)
	at com.sun.org.apache.xerces.internal.jaxp.DocumentBuilderImpl.parse(DocumentBuilderImpl.java:292)
	at org.springframework.beans.factory.xml.DefaultDocumentLoader.loadDocument(DefaultDocumentLoader.java:76)
	at org.springframework.beans.factory.xml.XmlBeanDefinitionReader.doLoadBeanDefinitions(XmlBeanDefinitionReader.java:351)
	at org.springframework.beans.factory.xml.XmlBeanDefinitionReader.loadBeanDefinitions(XmlBeanDefinitionReader.java:303)
	at org.springframework.beans.factory.xml.XmlBeanDefinitionReader.loadBeanDefinitions(XmlBeanDefinitionReader.java:280)
	at org.springframework.beans.factory.support.AbstractBeanDefinitionReader.loadBeanDefinitions(AbstractBeanDefinitionReader.java:131)
	at org.springframework.beans.factory.support.AbstractBeanDefinitionReader.loadBeanDefinitions(AbstractBeanDefinitionReader.java:147)
	at org.springframework.beans.factory.support.AbstractBeanDefinitionReader.loadBeanDefinitions(AbstractBeanDefinitionReader.java:173)
	at sun.reflect.NativeMethodAccessorImpl.invoke0(Native Method)
	at sun.reflect.NativeMethodAccessorImpl.invoke(NativeMethodAccessorImpl.java:39)
	at sun.reflect.DelegatingMethodAccessorImpl.invoke(DelegatingMethodAccessorImpl.java:25)
	at java.lang.reflect.Method.invoke(Method.java:585)
	at org.springframework.test.jpa.AbstractJpaTests.runBare(AbstractJpaTests.java:209)
	at junit.framework.TestResult$1.protect(TestResult.java:106)
	at junit.framework.TestResult.runProtected(TestResult.java:124)
	at junit.framework.TestResult.run(TestResult.java:109)
	at junit.framework.TestCase.run(TestCase.java:118)
	at junit.framework.TestSuite.runTest(TestSuite.java:208)
	at junit.framework.TestSuite.run(TestSuite.java:203)
	at sun.reflect.NativeMethodAccessorImpl.invoke0(Native Method)
	at sun.reflect.NativeMethodAccessorImpl.invoke(NativeMethodAccessorImpl.java:39)
	at sun.reflect.DelegatingMethodAccessorImpl.invoke(DelegatingMethodAccessorImpl.java:25)
	at java.lang.reflect.Method.invoke(Method.java:585)
	at org.apache.maven.surefire.junit.JUnitTestSet.execute(JUnitTestSet.java:213)
	at org.apache.maven.surefire.suite.AbstractDirectoryTestSuite.executeTestSet(AbstractDirectoryTestSuite.java:138)
	at org.apache.maven.surefire.suite.AbstractDirectoryTestSuite.execute(AbstractDirectoryTestSuite.java:125)
	at org.apache.maven.surefire.Surefire.run(Surefire.java:132)
	at sun.reflect.NativeMethodAccessorImpl.invoke0(Native Method)
	at sun.reflect.NativeMethodAccessorImpl.invoke(NativeMethodAccessorImpl.java:39)
	at sun.reflect.DelegatingMethodAccessorImpl.invoke(DelegatingMethodAccessorImpl.java:25)
	at java.lang.reflect.Method.invoke(Method.java:585)
	at org.apache.maven.surefire.booter.SurefireBooter.runSuitesInProcess(SurefireBooter.java:308)
	at org.apache.maven.surefire.booter.SurefireBooter.main(SurefireBooter.java:879)
	at org.apache.maven.surefire.booter.SurefireBooter.main(SurefireBooter.java:879)
{noformat}

> unable to run spring/jpa/dao test with derby starting with surefire 2.4.x
> -------------------------------------------------------------------------
>
>                 Key: SUREFIRE-453
>                 URL: http://jira.codehaus.org/browse/SUREFIRE-453
>             Project: Maven Surefire
>          Issue Type: Bug
>          Components: plugin
>    Affects Versions: 2.4
>            Reporter: Dan Tran
>         Attachments: mytest-sources.jar
>
>
> here is the description reported on user list
> This may not be a blocking bug but It is a regresion since 2.4 where
> my Spring JpaDao with embedded Derby  test fails . Other databases are fine.
> The exception is producable with 2.5-SNAPSHOT ( build from source ),
> 2.4.1-SNAPSHOT( at apache snapshot repo).
> surefire 2.3 and 2.3.1 are fine.
> Any one else encounter this issue?
> -D
> -------------------------------------------------------------------------------
> Test set: com.iplocks.user.dao.UserDaoJpaTest
> -------------------------------------------------------------------------------
> Tests run: 7, Failures: 0, Errors: 6, Skipped: 0, Time elapsed: 14.111
> sec <<< FAILURE!
> testNamedConstraint(com.iplocks.user.dao.UserDaoJpaTest)  Time
> elapsed: 0.281 sec  <<< ERROR!
> javax.persistence.PersistenceException:
> org.hibernate.exception.GenericJDBCException: could not execute query
>        at org.hibernate.ejb.AbstractEntityManagerImpl.throwPersistenceException(AbstractEntityManagerImpl.java:630)
>        at org.hibernate.ejb.QueryImpl.getResultList(QueryImpl.java:75)
>        at com.iplocks.jpa.GenericNameDaoJpa.getByName(GenericNameDaoJpa.java:54)
>        at com.iplocks.user.dao.UserDaoJpaTest.createUser(UserDaoJpaTest.java:35)
>        at com.iplocks.user.dao.UserDaoJpaTest.createDefaultUser(UserDaoJpaTest.java:56)
>        at com.iplocks.user.dao.UserDaoJpaTest.testNamedConstraint(UserDaoJpaTest.java:77)
> Caused by: org.hibernate.exception.GenericJDBCException: could not execute query
>        at org.hibernate.exception.SQLStateConverter.handledNonSpecificException(SQLStateConverter.java:103)
>        at org.hibernate.exception.SQLStateConverter.convert(SQLStateConverter.java:91)
>        at org.hibernate.exception.JDBCExceptionHelper.convert(JDBCExceptionHelper.java:43)
>        at org.hibernate.loader.Loader.doList(Loader.java:2223)
>        at org.hibernate.loader.Loader.listIgnoreQueryCache(Loader.java:2104)
>        at org.hibernate.loader.Loader.list(Loader.java:2099)
>        at org.hibernate.loader.hql.QueryLoader.list(QueryLoader.java:378)
>        at org.hibernate.hql.ast.QueryTranslatorImpl.list(QueryTranslatorImpl.java:338)
>        at org.hibernate.engine.query.HQLQueryPlan.performList(HQLQueryPlan.java:172)
>        at org.hibernate.impl.SessionImpl.list(SessionImpl.java:1121)
>        at org.hibernate.impl.QueryImpl.list(QueryImpl.java:79)
>        at org.hibernate.ejb.QueryImpl.getResultList(QueryImpl.java:66)
>        ... 38 more
> Caused by: java.sql.SQLException: Cannot create an instance of
> generated class
> org.apache.derby.exe.ac12564092x0117xc31cx8752x00000020b5f01.
>        at org.apache.derby.impl.jdbc.SQLExceptionFactory.getSQLException(Unknown
> Please run mvn test using the attached maven project.  to run with different db, change
resources.properties accordingly

-- 
This message is automatically generated by JIRA.
-
If you think it was sent incorrectly contact one of the administrators: http://jira.codehaus.org/secure/Administrators.jspa
-
For more information on JIRA, see: http://www.atlassian.com/software/jira

        

Mime
View raw message