maven-issues mailing list archives

Site index · List index
Message view « Date » · « Thread »
Top « Date » · « Thread »
From "Philip Schwarz (JIRA)" <j...@codehaus.org>
Subject [jira] Commented: (MCOMPILER-30) Compiler fork executable fails when the path has spaces
Date Thu, 11 Sep 2008 14:22:48 GMT

    [ http://jira.codehaus.org/browse/MCOMPILER-30?page=com.atlassian.jira.plugin.system.issuetabpanels:comment-tabpanel&focusedCommentId=147671#action_147671
] 

Philip Schwarz commented on MCOMPILER-30:
-----------------------------------------

I am using Maven 2.0.9 and I have the problem even though there are no spaces in the path
to the JDK :

			<plugin>
				<groupId>org.apache.maven.plugins</groupId>
				<artifactId>maven-compiler-plugin</artifactId>
				<version>2.0.2</version>
				<configuration>
					<verbose>true</verbose>
					<fork>true</fork>
					<source>1.5</source>
					<target>1.5</target>
					<compilerVersion>1.5</compilerVersion>
					<executable>C:/Views/KFL_1_0/vendors/etc/solaris/jdk1.5.0_05/bin/javac</executable>
					<meminitial>128m</meminitial>
					<maxmem>512m</maxmem>
				</configuration>				
			</plugin>


[ERROR] BUILD FAILURE
[INFO] ------------------------------------------------------------------------
[INFO] Compilation failure
Failure executing javac,  but could not parse the error:
'C:\Views\KFL_1_0\vendors\etc\solaris\jdk1.5.0_05\bin\javac' is not recognized as an internal
or external command,
operable program or batch file.

Failure executing javac,  but could not parse the error:
'C:\Views\KFL_1_0\vendors\etc\solaris\jdk1.5.0_05\bin\javac' is not recognized as an internal
or external command,
operable program or batch file.


[INFO] ------------------------------------------------------------------------
[INFO] Trace
org.apache.maven.BuildFailureException: Compilation failure
Failure executing javac,  but could not parse the error:
'C:\Views\KFL_1_0\vendors\etc\solaris\jdk1.5.0_05\bin\javac' is not recognized as an internal
or external command,
operable program or batch file.


        at org.apache.maven.lifecycle.DefaultLifecycleExecutor.executeGoals(DefaultLifecycleExecutor.java:579)
        at org.apache.maven.lifecycle.DefaultLifecycleExecutor.executeGoalWithLifecycle(DefaultLifecycleExecutor.java:499)
        at org.apache.maven.lifecycle.DefaultLifecycleExecutor.executeGoal(DefaultLifecycleExecutor.java:478)
        at org.apache.maven.lifecycle.DefaultLifecycleExecutor.executeGoalAndHandleFailures(DefaultLifecycleExecutor.java:330)
        at org.apache.maven.lifecycle.DefaultLifecycleExecutor.executeTaskSegments(DefaultLifecycleExecutor.java:291)
        at org.apache.maven.lifecycle.DefaultLifecycleExecutor.execute(DefaultLifecycleExecutor.java:142)
        at org.apache.maven.DefaultMaven.doExecute(DefaultMaven.java:336)
        at org.apache.maven.DefaultMaven.execute(DefaultMaven.java:129)
        at org.apache.maven.cli.MavenCli.main(MavenCli.java:287)
        at sun.reflect.NativeMethodAccessorImpl.invoke0(Native Method)
        at sun.reflect.NativeMethodAccessorImpl.invoke(NativeMethodAccessorImpl.java:39)
        at sun.reflect.DelegatingMethodAccessorImpl.invoke(DelegatingMethodAccessorImpl.java:25)
        at java.lang.reflect.Method.invoke(Method.java:585)
        at org.codehaus.classworlds.Launcher.launchEnhanced(Launcher.java:315)
        at org.codehaus.classworlds.Launcher.launch(Launcher.java:255)
        at org.codehaus.classworlds.Launcher.mainWithExitCode(Launcher.java:430)
        at org.codehaus.classworlds.Launcher.main(Launcher.java:375)
Caused by: org.apache.maven.plugin.CompilationFailureException: Compilation failure
Failure executing javac,  but could not parse the error:
'C:\Views\KFL_1_0\vendors\etc\solaris\jdk1.5.0_05\bin\javac' is not recognized as an internal
or external command,
operable program or batch file.


        at org.apache.maven.plugin.AbstractCompilerMojo.execute(AbstractCompilerMojo.java:516)
        at org.apache.maven.plugin.CompilerMojo.execute(CompilerMojo.java:114)
        at org.apache.maven.plugin.DefaultPluginManager.executeMojo(DefaultPluginManager.java:451)
        at org.apache.maven.lifecycle.DefaultLifecycleExecutor.executeGoals(DefaultLifecycleExecutor.java:558)
        ... 16 more
[INFO] ------------------------------------------------------------------------
[INFO] Total time: 2 seconds
[INFO] Finished at: Thu Sep 11 15:15:57 BST 2008
[INFO] Final Memory: 2M/9M
[INFO] ------------------------------------------------------------------------

> Compiler fork executable fails when the path has spaces
> -------------------------------------------------------
>
>                 Key: MCOMPILER-30
>                 URL: http://jira.codehaus.org/browse/MCOMPILER-30
>             Project: Maven 2.x Compiler Plugin
>          Issue Type: Bug
>    Affects Versions: 2.0.1
>            Reporter: Carlos Sanchez
>             Fix For: 2.0.2
>
>
> JAVA_1_3_HOME=C:\Program Files\Java\jdk1.3.1_18
>         <plugin>
>           <artifactId>maven-compiler-plugin</artifactId>
>           <configuration>
>             <fork>true</fork>
>             <compilerVersion>1.3</compilerVersion>
>             <executable>${JAVA_1_3_HOME}/bin/javac</executable>
>           </configuration>
>         </plugin>
> Fails with
> Failure executing javac,  but could not parse the error:
> 'C:\Program' is not recognized as an internal or external command,
> operable program or batch file.

-- 
This message is automatically generated by JIRA.
-
If you think it was sent incorrectly contact one of the administrators: http://jira.codehaus.org/secure/Administrators.jspa
-
For more information on JIRA, see: http://www.atlassian.com/software/jira

        

Mime
View raw message