maven-issues mailing list archives

Site index · List index
Message view « Date » · « Thread »
Top « Date » · « Thread »
From "Arnaud Heritier (JIRA)" <j...@codehaus.org>
Subject [jira] Commented: (MNG-4813) org.jboss.maven.plugins:maven-jdocbook-plugin:2.1.1:generate fails with Maven 3.0-RC1
Date Fri, 17 Sep 2010 13:50:33 GMT

    [ http://jira.codehaus.org/browse/MNG-4813?page=com.atlassian.jira.plugin.system.issuetabpanels:comment-tabpanel&focusedCommentId=235620#action_235620
] 

Arnaud Heritier commented on MNG-4813:
--------------------------------------

But the question is why does it work with Maven 2.x ??
I didn't have the time to test more recent versions of this plugin to see if the code was
improved.

> org.jboss.maven.plugins:maven-jdocbook-plugin:2.1.1:generate fails with Maven 3.0-RC1
> -------------------------------------------------------------------------------------
>
>                 Key: MNG-4813
>                 URL: http://jira.codehaus.org/browse/MNG-4813
>             Project: Maven 2 & 3
>          Issue Type: Bug
>          Components: Plugins and Lifecycle
>    Affects Versions: 3.0-alpha-6, 3.0-alpha-7, 3.0-beta-1, 3.0-beta-2, 3.0-beta-3
>            Reporter: Arnaud Heritier
>            Assignee: Benjamin Bentmann
>
> Module to reproduce : https://anonsvn.jboss.org/repos/exo-jcr/jcr/trunk/docs/reference/en
> You'll probably need this repo to build : http://repository.exoplatform.org/public
> The error :
> {code}
> [INFO] --- maven-jdocbook-plugin:2.1.1:generate (default-generate) @ reference-docs-en
---
> Error at xsl:import on line 12 of jar:file:/Users/arnaud/.m2/repository/org/exoplatform/doc/exo-docbook-xslt/1/exo-docbook-xslt-1.jar!/xslt/org/exojcr/xhtml.xsl:
>   Malformed URL classpath:/xslt/org/jboss/xhtml.xsl(base jar:file:/Users/arnaud/.m2/repository/org/exoplatform/doc/exo-docbook-xslt/1/exo-docbook-xslt-1.jar!/xslt/org/exojcr/xhtml.xsl):
unknown protocol: classpath
> [INFO] ------------------------------------------------------------------------
> [INFO] BUILD FAILURE
> [INFO] ------------------------------------------------------------------------
> [INFO] Total time: 2.898s
> [INFO] Finished at: Thu Sep 16 22:13:39 CEST 2010
> [INFO] Final Memory: 7M/125M
> [INFO] ------------------------------------------------------------------------
> [ERROR] Failed to execute goal org.jboss.maven.plugins:maven-jdocbook-plugin:2.1.1:generate
(default-generate) on project reference-docs-en: XSLT problem: unable to build transformer
[null] : Failed to compile stylesheet. 1 error detected. -> [Help 1]
> org.apache.maven.lifecycle.LifecycleExecutionException: Failed to execute goal org.jboss.maven.plugins:maven-jdocbook-plugin:2.1.1:generate
(default-generate) on project reference-docs-en: XSLT problem
> 	at org.apache.maven.lifecycle.internal.MojoExecutor.execute(MojoExecutor.java:203)
> 	at org.apache.maven.lifecycle.internal.MojoExecutor.execute(MojoExecutor.java:148)
> 	at org.apache.maven.lifecycle.internal.MojoExecutor.execute(MojoExecutor.java:140)
> 	at org.apache.maven.lifecycle.internal.LifecycleModuleBuilder.buildProject(LifecycleModuleBuilder.java:84)
> 	at org.apache.maven.lifecycle.internal.LifecycleModuleBuilder.buildProject(LifecycleModuleBuilder.java:59)
> 	at org.apache.maven.lifecycle.internal.LifecycleStarter.singleThreadedBuild(LifecycleStarter.java:183)
> 	at org.apache.maven.lifecycle.internal.LifecycleStarter.execute(LifecycleStarter.java:161)
> 	at org.apache.maven.DefaultMaven.doExecute(DefaultMaven.java:315)
> 	at org.apache.maven.DefaultMaven.execute(DefaultMaven.java:152)
> 	at org.apache.maven.cli.MavenCli.execute(MavenCli.java:445)
> 	at org.apache.maven.cli.MavenCli.doMain(MavenCli.java:168)
> 	at org.apache.maven.cli.MavenCli.main(MavenCli.java:132)
> 	at sun.reflect.NativeMethodAccessorImpl.invoke0(Native Method)
> 	at sun.reflect.NativeMethodAccessorImpl.invoke(NativeMethodAccessorImpl.java:39)
> 	at sun.reflect.DelegatingMethodAccessorImpl.invoke(DelegatingMethodAccessorImpl.java:25)
> 	at java.lang.reflect.Method.invoke(Method.java:597)
> 	at org.codehaus.plexus.classworlds.launcher.Launcher.launchEnhanced(Launcher.java:290)
> 	at org.codehaus.plexus.classworlds.launcher.Launcher.launch(Launcher.java:230)
> 	at org.codehaus.plexus.classworlds.launcher.Launcher.mainWithExitCode(Launcher.java:409)
> 	at org.codehaus.plexus.classworlds.launcher.Launcher.main(Launcher.java:352)
> Caused by: org.apache.maven.plugin.MojoExecutionException: XSLT problem
> 	at org.jboss.maven.plugins.jdocbook.AbstractDocBookMojo.execute(AbstractDocBookMojo.java:285)
> 	at org.apache.maven.plugin.DefaultBuildPluginManager.executeMojo(DefaultBuildPluginManager.java:107)
> 	at org.apache.maven.lifecycle.internal.MojoExecutor.execute(MojoExecutor.java:195)
> 	... 19 more
> Caused by: org.jboss.jdocbook.xslt.XSLTException: unable to build transformer [null]
: Failed to compile stylesheet. 1 error detected.
> 	at org.jboss.jdocbook.xslt.TransformerBuilder.buildTransformer(TransformerBuilder.java:94)
> 	at org.jboss.jdocbook.xslt.TransformerBuilder.buildTransformer(TransformerBuilder.java:78)
> 	at org.jboss.jdocbook.render.impl.BasicRenderer.buildTransformer(BasicRenderer.java:139)
> 	at org.jboss.jdocbook.render.impl.BasicRenderer.performRendering(BasicRenderer.java:119)
> 	at org.jboss.jdocbook.render.impl.BasicRenderer.render(BasicRenderer.java:115)
> 	at org.jboss.maven.plugins.jdocbook.GenerationMojo.process(GenerationMojo.java:117)
> 	at org.jboss.maven.plugins.jdocbook.AbstractDocBookMojo.doExecute(AbstractDocBookMojo.java:250)
> 	at org.jboss.maven.plugins.jdocbook.AbstractDocBookMojo.execute(AbstractDocBookMojo.java:282)
> 	... 21 more
> Caused by: javax.xml.transform.TransformerConfigurationException: Failed to compile stylesheet.
1 error detected.
> 	at com.icl.saxon.PreparedStyleSheet.prepare(PreparedStyleSheet.java:136)
> 	at com.icl.saxon.TransformerFactoryImpl.newTemplates(TransformerFactoryImpl.java:127)
> 	at com.icl.saxon.TransformerFactoryImpl.newTransformer(TransformerFactoryImpl.java:79)
> 	at org.jboss.jdocbook.xslt.TransformerBuilder.buildTransformer(TransformerBuilder.java:88)
> 	... 28 more
> [ERROR] 
> [ERROR] Re-run Maven using the -X switch to enable full debug logging.
> [ERROR] 
> [ERROR] For more information about the errors and possible solutions, please read the
following articles:
> [ERROR] [Help 1] http://cwiki.apache.org/confluence/display/MAVEN/MojoExecutionException
> {code}
> It works fine with Maven 2.2.1
> It fails with 3.0-RC1 but all betas too.
> I didn't test with alpha.

-- 
This message is automatically generated by JIRA.
-
If you think it was sent incorrectly contact one of the administrators: http://jira.codehaus.org/secure/Administrators.jspa
-
For more information on JIRA, see: http://www.atlassian.com/software/jira

        

Mime
View raw message