maven-issues mailing list archives: January 2011

Site index · List index
Message list« Previous · 1 · 2 · 3 · 4 · 5 · 6 · 7 · 8 · 9 · Next »Thread · Author · Date
Kristian Rosenvold (JIRA) [jira] Closed: (SUREFIRE-685) Cannot pass multiple comma-separated includes Tue, 18 Jan, 14:59
Ulf B. (JIRA) [jira] Commented: (MECLIPSE-676) linkedResources: <location> vs <locationURI> Tue, 18 Jan, 15:09
Kristian Rosenvold (JIRA) [jira] Commented: (SUREFIRE-259) Calculation of relative path to xref is wrong Tue, 18 Jan, 15:17
sixman9 (JIRA) [jira] Commented: (MANTTASKS-170) deploy / install tasks make up names Tue, 18 Jan, 16:05
Kristian Rosenvold (JIRA) [jira] Updated: (SUREFIRE-259) Calculation of relative path to xref is wrong Tue, 18 Jan, 16:24
Kristian Rosenvold (JIRA) [jira] Closed: (SUREFIRE-259) Calculation of relative path to xref is wrong Tue, 18 Jan, 16:30
Oleg Rekutin (JIRA) [jira] Created: (MENFORCER-113) enforce goal should require dependency collection, not resolution Tue, 18 Jan, 18:34
Kristian Rosenvold (JIRA) [jira] Closed: (SUREFIRE-666) Aggregate report is empty for multimodule build. Tue, 18 Jan, 20:13
Kristian Rosenvold (JIRA) [jira] Updated: (SUREFIRE-601) Wildcards on -Dtest property Tue, 18 Jan, 20:16
Andrew Westberg (JIRA) [jira] Created: (MNG-4983) OS family detection incorrect when setting a profile on OSX Tue, 18 Jan, 20:20
Oleg Rekutin (JIRA) [jira] Updated: (MENFORCER-113) enforce goal should require dependency collection, not resolution Tue, 18 Jan, 20:47
Dennis Lundberg (JIRA) [jira] Commented: (MRESOURCES-134) EspaceString doesn't work Tue, 18 Jan, 20:53
Benjamin Bentmann (JIRA) [jira] Closed: (MNG-4983) OS family detection incorrect when setting a profile on OSX Tue, 18 Jan, 21:42
panxiaobo (JIRA) [jira] Commented: (SUREFIRE-686) maven reported "BUILD FAILURE" even if all tests passed Wed, 19 Jan, 03:17
panxiaobo (JIRA) [jira] Updated: (SUREFIRE-686) maven reported "BUILD FAILURE" even if all tests passed Wed, 19 Jan, 03:19
panxiaobo (JIRA) [jira] Issue Comment Edited: (SUREFIRE-686) maven reported "BUILD FAILURE" even if all tests passed Wed, 19 Jan, 03:21
Kristian Rosenvold (JIRA) [jira] Commented: (SUREFIRE-686) maven reported "BUILD FAILURE" even if all tests passed Wed, 19 Jan, 08:20
Kristian Rosenvold (JIRA) [jira] Issue Comment Edited: (SUREFIRE-686) maven reported "BUILD FAILURE" even if all tests passed Wed, 19 Jan, 08:21
Sean Patrick Floyd (JIRA) [jira] Created: (MDEP-298) mvn dependency:sources lists parameters 'classifier' and 'type', but manually overrides them Wed, 19 Jan, 11:38
Lukas Theussl (JIRA) [jira] Commented: (MSITE-502) Multiple Parent-Links and additional module-link inherited wrong from parent Wed, 19 Jan, 11:40
Steffi Tinder (JIRA) [jira] Updated: (MRELEASE-634) Versions of snapshot dependencies to the same artifact with different classifiers are not updated correctly during release:prepare Wed, 19 Jan, 12:53
Steffi Tinder (JIRA) [jira] Commented: (MRELEASE-634) Versions of snapshot dependencies to the same artifact with different classifiers are not updated correctly during release:prepare Wed, 19 Jan, 12:57
Benjamin Bentmann (JIRA) [jira] Created: (MNG-4984) Simplify drop in of 3rd party extensions for Maven core Wed, 19 Jan, 13:46
Benjamin Bentmann (JIRA) [jira] Closed: (MNG-4984) Simplify drop in of 3rd party extensions for Maven core Wed, 19 Jan, 13:50
Wujek (JIRA) [jira] Created: (MNG-4985) Transitive dependencies with classifiers not resolved correctly Wed, 19 Jan, 14:57
Benjamin Bentmann (JIRA) [jira] Closed: (MNG-4985) Transitive dependencies with classifiers not resolved correctly Wed, 19 Jan, 15:14
Wujek (JIRA) [jira] Commented: (MNG-4985) Transitive dependencies with classifiers not resolved correctly Wed, 19 Jan, 16:33
Benjamin Bentmann (JIRA) [jira] Commented: (MNG-4985) Transitive dependencies with classifiers not resolved correctly Wed, 19 Jan, 16:37
Kristian Rosenvold (JIRA) [jira] Commented: (SUREFIRE-508) cannot run GWTTestCases with surefire Wed, 19 Jan, 17:13
Olivier Lamy (JIRA) [jira] Commented: (SUREFIRE-508) cannot run GWTTestCases with surefire Wed, 19 Jan, 17:36
Wujek (JIRA) [jira] Commented: (MNG-4985) Transitive dependencies with classifiers not resolved correctly Wed, 19 Jan, 19:10
Danilo Recchia (JIRA) [jira] Commented: (MECLIPSE-132) "Class not found" when run/debug JUnit tests Wed, 19 Jan, 19:22
Kristian Rosenvold (JIRA) [jira] Closed: (SUREFIRE-570) Empty surefire reports when a multi-module project is ran with multiple report directories in surefire-report configuration Wed, 19 Jan, 20:38
Kristian Rosenvold (JIRA) [jira] Closed: (SUREFIRE-516) Definition of multiple Suite-Files not working Wed, 19 Jan, 21:01
Jordan Zimmerman (JIRA) [jira] Created: (ARCHETYPE-363) When creating the archetype project pom, distribution management only gets added if there is a parent project Wed, 19 Jan, 21:32
Olivier Lamy (JIRA) [jira] Closed: (SCM-574) GitCheckInCommand fails on empty changed files list Wed, 19 Jan, 21:48
Olivier Lamy (JIRA) [jira] Closed: (SCM-587) Branch support for Mercurial (hg) SCM provider Wed, 19 Jan, 21:55
Isaac Qu (JIRA) [jira] Created: (MNG-4986) After "mvn deploy" an SNAPSHOT artifact to company central repo(artifactory-2.3.1), Could not download the artifact in other machines. Thu, 20 Jan, 01:06
Benjamin Bentmann (JIRA) [jira] Closed: (MNG-4986) After "mvn deploy" an SNAPSHOT artifact to company central repo(artifactory-2.3.1), Could not download the artifact in other machines. Thu, 20 Jan, 01:24
Jordan Zimmerman (JIRA) [jira] Commented: (ARCHETYPE-258) Support excluding files from to-be-created archetype Thu, 20 Jan, 05:33
Juven Xu (JIRA) [jira] Closed: (MEV-674) incorrect sha1 for jetty-runner Thu, 20 Jan, 06:54
Wujek (JIRA) [jira] Commented: (MNG-4985) Transitive dependencies with classifiers not resolved correctly Thu, 20 Jan, 07:02
Scott Carey (JIRA) [jira] Created: (MRELEASE-635) perform does not honor updateWorkingCopiesVersion setting Thu, 20 Jan, 07:05
panxiaobo (JIRA) [jira] Commented: (SUREFIRE-686) maven reported "BUILD FAILURE" even if all tests passed Thu, 20 Jan, 07:13
panxiaobo (JIRA) [jira] Issue Comment Edited: (SUREFIRE-686) maven reported "BUILD FAILURE" even if all tests passed Thu, 20 Jan, 07:31
Kristian Rosenvold (JIRA) [jira] Commented: (SUREFIRE-686) maven reported "BUILD FAILURE" even if all tests passed Thu, 20 Jan, 07:58
Luca (JIRA) [jira] Created: (MJAVADOC-307) phases not executed Thu, 20 Jan, 11:49
Luca (JIRA) [jira] Updated: (MJAVADOC-307) phases not executed Thu, 20 Jan, 11:51
Max Schaefer (JIRA) [jira] Created: (MASSEMBLY-542) Create bill of materials Thu, 20 Jan, 12:31
Kristoffer Peterhäesel (JIRA) [jira] Commented: (MRELEASE-318) Release plugin throws NullPointerException when using version range for dependency Thu, 20 Jan, 12:54
Michael Hartmeier (JIRA) [jira] Created: (MNG-4987) LATEST or RELEASE version picked from wrong repository metadata.xml Thu, 20 Jan, 12:56
Michael Hartmeier (JIRA) [jira] Commented: (MNG-4987) LATEST or RELEASE version picked from wrong repository metadata.xml Thu, 20 Jan, 12:58
Stephen Connolly (JIRA) [jira] Created: (MANTTASKS-210) When creating path objects using the dependencies task it is not possible to filter out artifacts by type. Thu, 20 Jan, 13:21
Stephen Connolly (JIRA) [jira] Closed: (MANTTASKS-210) When creating path objects using the dependencies task it is not possible to filter out artifacts by type. Thu, 20 Jan, 13:27
Luca (JIRA) [jira] Commented: (MSITE-543) links to modules where not working if modules are builded with --no-recursive (see continuum) Thu, 20 Jan, 13:29
Luca (JIRA) [jira] Updated: (MSITE-543) links to modules where not working if modules are builded with --no-recursive (see continuum) Thu, 20 Jan, 13:29
Kristian Rosenvold (JIRA) [jira] Closed: (SUREFIRE-260) Detail display doesn't work if there are tests with the same name Thu, 20 Jan, 14:14
Stephen Connolly (JIRA) [jira] Created: (MANTTASKS-211) Support launching Maven 3.x from the mvn task Thu, 20 Jan, 14:14
Gary Gregory (JIRA) [jira] Created: (MSITE-545) ArrayIndexOutOfBoundsException Generating "Project Team" report. Thu, 20 Jan, 14:17
Stephen Connolly (JIRA) [jira] Closed: (MANTTASKS-211) Support launching Maven 3.x from the mvn task Thu, 20 Jan, 14:28
Gary Gregory (JIRA) [jira] Commented: (MSITE-545) ArrayIndexOutOfBoundsException Generating "Project Team" report. Thu, 20 Jan, 14:34
Gary Gregory (JIRA) [jira] Closed: (MSITE-545) ArrayIndexOutOfBoundsException Generating "Project Team" report. Thu, 20 Jan, 14:34
Kristian Rosenvold (JIRA) [jira] Updated: (SUREFIRE-260) Detail display doesn't work if there are tests with the same name Thu, 20 Jan, 15:37
Timothy Mecklem (JIRA) [jira] Commented: (SUREFIRE-329) Support for JUNIT extensions Thu, 20 Jan, 15:40
Kristian Rosenvold (JIRA) [jira] Commented: (SUREFIRE-686) maven reported "BUILD FAILURE" even if all tests passed Thu, 20 Jan, 16:02
Kristian Rosenvold (JIRA) [jira] Closed: (SUREFIRE-686) maven reported "BUILD FAILURE" even if all tests passed Thu, 20 Jan, 16:04
goerge (JIRA) [jira] Created: (MDEP-299) dependency:get -DrepositoryUrl is mentioned wrong in help Thu, 20 Jan, 17:57
Lukas Theussl (JIRA) [jira] Commented: (MSITE-545) ArrayIndexOutOfBoundsException Generating "Project Team" report. Thu, 20 Jan, 17:59
Lukas Theussl (JIRA) [jira] Commented: (MSITE-543) links to modules where not working if modules are builded with --no-recursive (see continuum) Thu, 20 Jan, 18:09
Dennis Lundberg (JIRA) [jira] Moved: (MPIR-218) ArrayIndexOutOfBoundsException Generating "Project Team" report. Thu, 20 Jan, 19:43
Kristian Rosenvold (JIRA) [jira] Closed: (SUREFIRE-319) <skip>true</skip> cannot be overridden using mvn -Dmaven.test.skip=false test Thu, 20 Jan, 19:53
Kristian Rosenvold (JIRA) [jira] Closed: (SUREFIRE-682) <skipTests> cannot be overridden by commandline param Thu, 20 Jan, 19:55
Kristian Rosenvold (JIRA) [jira] Closed: (SUREFIRE-602) Unable to run tests using a different JVM unless using forkMode="once" (always and pertest do not work) Thu, 20 Jan, 20:54
Dennis Lundberg (JIRA) [jira] Closed: (MSHARED-179) FilteringUtils.escapeWindowsPath only works if the Windows path is at the beginning of a property Thu, 20 Jan, 21:00
Igor Fedorenko (JIRA) [jira] Created: (MNG-4988) API to calculate execution plan without full mojo execution configuration Thu, 20 Jan, 21:16
Igor Fedorenko (JIRA) [jira] Updated: (MNG-4988) API to calculate execution plan without full mojo execution configuration Thu, 20 Jan, 21:41
Jeff Campbell (JIRA) [jira] Commented: (MASSEMBLY-516) Error in Example for sharing-descriptors? Thu, 20 Jan, 21:55
Olivier Lamy (JIRA) [jira] Created: (SCM-596) Implements List command for mercurial provider Thu, 20 Jan, 21:55
Olivier Lamy (JIRA) [jira] Updated: (SCM-596) Implements List command for mercurial provider Thu, 20 Jan, 21:55
Benjamin Bentmann (JIRA) [jira] Commented: (MNG-4988) API to calculate execution plan without full mojo execution configuration Thu, 20 Jan, 22:26
Olivier Lamy (JIRA) [jira] Closed: (SCM-596) Implements List command for mercurial provider Thu, 20 Jan, 22:29
Dennis Lundberg (JIRA) [jira] Commented: (MASSEMBLY-516) Error in Example for sharing-descriptors? Thu, 20 Jan, 22:31
Ryan Connolly (JIRA) [jira] Commented: (ARCHETYPE-258) Support excluding files from to-be-created archetype Thu, 20 Jan, 23:01
Igor Fedorenko (JIRA) [jira] Closed: (MNG-4988) API to calculate execution plan without full mojo execution configuration Fri, 21 Jan, 00:59
Gynn Rickerby (JIRA) [jira] Created: (MNG-4989) Properties defined in settings.xml not being passed to dependent project dependency classifiers Fri, 21 Jan, 03:26
Grant Gardner (JIRA) [jira] Created: (SCM-597) NPE in AccuRev provider changelog Fri, 21 Jan, 03:32
Grant Gardner (JIRA) [jira] Commented: (SCM-597) NPE in AccuRev provider changelog Fri, 21 Jan, 03:32
Luca (JIRA) [jira] Commented: (MSITE-543) links to modules where not working if modules are builded with --no-recursive (see continuum) Fri, 21 Jan, 10:19
Benjamin Bentmann (JIRA) [jira] Closed: (MNG-4989) Properties defined in settings.xml not being passed to dependent project dependency classifiers Fri, 21 Jan, 11:16
Nico De Groote (JIRA) [jira] Created: (MRELEASE-636) Flat Layout branching not correctly supported - CONTAINS PATCH FOR 2.1 version of plugin - please apply Fri, 21 Jan, 12:03
Lukas Theussl (JIRA) [jira] Closed: (MSITE-543) links to modules where not working if modules are builded with --no-recursive (see continuum) Fri, 21 Jan, 12:36
Grant Gardner (JIRA) [jira] Updated: (SCM-597) NPE in AccuRev provider changelog Fri, 21 Jan, 12:47
Nico De Groote (JIRA) [jira] Issue Comment Edited: (MRELEASE-636) Flat Layout branching not correctly supported - CONTAINS PATCH FOR 2.1 version of plugin - please apply Fri, 21 Jan, 13:19
Kristian Rosenvold (JIRA) [jira] Commented: (SUREFIRE-534) Xpp3Dom gets in the way of org.omg.CORBA.INITIALIZE Fri, 21 Jan, 13:27
Tuomas Kiviaho (JIRA) [jira] Commented: (MASSEMBLY-324) DependencySet scope runtime includes jars that are scope provided Fri, 21 Jan, 13:29
Olivier Lamy (JIRA) [jira] Updated: (SCM-597) NPE in AccuRev provider changelog Fri, 21 Jan, 13:59
Andrei Pozolotin (JIRA) [jira] Commented: (MNG-4452) Metadata for snapshots should include classifier Fri, 21 Jan, 15:04
Bernd Vogt (JIRA) [jira] Created: (MNG-4990) RepositorySystem#resolve(request) uses two different local repositories Fri, 21 Jan, 15:15
Bernd Vogt (JIRA) [jira] Created: (MNG-4991) LegacyRepositorySystem#injectProxy(repositories, proxies) doesn't evaluate non-proxy hosts Fri, 21 Jan, 16:48
Kristian Rosenvold (JIRA) [jira] Created: (SUREFIRE-687) JunitCore runs classes that are not tests Fri, 21 Jan, 20:26
Message list« Previous · 1 · 2 · 3 · 4 · 5 · 6 · 7 · 8 · 9 · Next »Thread · Author · Date
Box list
Sep 2019253
Aug 20191079
Jul 20191201
Jun 20191463
May 20191238
Apr 20191434
Mar 20191043
Feb 20191148
Jan 20192031
Dec 20182051
Nov 20181463
Oct 20181185
Sep 20181229
Aug 20181400
Jul 20181344
Jun 20181054
May 20181351
Apr 20181337
Mar 20182089
Feb 2018851
Jan 2018918
Dec 2017829
Nov 2017593
Oct 2017589
Sep 2017588
Aug 2017706
Jul 2017556
Jun 2017561
May 2017769
Apr 20171029
Mar 2017653
Feb 2017811
Jan 20171051
Dec 2016759
Nov 2016892
Oct 2016700
Sep 2016576
Aug 2016732
Jul 2016730
Jun 2016922
May 20161229
Apr 2016697
Mar 2016526
Feb 2016959
Jan 20161170
Dec 20151317
Nov 2015674
Oct 2015870
Sep 20151358
Aug 2015567
Jul 2015439
Jun 2015602
May 2015566
Apr 2015562
Mar 2015519
Feb 2015473
Jan 2015966
Dec 20141267
Nov 20142252
Oct 20141297
Sep 2014997
Aug 2014618
Jul 2014836
Jun 2014854
May 2014445
Apr 2014532
Mar 2014611
Feb 2014541
Jan 2014811
Dec 2013323
Nov 2013504
Oct 2013302
Sep 2013390
Aug 2013365
Jul 2013481
Jun 2013443
May 2013493
Apr 2013426
Mar 2013510
Feb 2013555
Jan 2013698
Dec 2012510
Nov 2012793
Oct 2012664
Sep 2012648
Aug 2012635
Jul 2012540
Jun 2012593
May 2012517
Apr 2012494
Mar 2012443
Feb 2012632
Jan 2012461
Dec 2011566
Nov 2011523
Oct 2011396
Sep 2011541
Aug 2011669
Jul 2011558
Jun 2011564
May 2011548
Apr 2011512
Mar 2011648
Feb 2011746
Jan 2011871
Dec 2010796
Nov 2010556
Oct 2010798
Sep 2010996
Aug 2010832
Jul 2010526
Jun 2010387
May 2010811
Apr 2010696
Mar 2010787
Feb 2010718
Jan 2010857
Dec 20091081
Nov 2009767
Oct 2009688
Sep 2009722
Aug 2009916
Jul 20091793
Jun 2009682
May 2009857
Apr 2009920
Mar 20091141
Feb 20091060
Jan 20091058
Dec 20081530
Nov 2008712
Oct 2008682
Sep 20081059
Aug 20081054
Jul 20081127
Jun 20081200
May 20081429
Apr 20081141
Mar 20081374
Feb 20081246
Jan 20081280
Dec 2007921
Nov 20071651
Oct 20071647
Sep 20071625
Aug 20071479
Jul 20071645
Jun 20071935
May 20071738
Apr 20071251
Mar 20071931
Feb 2007990
Jan 20071749
Dec 20061066
Nov 20061509
Oct 20061251
Sep 20061421
Aug 20061968
Jul 20061706
Jun 20062076
May 20061686
Apr 20061653
Mar 20061428