maven-issues mailing list archives

Site index · List index
Message view « Date » · « Thread »
Top « Date » · « Thread »
From "Kristian Rosenvold (JIRA)" <j...@codehaus.org>
Subject [jira] (SUREFIRE-910) Surefire 2.12.1 fails with "The forked VM terminated without saying properly goodbye"
Date Wed, 07 Nov 2012 19:01:13 GMT

    [ https://jira.codehaus.org/browse/SUREFIRE-910?page=com.atlassian.jira.plugin.system.issuetabpanels:comment-tabpanel&focusedCommentId=313040#comment-313040
] 

Kristian Rosenvold commented on SUREFIRE-910:
---------------------------------------------

I just added a faq entry about this issue, explaining what the situation is; the entry will
appear in the faq once the site gets published, but can be seen here:

https://git-wip-us.apache.org/repos/asf?p=maven-surefire.git;a=commitdiff;h=0e900e3196f77d5b26b951731fc6ee1f28c2effd;hp=ec09dc90ed989a24f934bcd8b80713483a23bfc7

The morale here is that there's little hope in waiting for us to fix this, since there are
no known cases when this issue happens within surefire itself. Unless the source of the issue
is some resource leak from within surefire itself, this most likely some kind of leak within
your code/libraries.

Now there may be some failure conditions we should be picking up (dumped messages coming to
the console), so I'm keeping this issue open a little longer; but basically this is a "cannot
reproduce". 


                
> Surefire 2.12.1 fails with "The forked VM terminated without saying properly goodbye"
> -------------------------------------------------------------------------------------
>
>                 Key: SUREFIRE-910
>                 URL: https://jira.codehaus.org/browse/SUREFIRE-910
>             Project: Maven Surefire
>          Issue Type: Bug
>          Components: Maven Surefire Plugin
>            Reporter: Ilya Katsov
>
> Build fails with "The forked VM terminated without saying properly goodbye" message with
no information about the source of the problem:
> {code}
> Tests run: 1, Failures: 0, Errors: 0, Skipped: 0, Time elapsed: 3.125 sec
> Running org.apache.hadoop.fs.viewfs.TestViewFsHdfs
> Tests run: 42, Failures: 0, Errors: 0, Skipped: 0, Time elapsed: 14.149 sec
> Running org.apache.hadoop.fs.TestFcHdfsSymlink
> Tests run: 67, Failures: 0, Errors: 0, Skipped: 0, Time elapsed: 20.792 sec
> Results :
> Tests run: 1033, Failures: 0, Errors: 0, Skipped: 1
> [INFO]                                                                         
> [INFO] ------------------------------------------------------------------------
> [INFO] Skipping Apache Hadoop HDFS Project
> [INFO] This project has been banned from the build due to previous failures.
> [INFO] ------------------------------------------------------------------------
> [INFO]                                                                         
> [INFO] ------------------------------------------------------------------------
> [INFO] Skipping Apache Hadoop HDFS
> [INFO] This project has been banned from the build due to previous failures.
> [INFO] ------------------------------------------------------------------------
> [INFO] ------------------------------------------------------------------------
> [INFO] Reactor Summary:
> [INFO] 
> [INFO] Apache Hadoop HDFS ................................ FAILURE [1:06:10.415s]
> [INFO] Apache Hadoop HttpFS .............................. SKIPPED
> [INFO] Apache Hadoop HDFS Project ........................ SKIPPED
> [INFO] ------------------------------------------------------------------------
> [INFO] BUILD FAILURE
> [INFO] ------------------------------------------------------------------------
> [INFO] Total time: 1:06:11.188s
> [INFO] Finished at: Wed Sep 05 12:01:46 MSK 2012
> [INFO] Final Memory: 24M/394M
> [INFO] ------------------------------------------------------------------------
> [ERROR] Failed to execute goal org.apache.maven.plugins:maven-surefire-plugin:2.12.1:test
(default-test) on project hadoop-hdfs: ExecutionException; nested exception is java.util.concurrent.ExecutionException:
java.lang.RuntimeException: The forked VM terminated without saying properly goodbye. VM crash
or System.exit called ? -> [Help 1]
> org.apache.maven.lifecycle.LifecycleExecutionException: Failed to execute goal org.apache.maven.plugins:maven-surefire-plugin:2.12.1:test
(default-test) on project hadoop-hdfs: ExecutionException; nested exception is java.util.concurrent.ExecutionException:
java.lang.RuntimeException: The forked VM terminated without saying properly goodbye. VM crash
or System.exit called ?
> 	at org.apache.maven.lifecycle.internal.MojoExecutor.execute(MojoExecutor.java:217)
> 	at org.apache.maven.lifecycle.internal.MojoExecutor.execute(MojoExecutor.java:153)
> 	at org.apache.maven.lifecycle.internal.MojoExecutor.execute(MojoExecutor.java:145)
> 	at org.apache.maven.lifecycle.internal.LifecycleModuleBuilder.buildProject(LifecycleModuleBuilder.java:84)
> 	at org.apache.maven.lifecycle.internal.LifecycleModuleBuilder.buildProject(LifecycleModuleBuilder.java:59)
> 	at org.apache.maven.lifecycle.internal.LifecycleStarter.singleThreadedBuild(LifecycleStarter.java:183)
> 	at org.apache.maven.lifecycle.internal.LifecycleStarter.execute(LifecycleStarter.java:161)
> 	at org.apache.maven.DefaultMaven.doExecute(DefaultMaven.java:320)
> 	at org.apache.maven.DefaultMaven.execute(DefaultMaven.java:156)
> 	at org.apache.maven.cli.MavenCli.execute(MavenCli.java:537)
> 	at org.apache.maven.cli.MavenCli.doMain(MavenCli.java:196)
> 	at org.apache.maven.cli.MavenCli.main(MavenCli.java:141)
> 	at sun.reflect.NativeMethodAccessorImpl.invoke0(Native Method)
> 	at sun.reflect.NativeMethodAccessorImpl.invoke(NativeMethodAccessorImpl.java:39)
> 	at sun.reflect.DelegatingMethodAccessorImpl.invoke(DelegatingMethodAccessorImpl.java:25)
> 	at java.lang.reflect.Method.invoke(Method.java:597)
> 	at org.codehaus.plexus.classworlds.launcher.Launcher.launchEnhanced(Launcher.java:290)
> 	at org.codehaus.plexus.classworlds.launcher.Launcher.launch(Launcher.java:230)
> 	at org.codehaus.plexus.classworlds.launcher.Launcher.mainWithExitCode(Launcher.java:409)
> 	at org.codehaus.plexus.classworlds.launcher.Launcher.main(Launcher.java:352)
> {code}
> It seems to be similar to SUREFIRE-837, but it is not fixed 2.12.1.

--
This message is automatically generated by JIRA.
If you think it was sent incorrectly, please contact your JIRA administrators: https://jira.codehaus.org/secure/ContactAdministrators!default.jspa
For more information on JIRA, see: http://www.atlassian.com/software/jira

        

Mime
View raw message