maven-issues mailing list archives

Site index · List index
Message view « Date » · « Thread »
Top « Date » · « Thread »
From "Dan Tran (JIRA)" <j...@codehaus.org>
Subject [jira] (SCM-768) TfsBranchCommandTest is failing
Date Fri, 25 Jul 2014 19:26:10 GMT

     [ https://jira.codehaus.org/browse/SCM-768?page=com.atlassian.jira.plugin.system.issuetabpanels:all-tabpanel
]

Dan Tran updated SCM-768:
-------------------------

    Description: 
it is currently failing under 1.9.2-SNAPSHOT. 

Tests run: 2, Failures: 1, Errors: 0, Skipped: 0, Time elapsed: 0.028 sec <<< FAILURE!
- in org.apache.maven.scm.provider.tfs.command.TfsBranchCommandTest
testCommandline(org.apache.maven.scm.provider.tfs.command.TfsBranchCommandTest)  Time elapsed:
0.016 sec  <<< FAILURE!
junit.framework.ComparisonFailure: null expected:<...login:user,password [C:\Users\trand8\dev\maven\maven-scm\maven-scm-providers\maven-scm-provider-tfs\target\scm-test\working-copy]
-checkin branch">
 but was:<...login:user,password [serverpath] -checkin branch">
        at junit.framework.Assert.assertEquals(Assert.java:81)
        at junit.framework.Assert.assertEquals(Assert.java:87)
        at org.apache.maven.scm.ScmTestCase.assertCommandLine(ScmTestCase.java:364)
        at org.apache.maven.scm.provider.tfs.command.TfsBranchCommandTest.testCommandline(TfsBranchCommandTest.java:36)

  was:it is currently failing under 1.9.2-SNAPSHOT


> TfsBranchCommandTest is failing 
> --------------------------------
>
>                 Key: SCM-768
>                 URL: https://jira.codehaus.org/browse/SCM-768
>             Project: Maven SCM
>          Issue Type: Task
>          Components: maven-scm-provider-tfs
>            Reporter: Dan Tran
>
> it is currently failing under 1.9.2-SNAPSHOT. 
> Tests run: 2, Failures: 1, Errors: 0, Skipped: 0, Time elapsed: 0.028 sec <<<
FAILURE! - in org.apache.maven.scm.provider.tfs.command.TfsBranchCommandTest
> testCommandline(org.apache.maven.scm.provider.tfs.command.TfsBranchCommandTest)  Time
elapsed: 0.016 sec  <<< FAILURE!
> junit.framework.ComparisonFailure: null expected:<...login:user,password [C:\Users\trand8\dev\maven\maven-scm\maven-scm-providers\maven-scm-provider-tfs\target\scm-test\working-copy]
-checkin branch">
>  but was:<...login:user,password [serverpath] -checkin branch">
>         at junit.framework.Assert.assertEquals(Assert.java:81)
>         at junit.framework.Assert.assertEquals(Assert.java:87)
>         at org.apache.maven.scm.ScmTestCase.assertCommandLine(ScmTestCase.java:364)
>         at org.apache.maven.scm.provider.tfs.command.TfsBranchCommandTest.testCommandline(TfsBranchCommandTest.java:36)



--
This message was sent by Atlassian JIRA
(v6.1.6#6162)

Mime
View raw message