maven-issues mailing list archives

Site index · List index
Message view « Date » · « Thread »
Top « Date » · « Thread »
From "Christian Schulte (JIRA)" <j...@apache.org>
Subject [jira] [Closed] (MNG-5819) Failure with maven-site-plugin:stage
Date Mon, 25 Jan 2016 02:26:39 GMT

     [ https://issues.apache.org/jira/browse/MNG-5819?page=com.atlassian.jira.plugin.system.issuetabpanels:all-tabpanel
]

Christian Schulte closed MNG-5819.
----------------------------------
       Resolution: Cannot Reproduce
         Assignee: Christian Schulte
    Fix Version/s: 3.4.0

> Failure with maven-site-plugin:stage
> ------------------------------------
>
>                 Key: MNG-5819
>                 URL: https://issues.apache.org/jira/browse/MNG-5819
>             Project: Maven
>          Issue Type: Bug
>    Affects Versions: 3.0.5
>         Environment: Apache Maven 3.0.5 (r01de14724cdef164cd33c7c8c2fe155faf9602da; 2013-02-19
14:51:28+0100)
> Maven home: /usr/share/maven
> Java version: 1.7.0_21, vendor: Oracle Corporation
> Java home: /Library/Java/JavaVirtualMachines/jdk1.7.0_21.jdk/Contents/Home/jre
> Default locale: en_US, platform encoding: UTF-8
> OS name: "mac os x", version: "10.8.5", arch: "x86_64", family: "mac"
>            Reporter: Karl Heinz Marbaise
>            Assignee: Christian Schulte
>            Priority: Blocker
>             Fix For: 3.4.0
>
>
> If i try to stage the site of maven itself it fails with the following message:
> {code}Karl-Heinzs-MacBook-Pro:maven kama$ mvn site:stage
> [INFO] Scanning for projects...
> [INFO] ------------------------------------------------------------------------
> [INFO] Reactor Build Order:
> [INFO]
> [INFO] Apache Maven
> [INFO] Maven Model
> [INFO] Maven Artifact
> [INFO] Maven Plugin API
> [INFO] Maven Builder Support
> [INFO] Maven Model Builder
> [INFO] Maven Settings
> [INFO] Maven Settings Builder
> [INFO] Maven Repository Metadata Model
> [INFO] Maven Aether Provider
> [INFO] Maven Core
> [INFO] Maven Compat
> [INFO] Maven Embedder
> [INFO] Apache Maven Distribution
> [INFO]
> [INFO] ------------------------------------------------------------------------
> [INFO] Building Apache Maven 3.3.3
> [INFO] ------------------------------------------------------------------------
> [INFO]
> [INFO] --- maven-site-plugin:3.4:stage (default-cli) @ maven ---
> [INFO] Using this base directory for staging: /Users/kama/ws-git/apache/maven/target/staging
> file:///Users/kama/ws-git/apache/maven/target/staging/ - Session: Opened
> [INFO] Pushing /Users/kama/ws-git/apache/maven/target/site
> [INFO]    >>> to file:///Users/kama/ws-git/apache/maven/target/staging/../../../components/ref/3-LATEST
> file:///Users/kama/ws-git/apache/maven/target/staging/ - Session: Disconnecting
> file:///Users/kama/ws-git/apache/maven/target/staging/ - Session: Disconnected
> [INFO] ------------------------------------------------------------------------
> [INFO] Reactor Summary:
> [INFO]
> [INFO] Apache Maven ...................................... FAILURE [0.967s]
> [INFO] Maven Model ....................................... SKIPPED
> [INFO] Maven Artifact .................................... SKIPPED
> [INFO] Maven Plugin API .................................. SKIPPED
> [INFO] Maven Builder Support ............................. SKIPPED
> [INFO] Maven Model Builder ............................... SKIPPED
> [INFO] Maven Settings .................................... SKIPPED
> [INFO] Maven Settings Builder ............................ SKIPPED
> [INFO] Maven Repository Metadata Model ................... SKIPPED
> [INFO] Maven Aether Provider ............................. SKIPPED
> [INFO] Maven Core ........................................ SKIPPED
> [INFO] Maven Compat ...................................... SKIPPED
> [INFO] Maven Embedder .................................... SKIPPED
> [INFO] Apache Maven Distribution ......................... SKIPPED
> [INFO] ------------------------------------------------------------------------
> [INFO] BUILD FAILURE
> [INFO] ------------------------------------------------------------------------
> [INFO] Total time: 1.662s
> [INFO] Finished at: Sun May 03 16:51:13 CEST 2015
> [INFO] Final Memory: 14M/213M
> [INFO] ------------------------------------------------------------------------
> [ERROR] Failed to execute goal org.apache.maven.plugins:maven-site-plugin:3.4:stage (default-cli)
on project maven: Execution default-cli of goal org.apache.maven.plugins:maven-site-plugin:3.4:stage
failed: A required class was missing while executing org.apache.maven.plugins:maven-site-plugin:3.4:stage:
org/apache/commons/lang/StringUtils
> [ERROR] -----------------------------------------------------
> [ERROR] realm =    plugin>org.apache.maven.plugins:maven-site-plugin:3.4
> [ERROR] strategy = org.codehaus.plexus.classworlds.strategy.SelfFirstStrategy
> [ERROR] urls[0] = file:/Users/kama/.m2/repository/org/apache/maven/plugins/maven-site-plugin/3.4/maven-site-plugin-3.4.jar
> [ERROR] urls[1] = file:/Users/kama/.m2/repository/org/apache/maven/maven-archiver/2.5/maven-archiver-2.5.jar
> [ERROR] urls[2] = file:/Users/kama/.m2/repository/org/codehaus/plexus/plexus-interpolation/1.15/plexus-interpolation-1.15.jar
> [ERROR] urls[3] = file:/Users/kama/.m2/repository/org/codehaus/plexus/plexus-archiver/2.4.4/plexus-archiver-2.4.4.jar
> [ERROR] urls[4] = file:/Users/kama/.m2/repository/junit/junit/3.8.1/junit-3.8.1.jar
> [ERROR] urls[5] = file:/Users/kama/.m2/repository/org/codehaus/plexus/plexus-io/2.0.10/plexus-io-2.0.10.jar
> [ERROR] urls[6] = file:/Users/kama/.m2/repository/org/apache/commons/commons-compress/1.5/commons-compress-1.5.jar
> [ERROR] urls[7] = file:/Users/kama/.m2/repository/org/tukaani/xz/1.2/xz-1.2.jar
> [ERROR] urls[8] = file:/Users/kama/.m2/repository/org/apache/maven/reporting/maven-reporting-exec/1.2/maven-reporting-exec-1.2.jar
> [ERROR] urls[9] = file:/Users/kama/.m2/repository/org/apache/maven/reporting/maven-reporting-api/3.0/maven-reporting-api-3.0.jar
> [ERROR] urls[10] = file:/Users/kama/.m2/repository/org/apache/maven/shared/maven-shared-utils/0.3/maven-shared-utils-0.3.jar
> [ERROR] urls[11] = file:/Users/kama/.m2/repository/com/google/code/findbugs/jsr305/2.0.1/jsr305-2.0.1.jar
> [ERROR] urls[12] = file:/Users/kama/.m2/repository/org/sonatype/aether/aether-util/1.7/aether-util-1.7.jar
> [ERROR] urls[13] = file:/Users/kama/.m2/repository/org/eclipse/aether/aether-util/0.9.0.M2/aether-util-0.9.0.M2.jar
> [ERROR] urls[14] = file:/Users/kama/.m2/repository/org/sonatype/sisu/sisu-inject-bean/1.4.2/sisu-inject-bean-1.4.2.jar
> [ERROR] urls[15] = file:/Users/kama/.m2/repository/org/sonatype/sisu/sisu-guice/2.1.7/sisu-guice-2.1.7-noaop.jar
> [ERROR] urls[16] = file:/Users/kama/.m2/repository/org/codehaus/plexus/plexus-component-annotations/1.5.5/plexus-component-annotations-1.5.5.jar
> [ERROR] urls[17] = file:/Users/kama/.m2/repository/org/sonatype/plexus/plexus-sec-dispatcher/1.3/plexus-sec-dispatcher-1.3.jar
> [ERROR] urls[18] = file:/Users/kama/.m2/repository/org/sonatype/plexus/plexus-cipher/1.4/plexus-cipher-1.4.jar
> [ERROR] urls[19] = file:/Users/kama/.m2/repository/org/apache/maven/doxia/doxia-sink-api/1.6/doxia-sink-api-1.6.jar
> [ERROR] urls[20] = file:/Users/kama/.m2/repository/org/apache/maven/doxia/doxia-logging-api/1.6/doxia-logging-api-1.6.jar
> [ERROR] urls[21] = file:/Users/kama/.m2/repository/org/apache/maven/doxia/doxia-core/1.6/doxia-core-1.6.jar
> [ERROR] urls[22] = file:/Users/kama/.m2/repository/xerces/xercesImpl/2.9.1/xercesImpl-2.9.1.jar
> [ERROR] urls[23] = file:/Users/kama/.m2/repository/xml-apis/xml-apis/1.3.04/xml-apis-1.3.04.jar
> [ERROR] urls[24] = file:/Users/kama/.m2/repository/org/apache/httpcomponents/httpclient/4.0.2/httpclient-4.0.2.jar
> [ERROR] urls[25] = file:/Users/kama/.m2/repository/commons-logging/commons-logging/1.1.1/commons-logging-1.1.1.jar
> [ERROR] urls[26] = file:/Users/kama/.m2/repository/commons-codec/commons-codec/1.3/commons-codec-1.3.jar
> [ERROR] urls[27] = file:/Users/kama/.m2/repository/org/apache/httpcomponents/httpcore/4.0.1/httpcore-4.0.1.jar
> [ERROR] urls[28] = file:/Users/kama/.m2/repository/xmlunit/xmlunit/1.5/xmlunit-1.5.jar
> [ERROR] urls[29] = file:/Users/kama/.m2/repository/org/apache/maven/doxia/doxia-module-xhtml/1.6/doxia-module-xhtml-1.6.jar
> [ERROR] urls[30] = file:/Users/kama/.m2/repository/org/apache/maven/doxia/doxia-module-apt/1.6/doxia-module-apt-1.6.jar
> [ERROR] urls[31] = file:/Users/kama/.m2/repository/org/apache/maven/doxia/doxia-module-xdoc/1.6/doxia-module-xdoc-1.6.jar
> [ERROR] urls[32] = file:/Users/kama/.m2/repository/org/apache/maven/doxia/doxia-module-fml/1.6/doxia-module-fml-1.6.jar
> [ERROR] urls[33] = file:/Users/kama/.m2/repository/org/apache/maven/doxia/doxia-module-markdown/1.6/doxia-module-markdown-1.6.jar
> [ERROR] urls[34] = file:/Users/kama/.m2/repository/org/pegdown/pegdown/1.2.1/pegdown-1.2.1.jar
> [ERROR] urls[35] = file:/Users/kama/.m2/repository/org/parboiled/parboiled-java/1.1.4/parboiled-java-1.1.4.jar
> [ERROR] urls[36] = file:/Users/kama/.m2/repository/org/parboiled/parboiled-core/1.1.4/parboiled-core-1.1.4.jar
> [ERROR] urls[37] = file:/Users/kama/.m2/repository/org/ow2/asm/asm/4.1/asm-4.1.jar
> [ERROR] urls[38] = file:/Users/kama/.m2/repository/org/ow2/asm/asm-tree/4.1/asm-tree-4.1.jar
> [ERROR] urls[39] = file:/Users/kama/.m2/repository/org/ow2/asm/asm-analysis/4.1/asm-analysis-4.1.jar
> [ERROR] urls[40] = file:/Users/kama/.m2/repository/org/ow2/asm/asm-util/4.1/asm-util-4.1.jar
> [ERROR] urls[41] = file:/Users/kama/.m2/repository/javax/servlet/servlet-api/2.5/servlet-api-2.5.jar
> [ERROR] urls[42] = file:/Users/kama/.m2/repository/org/apache/maven/doxia/doxia-decoration-model/1.6/doxia-decoration-model-1.6.jar
> [ERROR] urls[43] = file:/Users/kama/.m2/repository/org/apache/maven/doxia/doxia-site-renderer/1.6/doxia-site-renderer-1.6.jar
> [ERROR] urls[44] = file:/Users/kama/.m2/repository/org/apache/velocity/velocity-tools/2.0/velocity-tools-2.0.jar
> [ERROR] urls[45] = file:/Users/kama/.m2/repository/commons-beanutils/commons-beanutils/1.7.0/commons-beanutils-1.7.0.jar
> [ERROR] urls[46] = file:/Users/kama/.m2/repository/commons-digester/commons-digester/1.8/commons-digester-1.8.jar
> [ERROR] urls[47] = file:/Users/kama/.m2/repository/commons-chain/commons-chain/1.1/commons-chain-1.1.jar
> [ERROR] urls[48] = file:/Users/kama/.m2/repository/commons-validator/commons-validator/1.3.1/commons-validator-1.3.1.jar
> [ERROR] urls[49] = file:/Users/kama/.m2/repository/dom4j/dom4j/1.1/dom4j-1.1.jar
> [ERROR] urls[50] = file:/Users/kama/.m2/repository/sslext/sslext/1.2-0/sslext-1.2-0.jar
> [ERROR] urls[51] = file:/Users/kama/.m2/repository/org/apache/struts/struts-core/1.3.8/struts-core-1.3.8.jar
> [ERROR] urls[52] = file:/Users/kama/.m2/repository/antlr/antlr/2.7.2/antlr-2.7.2.jar
> [ERROR] urls[53] = file:/Users/kama/.m2/repository/org/apache/struts/struts-taglib/1.3.8/struts-taglib-1.3.8.jar
> [ERROR] urls[54] = file:/Users/kama/.m2/repository/org/apache/struts/struts-tiles/1.3.8/struts-tiles-1.3.8.jar
> [ERROR] urls[55] = file:/Users/kama/.m2/repository/commons-collections/commons-collections/3.2.1/commons-collections-3.2.1.jar
> [ERROR] urls[56] = file:/Users/kama/.m2/repository/org/apache/maven/doxia/doxia-integration-tools/1.6/doxia-integration-tools-1.6.jar
> [ERROR] urls[57] = file:/Users/kama/.m2/repository/org/codehaus/plexus/plexus-i18n/1.0-beta-7/plexus-i18n-1.0-beta-7.jar
> [ERROR] urls[58] = file:/Users/kama/.m2/repository/org/apache/velocity/velocity/1.5/velocity-1.5.jar
> [ERROR] urls[59] = file:/Users/kama/.m2/repository/oro/oro/2.0.8/oro-2.0.8.jar
> [ERROR] urls[60] = file:/Users/kama/.m2/repository/org/codehaus/plexus/plexus-velocity/1.1.8/plexus-velocity-1.1.8.jar
> [ERROR] urls[61] = file:/Users/kama/.m2/repository/org/codehaus/plexus/plexus-utils/3.0.15/plexus-utils-3.0.15.jar
> [ERROR] urls[62] = file:/Users/kama/.m2/repository/org/mortbay/jetty/jetty/6.1.25/jetty-6.1.25.jar
> [ERROR] urls[63] = file:/Users/kama/.m2/repository/org/mortbay/jetty/servlet-api/2.5-20081211/servlet-api-2.5-20081211.jar
> [ERROR] urls[64] = file:/Users/kama/.m2/repository/org/mortbay/jetty/jetty-util/6.1.25/jetty-util-6.1.25.jar
> [ERROR] urls[65] = file:/Users/kama/.m2/repository/commons-lang/commons-lang/2.5/commons-lang-2.5.jar
> [ERROR] urls[66] = file:/Users/kama/.m2/repository/commons-io/commons-io/1.4/commons-io-1.4.jar
> [ERROR] Number of foreign imports: 1
> [ERROR] import: Entry[import  from realm ClassRealm[maven.api, parent: null]]
> [ERROR]
> [ERROR] -----------------------------------------------------: org.apache.commons.lang.StringUtils
> [ERROR] -> [Help 1]
> [ERROR]
> [ERROR] To see the full stack trace of the errors, re-run Maven with the -e switch.
> [ERROR] Re-run Maven using the -X switch to enable full debug logging.
> [ERROR]
> [ERROR] For more information about the errors and possible solutions, please read the
following articles:
> [ERROR] [Help 1] http://cwiki.apache.org/confluence/display/MAVEN/PluginContainerException
> {code}
> The interesting things here is that if i use Maven 3.1.1, or above the problems vanishes...



--
This message was sent by Atlassian JIRA
(v6.3.4#6332)

Mime
View raw message