maven-issues mailing list archives

Site index · List index
Message view « Date » · « Thread »
Top « Date » · « Thread »
From "Ben Alex (JIRA)" <j...@apache.org>
Subject [jira] [Created] (MDEP-559) Java 9 bytecode cannot be parsed
Date Fri, 17 Mar 2017 06:39:41 GMT
Ben Alex created MDEP-559:
-----------------------------

             Summary: Java 9 bytecode cannot be parsed
                 Key: MDEP-559
                 URL: https://issues.apache.org/jira/browse/MDEP-559
             Project: Maven Dependency Plugin
          Issue Type: Bug
          Components: analyze
    Affects Versions: 3.0.0
         Environment: Apache Maven 3.3.9 (NON-CANONICAL_2015-11-23T13:17:27+03:00_root; 2015-11-23T21:17:27+11:00)
Maven home: /opt/maven
Java version: 9-ea, vendor: Oracle Corporation
Java home: /usr/lib/jvm/java-9-jdk
Default locale: en_AU, platform encoding: UTF-8
OS name: "linux", version: "4.9.11-1-arch", arch: "amd64", family: "unix"
            Reporter: Ben Alex


Attempting to run analyze-only against source compiled with Java 9 results in:

{noformat}
[INFO] --- maven-dependency-plugin:3.0.0:analyze-only (config-dependency) @ lmdbjava ---
[DEBUG] Configuring mojo org.apache.maven.plugins:maven-dependency-plugin:3.0.0:analyze-only
from plugin realm ClassRealm[plugin>org.apache.maven.plugins:maven-dependency-plugin:3.0.0,
parent: jdk.internal.loader.ClassLoaders$AppClassLoader@3b764bce]
[DEBUG] Configuring mojo 'org.apache.maven.plugins:maven-dependency-plugin:3.0.0:analyze-only'
with basic configurator -->
[DEBUG]   (f) analyzer = default
[DEBUG]   (f) baseDir = /home/bpa/projects/lmdbjava
[DEBUG]   (f) failOnWarning = true
[DEBUG]   (f) ignoreNonCompile = false
[DEBUG]   (f) outputDirectory = /home/bpa/projects/lmdbjava/target
[DEBUG]   (f) outputXML = false
[DEBUG]   (f) project = MavenProject: org.lmdbjava:lmdbjava:0.0.6-SNAPSHOT @ /home/bpa/projects/lmdbjava/dependency-reduced-pom.xml
[DEBUG]   (f) scriptableFlag = $$%%%
[DEBUG]   (f) scriptableOutput = false
[DEBUG]   (f) skip = false
[DEBUG]   (f) usedDependencies = [org.lmdbjava:lmdbjava-native-linux-x86_64, org.lmdbjava:lmdbjava-native-windows-x86_64,
org.lmdbjava:lmdbjava-native-osx-x86_64]
[DEBUG]   (f) verbose = false
[DEBUG] -- end configuration --
[INFO] ------------------------------------------------------------------------
[INFO] BUILD FAILURE
[INFO] ------------------------------------------------------------------------
[INFO] Total time: 7.256 s
[INFO] Finished at: 2017-03-17T17:32:20+11:00
[INFO] Final Memory: 40M/132M
[INFO] ------------------------------------------------------------------------
[ERROR] Failed to execute goal org.apache.maven.plugins:maven-dependency-plugin:3.0.0:analyze-only
(config-dependency) on project lmdbjava: Execution config-dependency of goal org.apache.maven.plugins:maven-dependency-plugin:3.0.0:analyze-only
failed. IllegalArgumentException -> [Help 1]
org.apache.maven.lifecycle.LifecycleExecutionException: Failed to execute goal org.apache.maven.plugins:maven-dependency-plugin:3.0.0:analyze-only
(config-dependency) on project lmdbjava: Execution config-dependency of goal org.apache.maven.plugins:maven-dependency-plugin:3.0.0:analyze-only
failed.
	at org.apache.maven.lifecycle.internal.MojoExecutor.execute(MojoExecutor.java:212)
	at org.apache.maven.lifecycle.internal.MojoExecutor.execute(MojoExecutor.java:153)
	at org.apache.maven.lifecycle.internal.MojoExecutor.execute(MojoExecutor.java:145)
	at org.apache.maven.lifecycle.internal.LifecycleModuleBuilder.buildProject(LifecycleModuleBuilder.java:116)
	at org.apache.maven.lifecycle.internal.LifecycleModuleBuilder.buildProject(LifecycleModuleBuilder.java:80)
	at org.apache.maven.lifecycle.internal.builder.singlethreaded.SingleThreadedBuilder.build(SingleThreadedBuilder.java:51)
	at org.apache.maven.lifecycle.internal.LifecycleStarter.execute(LifecycleStarter.java:128)
	at org.apache.maven.DefaultMaven.doExecute(DefaultMaven.java:307)
	at org.apache.maven.DefaultMaven.doExecute(DefaultMaven.java:193)
	at org.apache.maven.DefaultMaven.execute(DefaultMaven.java:106)
	at org.apache.maven.cli.MavenCli.execute(MavenCli.java:863)
	at org.apache.maven.cli.MavenCli.doMain(MavenCli.java:288)
	at org.apache.maven.cli.MavenCli.main(MavenCli.java:199)
	at java.base/jdk.internal.reflect.NativeMethodAccessorImpl.invoke0(Native Method)
	at java.base/jdk.internal.reflect.NativeMethodAccessorImpl.invoke(NativeMethodAccessorImpl.java:62)
	at java.base/jdk.internal.reflect.DelegatingMethodAccessorImpl.invoke(DelegatingMethodAccessorImpl.java:43)
	at java.base/java.lang.reflect.Method.invoke(Method.java:547)
	at org.codehaus.plexus.classworlds.launcher.Launcher.launchEnhanced(Launcher.java:289)
	at org.codehaus.plexus.classworlds.launcher.Launcher.launch(Launcher.java:229)
	at org.codehaus.plexus.classworlds.launcher.Launcher.mainWithExitCode(Launcher.java:415)
	at org.codehaus.plexus.classworlds.launcher.Launcher.main(Launcher.java:356)
Caused by: org.apache.maven.plugin.PluginExecutionException: Execution config-dependency of
goal org.apache.maven.plugins:maven-dependency-plugin:3.0.0:analyze-only failed.
	at org.apache.maven.plugin.DefaultBuildPluginManager.executeMojo(DefaultBuildPluginManager.java:145)
	at org.apache.maven.lifecycle.internal.MojoExecutor.execute(MojoExecutor.java:207)
	... 20 more
Caused by: java.lang.IllegalArgumentException
	at org.objectweb.asm.ClassReader.<init>(Unknown Source)
	at org.objectweb.asm.ClassReader.<init>(Unknown Source)
	at org.objectweb.asm.ClassReader.<init>(Unknown Source)
	at org.apache.maven.shared.dependency.analyzer.asm.DependencyClassFileVisitor.visitClass(DependencyClassFileVisitor.java:65)
	at org.apache.maven.shared.dependency.analyzer.ClassFileVisitorUtils.visitClass(ClassFileVisitorUtils.java:163)
	at org.apache.maven.shared.dependency.analyzer.ClassFileVisitorUtils.acceptDirectory(ClassFileVisitorUtils.java:143)
	at org.apache.maven.shared.dependency.analyzer.ClassFileVisitorUtils.accept(ClassFileVisitorUtils.java:71)
	at org.apache.maven.shared.dependency.analyzer.asm.ASMDependencyAnalyzer.analyze(ASMDependencyAnalyzer.java:50)
	at org.apache.maven.shared.dependency.analyzer.DefaultProjectDependencyAnalyzer.buildDependencyClasses(DefaultProjectDependencyAnalyzer.java:213)
	at org.apache.maven.shared.dependency.analyzer.DefaultProjectDependencyAnalyzer.buildDependencyClasses(DefaultProjectDependencyAnalyzer.java:200)
	at org.apache.maven.shared.dependency.analyzer.DefaultProjectDependencyAnalyzer.analyze(DefaultProjectDependencyAnalyzer.java:74)
	at org.apache.maven.plugins.dependency.analyze.AbstractAnalyzeMojo.checkDependencies(AbstractAnalyzeMojo.java:306)
	at org.apache.maven.plugins.dependency.analyze.AbstractAnalyzeMojo.execute(AbstractAnalyzeMojo.java:257)
	at org.apache.maven.plugin.DefaultBuildPluginManager.executeMojo(DefaultBuildPluginManager.java:134)
	... 21 more
{noformat}



--
This message was sent by Atlassian JIRA
(v6.3.15#6346)

Mime
View raw message