maven-issues mailing list archives

Site index · List index
Message view « Date » · « Thread »
Top « Date » · « Thread »
From "Jordan Zimmerman (JIRA)" <j...@apache.org>
Subject [jira] [Comment Edited] (SUREFIRE-1612) ExecutionException TypeNotPresentExceptionProxy
Date Mon, 17 Dec 2018 00:31:00 GMT

    [ https://issues.apache.org/jira/browse/SUREFIRE-1612?page=com.atlassian.jira.plugin.system.issuetabpanels:comment-tabpanel&focusedCommentId=16722617#comment-16722617
] 

Jordan Zimmerman edited comment on SUREFIRE-1612 at 12/17/18 12:30 AM:
-----------------------------------------------------------------------

OK - the dump file shows this:

{noformat}
# Created at 2018-12-16T18:48:09.873
java.lang.ArrayStoreException: sun.reflect.annotation.TypeNotPresentExceptionProxy
	at sun.reflect.annotation.AnnotationParser.parseClassArray(AnnotationParser.java:724)
	at sun.reflect.annotation.AnnotationParser.parseArray(AnnotationParser.java:531)
	at sun.reflect.annotation.AnnotationParser.parseMemberValue(AnnotationParser.java:355)
	at sun.reflect.annotation.AnnotationParser.parseAnnotation2(AnnotationParser.java:286)
	at sun.reflect.annotation.AnnotationParser.parseAnnotations2(AnnotationParser.java:120)
	at sun.reflect.annotation.AnnotationParser.parseAnnotations(AnnotationParser.java:72)
	at java.lang.reflect.Executable.declaredAnnotations(Executable.java:599)
	at java.lang.reflect.Executable.declaredAnnotations(Executable.java:597)
	at java.lang.reflect.Executable.getAnnotation(Executable.java:570)
	at java.lang.reflect.Method.getAnnotation(Method.java:622)
	at org.testng.internal.annotations.JDK15AnnotationFinder.findAnnotation(JDK15AnnotationFinder.java:111)
	at org.testng.internal.TestNGClassFinder.<init>(TestNGClassFinder.java:77)
	at org.testng.internal.TestNGClassFinder.<init>(TestNGClassFinder.java:40)
	at org.testng.TestRunner.initMethods(TestRunner.java:403)
	at org.testng.TestRunner.init(TestRunner.java:252)
	at org.testng.TestRunner.init(TestRunner.java:222)
	at org.testng.TestRunner.<init>(TestRunner.java:163)
	at org.testng.SuiteRunner$DefaultTestRunnerFactory.newTestRunner(SuiteRunner.java:585)
	at org.testng.SuiteRunner.init(SuiteRunner.java:189)
	at org.testng.SuiteRunner.<init>(SuiteRunner.java:136)
	at org.testng.TestNG.createSuiteRunner(TestNG.java:1375)
	at org.testng.TestNG.createSuiteRunners(TestNG.java:1355)
	at org.testng.TestNG.runSuitesLocally(TestNG.java:1209)
	at org.testng.TestNG.runSuites(TestNG.java:1133)
	at org.testng.TestNG.run(TestNG.java:1104)
	at org.apache.maven.surefire.testng.TestNGExecutor.run(TestNGExecutor.java:135)
	at org.apache.maven.surefire.testng.TestNGDirectoryTestSuite.executeSingleClass(TestNGDirectoryTestSuite.java:112)
	at org.apache.maven.surefire.testng.TestNGDirectoryTestSuite.execute(TestNGDirectoryTestSuite.java:99)
	at org.apache.maven.surefire.testng.TestNGProvider.invoke(TestNGProvider.java:146)
	at org.apache.maven.surefire.booter.ForkedBooter.invokeProviderInSameClassLoader(ForkedBooter.java:383)
	at org.apache.maven.surefire.booter.ForkedBooter.runSuitesInProcess(ForkedBooter.java:344)
	at org.apache.maven.surefire.booter.ForkedBooter.execute(ForkedBooter.java:125)
	at org.apache.maven.surefire.booter.ForkedBooter.main(ForkedBooter.java:417)
{noformat}

But that's just the same as the exception


was (Author: randgalt):
OK - the dump file shows this:

{noformat}
# Created at 2018-12-16T18:48:09.873
java.lang.ArrayStoreException: sun.reflect.annotation.TypeNotPresentExceptionProxy
	at sun.reflect.annotation.AnnotationParser.parseClassArray(AnnotationParser.java:724)
	at sun.reflect.annotation.AnnotationParser.parseArray(AnnotationParser.java:531)
	at sun.reflect.annotation.AnnotationParser.parseMemberValue(AnnotationParser.java:355)
	at sun.reflect.annotation.AnnotationParser.parseAnnotation2(AnnotationParser.java:286)
	at sun.reflect.annotation.AnnotationParser.parseAnnotations2(AnnotationParser.java:120)
	at sun.reflect.annotation.AnnotationParser.parseAnnotations(AnnotationParser.java:72)
	at java.lang.reflect.Executable.declaredAnnotations(Executable.java:599)
	at java.lang.reflect.Executable.declaredAnnotations(Executable.java:597)
	at java.lang.reflect.Executable.getAnnotation(Executable.java:570)
	at java.lang.reflect.Method.getAnnotation(Method.java:622)
	at org.testng.internal.annotations.JDK15AnnotationFinder.findAnnotation(JDK15AnnotationFinder.java:111)
	at org.testng.internal.TestNGClassFinder.<init>(TestNGClassFinder.java:77)
	at org.testng.internal.TestNGClassFinder.<init>(TestNGClassFinder.java:40)
	at org.testng.TestRunner.initMethods(TestRunner.java:403)
	at org.testng.TestRunner.init(TestRunner.java:252)
	at org.testng.TestRunner.init(TestRunner.java:222)
	at org.testng.TestRunner.<init>(TestRunner.java:163)
	at org.testng.SuiteRunner$DefaultTestRunnerFactory.newTestRunner(SuiteRunner.java:585)
	at org.testng.SuiteRunner.init(SuiteRunner.java:189)
	at org.testng.SuiteRunner.<init>(SuiteRunner.java:136)
	at org.testng.TestNG.createSuiteRunner(TestNG.java:1375)
	at org.testng.TestNG.createSuiteRunners(TestNG.java:1355)
	at org.testng.TestNG.runSuitesLocally(TestNG.java:1209)
	at org.testng.TestNG.runSuites(TestNG.java:1133)
	at org.testng.TestNG.run(TestNG.java:1104)
	at org.apache.maven.surefire.testng.TestNGExecutor.run(TestNGExecutor.java:135)
	at org.apache.maven.surefire.testng.TestNGDirectoryTestSuite.executeSingleClass(TestNGDirectoryTestSuite.java:112)
	at org.apache.maven.surefire.testng.TestNGDirectoryTestSuite.execute(TestNGDirectoryTestSuite.java:99)
	at org.apache.maven.surefire.testng.TestNGProvider.invoke(TestNGProvider.java:146)
	at org.apache.maven.surefire.booter.ForkedBooter.invokeProviderInSameClassLoader(ForkedBooter.java:383)
	at org.apache.maven.surefire.booter.ForkedBooter.runSuitesInProcess(ForkedBooter.java:344)
	at org.apache.maven.surefire.booter.ForkedBooter.execute(ForkedBooter.java:125)
	at org.apache.maven.surefire.booter.ForkedBooter.main(ForkedBooter.java:417)
{noformat}

> ExecutionException TypeNotPresentExceptionProxy
> -----------------------------------------------
>
>                 Key: SUREFIRE-1612
>                 URL: https://issues.apache.org/jira/browse/SUREFIRE-1612
>             Project: Maven Surefire
>          Issue Type: Bug
>          Components: Maven Surefire Plugin
>    Affects Versions: 2.22.0
>            Reporter: Jordan Zimmerman
>            Priority: Major
>
> I'm not sure what causes this, but it's very consistent. At the end of the last module
of Apache Curator's test run we get this exception. Sometimes it causes the build to fail,
sometimes not. The pom is here: [https://github.com/apache/curator/blob/master/curator-test-zk34/pom.xml]
> Here's an example failure at Apache's Jenkins:
> [https://builds.apache.org/job/Curator/74/console]
> {{[INFO] }}
> {{ [INFO] Results:}}
> {{ [INFO] }}
> {{ [INFO] Tests run: 400, Failures: 0, Errors: 0, Skipped: 0}}
> {{ [INFO] }}
> {{ [ERROR] There are test failures.}}{{Please refer to /home/jenkins/jenkins-slave/workspace/Curator/curator-test-zk34/target/surefire-reports
for the individual test results.}}
> {{ Please refer to dump files (if any exist) [date]-jvmRun[N].dump, [date].dumpstream
and [date]-jvmRun[N].dumpstream.}}
> {{ ExecutionException There was an error in the forked process}}
> {{ sun.reflect.annotation.TypeNotPresentExceptionProxy}}
> {{ org.apache.maven.surefire.booter.SurefireBooterForkException: ExecutionException There
was an error in the forked process}}
> {{ sun.reflect.annotation.TypeNotPresentExceptionProxy}}
> {{ at org.apache.maven.plugin.surefire.booterclient.ForkStarter.awaitResultsDone(ForkStarter.java:494)}}
> {{ at org.apache.maven.plugin.surefire.booterclient.ForkStarter.runSuitesForkPerTestSet(ForkStarter.java:441)}}
> {{ at org.apache.maven.plugin.surefire.booterclient.ForkStarter.run(ForkStarter.java:293)}}
> {{ at org.apache.maven.plugin.surefire.booterclient.ForkStarter.run(ForkStarter.java:245)}}
> {{ at org.apache.maven.plugin.surefire.AbstractSurefireMojo.executeProvider(AbstractSurefireMojo.java:1194)}}
> {{ at org.apache.maven.plugin.surefire.AbstractSurefireMojo.executeAfterPreconditionsChecked(AbstractSurefireMojo.java:1022)}}
> {{ at org.apache.maven.plugin.surefire.AbstractSurefireMojo.execute(AbstractSurefireMojo.java:868)}}
> {{ at org.apache.maven.plugin.DefaultBuildPluginManager.executeMojo(DefaultBuildPluginManager.java:132)}}
>  
>  



--
This message was sent by Atlassian JIRA
(v7.6.3#76005)

Mime
View raw message