maven-issues mailing list archives

Site index · List index
Message view « Date » · « Thread »
Top « Date » · « Thread »
From Jörg Sesterhenn (JIRA) <j...@apache.org>
Subject [jira] [Commented] (SUREFIRE-1628) Plugins fail to execute on Maven 3.0.5 and Java 8
Date Mon, 18 Feb 2019 07:54:00 GMT

    [ https://issues.apache.org/jira/browse/SUREFIRE-1628?page=com.atlassian.jira.plugin.system.issuetabpanels:comment-tabpanel&focusedCommentId=16770840#comment-16770840
] 

Jörg Sesterhenn commented on SUREFIRE-1628:
-------------------------------------------

Could you please either make it work with Maven 3.0.x or set the prerequisite to maven 3.1.x
so that we can rely on the versions plugin for updates. You might also want to mention this
somewhere in the (already released) release notes as there are still quite a few people using
Maven 3.0.5.

> Plugins fail to execute on Maven 3.0.5 and Java 8
> -------------------------------------------------
>
>                 Key: SUREFIRE-1628
>                 URL: https://issues.apache.org/jira/browse/SUREFIRE-1628
>             Project: Maven Surefire
>          Issue Type: Bug
>          Components: Maven Failsafe Plugin, Maven Surefire Plugin
>    Affects Versions: 3.0.0-M3
>         Environment: maven 3.0.5
> jdk 1.8u111
> sles 12
>            Reporter: Jörg Sesterhenn
>            Priority: Major
>         Attachments: surefire-1628-mwe.zip
>
>
>  The plugin seems to require plexus-java which cannot be found.
> {code:java}
> [ERROR] Failed to execute goal org.apache.maven.plugins:maven-failsafe-plugin:3.0.0-M3:integration-test
(default-integration-test) on project MyParentPOM: Execution default-integration-test of goal
org.apache.maven.plugins:maven-failsafe-plugin:3.0.0-M3:integration-test failed: Unable to
load the mojo 'integration-test' (or one of its required components) from the plugin 'org.apache.maven.plugins:maven-failsafe-plugin:3.0.0-M3':
com.google.inject.ProvisionException: Guice provision errors:
> [ERROR] 1) No implementation for org.codehaus.plexus.languages.java.jpms.LocationManager
was bound.
> [ERROR] while locating org.apache.maven.plugin.failsafe.IntegrationTestMojo
> [ERROR] at ClassRealm[plugin>org.apache.maven.plugins:maven-failsafe-plugin:3.0.0-M3,
parent: sun.misc.Launcher$AppClassLoader@55f96302]
> [ERROR] while locating org.apache.maven.plugin.Mojo annotated with @com.google.inject.name.Named(value=org.apache.maven.plugins:maven-failsafe-plugin:3.0.0-M3:integration-test)
> [ERROR] 1 error
> [ERROR] role: org.apache.maven.plugin.Mojo
> [ERROR] roleHint: org.apache.maven.plugins:maven-failsafe-plugin:3.0.0-M3:integration-test
> [ERROR] -> [Help 1]
> [ERROR] To see the full stack trace of the errors, re-run Maven with the -e switch.
> [ERROR] Re-run Maven using the -X switch to enable full debug logging.
> [ERROR] For more information about the errors and possible solutions, please read the
following articles:
> [ERROR] [Help 1] http://cwiki.apache.org/confluence/display/MAVEN/PluginContainerException
> {code}
>  



--
This message was sent by Atlassian JIRA
(v7.6.3#76005)

Mime
View raw message