maven-notifications mailing list archives

Site index · List index
Message view « Date » · « Thread »
Top « Date » · « Thread »
From Continuum Build Server <contin...@ci.codehaus.org>
Subject [continuum] BUILD FAILURE: Maven Local Settings Model
Date Mon, 10 Apr 2006 21:23:14 GMT
Online report : http://ci.codehaus.org/continuum-maven/servlet/continuum/target/ProjectBuild.vm/view/ProjectBuild/id/31/buildId/2548
Build statistics:
  State: Failed
  Previous State: Error
  Started at: Mon, 10 Apr 2006 14:23:03 -0700
  Finished at: Mon, 10 Apr 2006 14:23:13 -0700
  Total time: 9s
  Build Trigger: Schedule
  Exit code: 1
  Building machine hostname: cheddar.simulalabs.com
  Operating system : Linux(unknown)
  Java version : 1.5.0_03(Sun Microsystems Inc.)

Changes
         jdcasey          [maven-release-plugin] prepare release maven-2.0.4
             /maven/components/branches/maven-2.0.x/maven-archiver/pom.xml
            /maven/components/branches/maven-2.0.x/maven-artifact/pom.xml
            /maven/components/branches/maven-2.0.x/maven-artifact-manager/pom.xml
            /maven/components/branches/maven-2.0.x/maven-artifact-test/pom.xml
            /maven/components/branches/maven-2.0.x/maven-core/pom.xml
            /maven/components/branches/maven-2.0.x/maven-error-diagnostics/pom.xml
            /maven/components/branches/maven-2.0.x/maven-model/pom.xml
            /maven/components/branches/maven-2.0.x/maven-model-converter/pom.xml
            /maven/components/branches/maven-2.0.x/maven-monitor/pom.xml
            /maven/components/branches/maven-2.0.x/maven-plugin-api/pom.xml
            /maven/components/branches/maven-2.0.x/maven-plugin-descriptor/pom.xml
            /maven/components/branches/maven-2.0.x/maven-plugin-parameter-documenter/pom.xml
            /maven/components/branches/maven-2.0.x/maven-plugin-registry/pom.xml
            /maven/components/branches/maven-2.0.x/maven-plugin-tools/maven-plugin-tools-ant/pom.xml
            /maven/components/branches/maven-2.0.x/maven-plugin-tools/maven-plugin-tools-api/pom.xml
            /maven/components/branches/maven-2.0.x/maven-plugin-tools/maven-plugin-tools-beanshell/pom.xml
            /maven/components/branches/maven-2.0.x/maven-plugin-tools/maven-plugin-tools-java/pom.xml
            /maven/components/branches/maven-2.0.x/maven-plugin-tools/maven-plugin-tools-model/pom.xml
            /maven/components/branches/maven-2.0.x/maven-plugin-tools/maven-plugin-tools-pluggy/pom.xml
            /maven/components/branches/maven-2.0.x/maven-plugin-tools/pom.xml
            /maven/components/branches/maven-2.0.x/maven-profile/pom.xml
            /maven/components/branches/maven-2.0.x/maven-project/pom.xml
            /maven/components/branches/maven-2.0.x/maven-reporting/maven-reporting-api/pom.xml
            /maven/components/branches/maven-2.0.x/maven-reporting/maven-reporting-impl/pom.xml
            /maven/components/branches/maven-2.0.x/maven-reporting/pom.xml
            /maven/components/branches/maven-2.0.x/maven-repository-metadata/pom.xml
            /maven/components/branches/maven-2.0.x/maven-script/maven-script-ant/pom.xml
            /maven/components/branches/maven-2.0.x/maven-script/maven-script-beanshell/pom.xml
            /maven/components/branches/maven-2.0.x/maven-script/pom.xml
            /maven/components/branches/maven-2.0.x/maven-settings/pom.xml
            /maven/components/branches/maven-2.0.x/pom.xml
           jdcasey          [maven-release-plugin] prepare for next development iteration
             /maven/components/branches/maven-2.0.x/maven-archiver/pom.xml
            /maven/components/branches/maven-2.0.x/maven-artifact/pom.xml
            /maven/components/branches/maven-2.0.x/maven-artifact-manager/pom.xml
            /maven/components/branches/maven-2.0.x/maven-artifact-test/pom.xml
            /maven/components/branches/maven-2.0.x/maven-core/pom.xml
            /maven/components/branches/maven-2.0.x/maven-error-diagnostics/pom.xml
            /maven/components/branches/maven-2.0.x/maven-model/pom.xml
            /maven/components/branches/maven-2.0.x/maven-model-converter/pom.xml
            /maven/components/branches/maven-2.0.x/maven-monitor/pom.xml
            /maven/components/branches/maven-2.0.x/maven-plugin-api/pom.xml
            /maven/components/branches/maven-2.0.x/maven-plugin-descriptor/pom.xml
            /maven/components/branches/maven-2.0.x/maven-plugin-parameter-documenter/pom.xml
            /maven/components/branches/maven-2.0.x/maven-plugin-registry/pom.xml
            /maven/components/branches/maven-2.0.x/maven-plugin-tools/maven-plugin-tools-ant/pom.xml
            /maven/components/branches/maven-2.0.x/maven-plugin-tools/maven-plugin-tools-api/pom.xml
            /maven/components/branches/maven-2.0.x/maven-plugin-tools/maven-plugin-tools-beanshell/pom.xml
            /maven/components/branches/maven-2.0.x/maven-plugin-tools/maven-plugin-tools-java/pom.xml
            /maven/components/branches/maven-2.0.x/maven-plugin-tools/maven-plugin-tools-model/pom.xml
            /maven/components/branches/maven-2.0.x/maven-plugin-tools/maven-plugin-tools-pluggy/pom.xml
            /maven/components/branches/maven-2.0.x/maven-plugin-tools/pom.xml
            /maven/components/branches/maven-2.0.x/maven-profile/pom.xml
            /maven/components/branches/maven-2.0.x/maven-project/pom.xml
            /maven/components/branches/maven-2.0.x/maven-reporting/maven-reporting-api/pom.xml
            /maven/components/branches/maven-2.0.x/maven-reporting/maven-reporting-impl/pom.xml
            /maven/components/branches/maven-2.0.x/maven-reporting/pom.xml
            /maven/components/branches/maven-2.0.x/maven-repository-metadata/pom.xml
            /maven/components/branches/maven-2.0.x/maven-script/maven-script-ant/pom.xml
            /maven/components/branches/maven-2.0.x/maven-script/maven-script-beanshell/pom.xml
            /maven/components/branches/maven-2.0.x/maven-script/pom.xml
            /maven/components/branches/maven-2.0.x/maven-settings/pom.xml
            /maven/components/branches/maven-2.0.x/pom.xml
        
****************************************************************************
Output:
****************************************************************************
[INFO] Scanning for projects...
[INFO] ----------------------------------------------------------------------------
[INFO] Building Maven Local Settings Model
[INFO]    task-segment: [clean, install]
[INFO] ----------------------------------------------------------------------------
[INFO] [clean:clean]
[INFO] Deleting directory /home/continuum/continuum-maven/working-directory/31/target
[INFO] Deleting directory /home/continuum/continuum-maven/working-directory/31/target/classes
[INFO] Deleting directory /home/continuum/continuum-maven/working-directory/31/target/test-classes
[INFO] Setting property: classpath.resource.loader.class => 'org.codehaus.plexus.velocity.ContextClassLoaderResourceLoader'.
[INFO] Setting property: velocimacro.messages.on => 'false'.
[INFO] Setting property: resource.loader => 'classpath'.
[INFO] Setting property: resource.manager.logwhenfound => 'false'.
[INFO] ************************************************************** 
[INFO] Starting Jakarta Velocity v1.4
[INFO] RuntimeInstance initializing.
[INFO] Default Properties File: org/apache/velocity/runtime/defaults/velocity.properties
[INFO] Default ResourceManager initializing. (class org.apache.velocity.runtime.resource.ResourceManagerImpl)
[INFO] Resource Loader Instantiated: org.codehaus.plexus.velocity.ContextClassLoaderResourceLoader
[INFO] ClasspathResourceLoader : initialization starting.
[INFO] ClasspathResourceLoader : initialization complete.
[INFO] ResourceCache : initialized. (class org.apache.velocity.runtime.resource.ResourceCacheImpl)
[INFO] Default ResourceManager initialization complete.
[INFO] Loaded System Directive: org.apache.velocity.runtime.directive.Literal
[INFO] Loaded System Directive: org.apache.velocity.runtime.directive.Macro
[INFO] Loaded System Directive: org.apache.velocity.runtime.directive.Parse
[INFO] Loaded System Directive: org.apache.velocity.runtime.directive.Include
[INFO] Loaded System Directive: org.apache.velocity.runtime.directive.Foreach
[INFO] Created: 20 parsers.
[INFO] Velocimacro : initialization starting.
[INFO] Velocimacro : adding VMs from VM library template : VM_global_library.vm
[ERROR] ResourceManager : unable to find resource 'VM_global_library.vm' in any resource loader.
[INFO] Velocimacro : error using  VM library template VM_global_library.vm : org.apache.velocity.exception.ResourceNotFoundException:
Unable to find resource 'VM_global_library.vm'
[INFO] Velocimacro :  VM library template macro registration complete.
[INFO] Velocimacro : allowInline = true : VMs can be defined inline in templates
[INFO] Velocimacro : allowInlineToOverride = false : VMs defined inline may NOT replace previous
VM definitions
[INFO] Velocimacro : allowInlineLocal = false : VMs defined inline will be  global in scope
if allowed.
[INFO] Velocimacro : initialization complete.
[INFO] Velocity successfully started.
[INFO] [modello:xpp3-writer {execution: default}]
[INFO] outputDirectory: /home/continuum/continuum-maven/working-directory/31/target/generated-sources/modello
[INFO] [modello:java {execution: default}]
[INFO] outputDirectory: /home/continuum/continuum-maven/working-directory/31/target/generated-sources/modello
[INFO] [modello:xpp3-reader {execution: default}]
[INFO] outputDirectory: /home/continuum/continuum-maven/working-directory/31/target/generated-sources/modello
[INFO] [resources:resources]
[INFO] Using default encoding to copy filtered resources.
[WARNING] 
	Artifact junit:junit:jar:3.8.1:test retains local scope 'test' overriding broader scope 'compile'
	given by a dependency. If this is not intended, modify or remove the local scope.

Downloading: http://cvs.apache.org/maven-snapshot-repository/org/apache/maven/maven-model/2.0.5-SNAPSHOT/maven-model-2.0.5-SNAPSHOT.pom
[WARNING] Unable to get resource from repository apache.snapshots (http://cvs.apache.org/maven-snapshot-repository)
Downloading: http://cvs.apache.org/maven-snapshot-repository/org/apache/maven/maven-model/2.0.5-SNAPSHOT/maven-model-2.0.5-SNAPSHOT.jar
[WARNING] Unable to get resource from repository apache.snapshots (http://cvs.apache.org/maven-snapshot-repository)
[INFO] ----------------------------------------------------------------------------
[ERROR] BUILD ERROR
[INFO] ----------------------------------------------------------------------------
[INFO] Failed to resolve artifact.

Missing:
----------
1) org.apache.maven:maven-model:jar:2.0.5-SNAPSHOT

  Try downloading the file manually from the project website.

  Then, install it using the command: 
      mvn install:install-file -DgroupId=org.apache.maven -DartifactId=maven-model \
          -Dversion=2.0.5-SNAPSHOT -Dpackaging=jar -Dfile=/path/to/file

  Path to dependency: 
  	1) org.apache.maven:maven-settings:jar:2.0.5-SNAPSHOT
  	2) org.apache.maven:maven-model:jar:2.0.5-SNAPSHOT

----------
1 required artifact is missing.

for artifact: 
  org.apache.maven:maven-settings:jar:2.0.5-SNAPSHOT

from the specified remote repositories:
  central (http://repo1.maven.org/maven2),
  apache.snapshots (http://cvs.apache.org/maven-snapshot-repository)


[INFO] ----------------------------------------------------------------------------
[INFO] For more information, run Maven with the -e switch
[INFO] ----------------------------------------------------------------------------
[INFO] Total time: 8 seconds
[INFO] Finished at: Mon Apr 10 14:23:13 PDT 2006
[INFO] Final Memory: 10M/123M
[INFO] ----------------------------------------------------------------------------

****************************************************************************



Mime
View raw message