maven-notifications mailing list archives

Site index · List index
Message view « Date » · « Thread »
Top « Date » · « Thread »
From Continuum Build Server <contin...@ci.codehaus.org>
Subject [continuum] BUILD FAILURE: Maven Release plugin
Date Thu, 06 Apr 2006 12:08:18 GMT
Online report : http://ci.codehaus.org/continuum-maven/servlet/continuum/target/ProjectBuild.vm/view/ProjectBuild/id/54/buildId/1172
Build statistics:
  State: Failed
  Previous State: Failed
  Started at: Thu, 6 Apr 2006 05:08:02 -0700
  Finished at: Thu, 6 Apr 2006 05:08:18 -0700
  Total time: 15s
  Build Trigger: Forced
  Exit code: 1
  Building machine hostname: cheddar.simulalabs.com
  Operating system : Linux(unknown)
  Java version : 1.5.0_03(Sun Microsystems Inc.)

Changes
      No files changed
  
****************************************************************************
Output:
****************************************************************************
[INFO] Scanning for projects...
[INFO] ----------------------------------------------------------------------------
[INFO] Building Maven Release plugin
[INFO]    task-segment: [clean, install]
[INFO] ----------------------------------------------------------------------------
[INFO] [clean:clean]
[INFO] Deleting directory /home/continuum/continuum-maven/working-directory/54/target
[INFO] Deleting directory /home/continuum/continuum-maven/working-directory/54/target/classes
[INFO] Deleting directory /home/continuum/continuum-maven/working-directory/54/target/test-classes
[INFO] [plugin:descriptor]
[INFO] Using 2 extractors.
[INFO] Applying extractor for language: java
[INFO] Extractor for language: java found 2 mojo descriptors.
[INFO] Applying extractor for language: bsh
[INFO] Extractor for language: bsh found 0 mojo descriptors.
[INFO] [resources:resources]
[INFO] Using default encoding to copy filtered resources.
[INFO] snapshot org.apache.maven.scm:maven-scm-provider-starteam:1.0-beta-3-SNAPSHOT: checking
for updates from snapshots
[INFO] snapshot org.apache.maven.scm:maven-scm-provider-starteam:1.0-beta-3-SNAPSHOT: checking
for updates from apache.snapshots
[INFO] snapshot org.apache.maven.scm:maven-scm-providers:1.0-beta-3-SNAPSHOT: checking for
updates from snapshots
[INFO] snapshot org.apache.maven.scm:maven-scm-providers:1.0-beta-3-SNAPSHOT: checking for
updates from apache.snapshots
[INFO] snapshot org.apache.maven.scm:maven-scm:1.0-beta-3-SNAPSHOT: checking for updates from
snapshots
[INFO] snapshot org.apache.maven.scm:maven-scm:1.0-beta-3-SNAPSHOT: checking for updates from
apache.snapshots
[INFO] snapshot org.apache.maven.scm:maven-scm-api:1.0-beta-3-SNAPSHOT: checking for updates
from snapshots
[INFO] snapshot org.apache.maven.scm:maven-scm-api:1.0-beta-3-SNAPSHOT: checking for updates
from apache.snapshots
[INFO] snapshot org.apache.maven.scm:maven-scm-provider-svnexe:1.0-beta-3-SNAPSHOT: checking
for updates from snapshots
[INFO] snapshot org.apache.maven.scm:maven-scm-provider-svnexe:1.0-beta-3-SNAPSHOT: checking
for updates from apache.snapshots
[INFO] snapshot org.apache.maven.scm:maven-scm-providers-svn:1.0-beta-3-SNAPSHOT: checking
for updates from snapshots
[INFO] snapshot org.apache.maven.scm:maven-scm-providers-svn:1.0-beta-3-SNAPSHOT: checking
for updates from apache.snapshots
[INFO] snapshot org.apache.maven.scm:maven-scm-provider-svn-commons:1.0-beta-3-SNAPSHOT: checking
for updates from snapshots
[INFO] snapshot org.apache.maven.scm:maven-scm-provider-svn-commons:1.0-beta-3-SNAPSHOT: checking
for updates from apache.snapshots
[INFO] snapshot org.apache.maven.scm:maven-scm-test:1.0-beta-3-SNAPSHOT: checking for updates
from snapshots
[INFO] snapshot org.apache.maven.scm:maven-scm-test:1.0-beta-3-SNAPSHOT: checking for updates
from apache.snapshots
[INFO] snapshot org.apache.maven.scm:maven-scm-manager-plexus:1.0-beta-3-SNAPSHOT: checking
for updates from snapshots
[INFO] snapshot org.apache.maven.scm:maven-scm-manager-plexus:1.0-beta-3-SNAPSHOT: checking
for updates from apache.snapshots
[INFO] snapshot org.apache.maven.scm:maven-scm-managers:1.0-beta-3-SNAPSHOT: checking for
updates from snapshots
[INFO] snapshot org.apache.maven.scm:maven-scm-managers:1.0-beta-3-SNAPSHOT: checking for
updates from apache.snapshots
[INFO] snapshot org.apache.maven.scm:maven-scm-provider-clearcase:1.0-beta-3-SNAPSHOT: checking
for updates from snapshots
[INFO] snapshot org.apache.maven.scm:maven-scm-provider-clearcase:1.0-beta-3-SNAPSHOT: checking
for updates from apache.snapshots
[INFO] snapshot org.apache.maven.scm:maven-scm-provider-cvsexe:1.0-beta-3-SNAPSHOT: checking
for updates from snapshots
[INFO] snapshot org.apache.maven.scm:maven-scm-provider-cvsexe:1.0-beta-3-SNAPSHOT: checking
for updates from apache.snapshots
[INFO] snapshot org.apache.maven.scm:maven-scm-providers-cvs:1.0-beta-3-SNAPSHOT: checking
for updates from snapshots
[INFO] snapshot org.apache.maven.scm:maven-scm-providers-cvs:1.0-beta-3-SNAPSHOT: checking
for updates from apache.snapshots
[INFO] snapshot org.apache.maven.scm:maven-scm-provider-cvs-commons:1.0-beta-3-SNAPSHOT: checking
for updates from snapshots
[INFO] snapshot org.apache.maven.scm:maven-scm-provider-cvs-commons:1.0-beta-3-SNAPSHOT: checking
for updates from apache.snapshots
[INFO] snapshot org.apache.maven.scm:maven-scm-provider-perforce:1.0-beta-3-SNAPSHOT: checking
for updates from snapshots
[INFO] snapshot org.apache.maven.scm:maven-scm-provider-perforce:1.0-beta-3-SNAPSHOT: checking
for updates from apache.snapshots
[INFO] snapshot org.apache.maven.scm:maven-scm-provider-bazaar:1.0-beta-3-SNAPSHOT: checking
for updates from snapshots
[INFO] snapshot org.apache.maven.scm:maven-scm-provider-bazaar:1.0-beta-3-SNAPSHOT: checking
for updates from apache.snapshots
[INFO] [compiler:compile]
Compiling 10 source files to /home/continuum/continuum-maven/working-directory/54/target/classes
[INFO] [resources:testResources]
[INFO] Using default encoding to copy filtered resources.
[INFO] [compiler:testCompile]
Compiling 2 source files to /home/continuum/continuum-maven/working-directory/54/target/test-classes
[INFO] [surefire:test]
[INFO] Setting reports dir: /home/continuum/continuum-maven/working-directory/54/target/surefire-reports

-------------------------------------------------------
 T E S T S
-------------------------------------------------------
[surefire] Running org.apache.maven.plugins.release.PrepareReleaseMojoTest
[surefire] Tests run: 2, Failures: 1, Errors: 0, Time elapsed: 0.809 sec <<<<<<<<
FAILURE !! 
[surefire] Running org.apache.maven.plugins.release.versions.DefaultVersionInfoTest
[surefire] Tests run: 19, Failures: 0, Errors: 0, Time elapsed: 1.184 sec
[INFO] ----------------------------------------------------------------------------
[ERROR] BUILD ERROR
[INFO] ----------------------------------------------------------------------------
[INFO] There are test failures.
[INFO] ----------------------------------------------------------------------------
[INFO] For more information, run Maven with the -e switch
[INFO] ----------------------------------------------------------------------------
[INFO] Total time: 14 seconds
[INFO] Finished at: Thu Apr 06 05:08:17 PDT 2006
[INFO] Final Memory: 12M/155M
[INFO] ----------------------------------------------------------------------------

****************************************************************************



Mime
View raw message