maven-notifications mailing list archives

Site index · List index
Message view « Date » · « Thread »
Top « Date » · « Thread »
From Continuum Build Server <contin...@ci.codehaus.org>
Subject [continuum] BUILD FAILURE: Maven Rar plugin
Date Tue, 11 Apr 2006 03:04:30 GMT
Online report : http://ci.codehaus.org/continuum-maven/servlet/continuum/target/ProjectBuild.vm/view/ProjectBuild/id/53/buildId/2633
Build statistics:
  State: Failed
  Previous State: Ok
  Started at: Mon, 10 Apr 2006 20:04:22 -0700
  Finished at: Mon, 10 Apr 2006 20:04:30 -0700
  Total time: 8s
  Build Trigger: Schedule
  Exit code: 1
  Building machine hostname: cheddar.simulalabs.com
  Operating system : Linux(unknown)
  Java version : 1.5.0_03(Sun Microsystems Inc.)

Changes
         aramirez          PR: MRAR-6

added tests using plugin testing harness
             /maven/plugins/trunk/maven-rar-plugin/pom.xml
            /maven/plugins/trunk/maven-rar-plugin/src/test
            /maven/plugins/trunk/maven-rar-plugin/src/test/java
            /maven/plugins/trunk/maven-rar-plugin/src/test/java/org
            /maven/plugins/trunk/maven-rar-plugin/src/test/java/org/apache
            /maven/plugins/trunk/maven-rar-plugin/src/test/java/org/apache/maven
            /maven/plugins/trunk/maven-rar-plugin/src/test/java/org/apache/maven/plugin
            /maven/plugins/trunk/maven-rar-plugin/src/test/java/org/apache/maven/plugin/rar
            /maven/plugins/trunk/maven-rar-plugin/src/test/java/org/apache/maven/plugin/rar/RarMojoTest.java
            /maven/plugins/trunk/maven-rar-plugin/src/test/java/org/apache/maven/plugin/rar/stubs
            /maven/plugins/trunk/maven-rar-plugin/src/test/java/org/apache/maven/plugin/rar/stubs/RarArtifactStub.java
            /maven/plugins/trunk/maven-rar-plugin/src/test/java/org/apache/maven/plugin/rar/stubs/RarMavenProjectStub.java
            /maven/plugins/trunk/maven-rar-plugin/src/test/remote-repo
            /maven/plugins/trunk/maven-rar-plugin/src/test/remote-repo/org
            /maven/plugins/trunk/maven-rar-plugin/src/test/remote-repo/org/apache
            /maven/plugins/trunk/maven-rar-plugin/src/test/remote-repo/org/apache/maven
            /maven/plugins/trunk/maven-rar-plugin/src/test/remote-repo/org/apache/maven/test
            /maven/plugins/trunk/maven-rar-plugin/src/test/remote-repo/org/apache/maven/test/maven-artifact01
            /maven/plugins/trunk/maven-rar-plugin/src/test/remote-repo/org/apache/maven/test/maven-artifact01/1.0-SNAPSHOT
            /maven/plugins/trunk/maven-rar-plugin/src/test/remote-repo/org/apache/maven/test/maven-artifact01/1.0-SNAPSHOT/maven-artifact01-1.0-SNAPSHOT.jar
            /maven/plugins/trunk/maven-rar-plugin/src/test/remote-repo/org/apache/maven/test/maven-artifact01/1.0-SNAPSHOT/maven-artifact01-1.0-SNAPSHOT.pom
            /maven/plugins/trunk/maven-rar-plugin/src/test/remote-repo/org/apache/maven/test/maven-artifact02
            /maven/plugins/trunk/maven-rar-plugin/src/test/remote-repo/org/apache/maven/test/maven-artifact02/1.0-SNAPSHOT
            /maven/plugins/trunk/maven-rar-plugin/src/test/remote-repo/org/apache/maven/test/maven-artifact02/1.0-SNAPSHOT/maven-artifact02-1.0-SNAPSHOT.jar
            /maven/plugins/trunk/maven-rar-plugin/src/test/remote-repo/org/apache/maven/test/maven-artifact02/1.0-SNAPSHOT/maven-artifact02-1.0-SNAPSHOT.pom
            /maven/plugins/trunk/maven-rar-plugin/src/test/resources
            /maven/plugins/trunk/maven-rar-plugin/src/test/resources/unit
            /maven/plugins/trunk/maven-rar-plugin/src/test/resources/unit/basic-rar-test
            /maven/plugins/trunk/maven-rar-plugin/src/test/resources/unit/basic-rar-test/plugin-config.xml
            /maven/plugins/trunk/maven-rar-plugin/src/test/resources/unit/basic-rar-test/src
            /maven/plugins/trunk/maven-rar-plugin/src/test/resources/unit/basic-rar-test/src/main
            /maven/plugins/trunk/maven-rar-plugin/src/test/resources/unit/basic-rar-test/src/main/rar
        
****************************************************************************
Output:
****************************************************************************
[INFO] Scanning for projects...
[INFO] ----------------------------------------------------------------------------
[INFO] Building Maven Rar plugin
[INFO]    task-segment: [clean, install]
[INFO] ----------------------------------------------------------------------------
[INFO] [clean:clean]
[INFO] Deleting directory /home/continuum/continuum-maven/working-directory/53/target
[INFO] Deleting directory /home/continuum/continuum-maven/working-directory/53/target/classes
[INFO] Deleting directory /home/continuum/continuum-maven/working-directory/53/target/test-classes
[INFO] [plugin:descriptor]
[INFO] Using 2 extractors.
[INFO] Applying extractor for language: java
[INFO] Extractor for language: java found 1 mojo descriptors.
[INFO] Applying extractor for language: bsh
[INFO] Extractor for language: bsh found 0 mojo descriptors.
[INFO] [resources:resources]
[INFO] Using default encoding to copy filtered resources.
[INFO] snapshot org.apache.maven:maven-plugin-testing-harness:1.0-SNAPSHOT: checking for updates
from snapshots
[INFO] snapshot org.apache.maven:maven-plugin-testing-harness:1.0-SNAPSHOT: checking for updates
from apache.snapshots
[INFO] [compiler:compile]
Compiling 1 source file to /home/continuum/continuum-maven/working-directory/53/target/classes
[INFO] [resources:testResources]
[INFO] Using default encoding to copy filtered resources.
[INFO] [compiler:testCompile]
Compiling 3 source files to /home/continuum/continuum-maven/working-directory/53/target/test-classes
[INFO] [surefire:test]
[INFO] Setting reports dir: /home/continuum/continuum-maven/working-directory/53/target/surefire-reports

-------------------------------------------------------
 T E S T S
-------------------------------------------------------
[surefire] Running org.apache.maven.plugin.rar.RarMojoTest
[INFO] Copying artifact[org.apache.maven.test, org.apache.maven.test:maven-artifact02:1.0-SNAPSHOT,
null]
[INFO] Copying artifact[org.apache.maven.test, org.apache.maven.test:maven-artifact01:1.0-SNAPSHOT,
null]
[INFO] Copy rar resources to /home/continuum/continuum-maven/working-directory/53/target/unit/basic-rar-test/target/rar-test
[WARNING] Connector deployment descriptor: /home/continuum/continuum-maven/working-directory/53/target/unit/basic-rar-test/target/rar-test/META-INF/ra.xml
does not exist.
[INFO] Could not find manifest file: /home/continuum/continuum-maven/working-directory/53/src/main/rar/META-INF/MANIFEST.MF
- Generating one
[INFO] Building jar: /home/continuum/continuum-maven/working-directory/53/target/unit/basic-rar-test/target/test-rar.rar
[surefire] Tests run: 2, Failures: 1, Errors: 0, Time elapsed: 0.688 sec <<<<<<<<
FAILURE !! 
[INFO] ----------------------------------------------------------------------------
[ERROR] BUILD ERROR
[INFO] ----------------------------------------------------------------------------
[INFO] There are test failures.
[INFO] ----------------------------------------------------------------------------
[INFO] For more information, run Maven with the -e switch
[INFO] ----------------------------------------------------------------------------
[INFO] Total time: 6 seconds
[INFO] Finished at: Mon Apr 10 20:04:30 PDT 2006
[INFO] Final Memory: 12M/157M
[INFO] ----------------------------------------------------------------------------

****************************************************************************



Mime
View raw message