maven-notifications mailing list archives

Site index · List index
Message view « Date » · « Thread »
Top « Date » · « Thread »
From Continuum Build Server <contin...@ci.codehaus.org>
Subject [continuum] BUILD FAILURE: Maven Install Plugin
Date Wed, 05 Apr 2006 06:47:46 GMT
Online report : http://ci.codehaus.org/continuum-maven/servlet/continuum/target/ProjectBuild.vm/view/ProjectBuild/id/46/buildId/837
Build statistics:
  State: Failed
  Previous State: Ok
  Started at: Tue, 4 Apr 2006 23:47:38 -0700
  Finished at: Tue, 4 Apr 2006 23:47:45 -0700
  Total time: 6s
  Build Trigger: Schedule
  Exit code: 1
  Building machine hostname: cheddar.simulalabs.com
  Operating system : Linux(unknown)
  Java version : 1.5.0_03(Sun Microsystems Inc.)

Changes
         aramirez          -removed src directory in test project
-added packaged project
-removed plugin-config.pom
-changed packaging from pom to jar
             /maven/plugins/trunk/maven-install-plugin/src/test/resources/unit/configured-install-test/plugin-config.pom
            /maven/plugins/trunk/maven-install-plugin/src/test/resources/unit/configured-install-test/plugin-config.xml
            /maven/plugins/trunk/maven-install-plugin/src/test/resources/unit/configured-install-test/src
            /maven/plugins/trunk/maven-install-plugin/src/test/resources/unit/configured-install-test/target
            /maven/plugins/trunk/maven-install-plugin/src/test/resources/unit/configured-install-test/target/maven-install-test-1.0-SNAPSHOT.jar
        
****************************************************************************
Output:
****************************************************************************
[INFO] Scanning for projects...
[INFO] ----------------------------------------------------------------------------
[INFO] Building Maven Install Plugin
[INFO]    task-segment: [clean, install]
[INFO] ----------------------------------------------------------------------------
[INFO] [clean:clean]
[INFO] Deleting directory /home/continuum/continuum-maven/working-directory/46/target
[INFO] Deleting directory /home/continuum/continuum-maven/working-directory/46/target/classes
[INFO] Deleting directory /home/continuum/continuum-maven/working-directory/46/target/test-classes
[INFO] [plugin:descriptor]
[INFO] Using 2 extractors.
[INFO] Applying extractor for language: java
[INFO] Extractor for language: java found 2 mojo descriptors.
[INFO] Applying extractor for language: bsh
[INFO] Extractor for language: bsh found 0 mojo descriptors.
[INFO] [resources:resources]
[INFO] Using default encoding to copy filtered resources.
[INFO] [compiler:compile]
Compiling 3 source files to /home/continuum/continuum-maven/working-directory/46/target/classes
[INFO] [resources:testResources]
[INFO] Using default encoding to copy filtered resources.
[INFO] [compiler:testCompile]
Compiling 5 source files to /home/continuum/continuum-maven/working-directory/46/target/test-classes
[INFO] [surefire:test]
[INFO] Setting reports dir: /home/continuum/continuum-maven/working-directory/46/target/surefire-reports

-------------------------------------------------------
 T E S T S
-------------------------------------------------------
[surefire] Running org.apache.maven.plugin.install.InstallMojoTest
[INFO] Installing /home/continuum/continuum-maven/working-directory/46/target/test-classes/unit/basic-install-test/target/maven-install-test-1.0-SNAPSHOT.jar
to /home/continuum/.m2/repository/org/apache/maven/test/maven-install-test/1.0-SNAPSHOT/maven-install-test-1.0-SNAPSHOT.jar
[surefire] Tests run: 4, Failures: 0, Errors: 1, Time elapsed: 1.048 sec <<<<<<<<
FAILURE !! 
[INFO] ----------------------------------------------------------------------------
[ERROR] BUILD ERROR
[INFO] ----------------------------------------------------------------------------
[INFO] There are test failures.
[INFO] ----------------------------------------------------------------------------
[INFO] For more information, run Maven with the -e switch
[INFO] ----------------------------------------------------------------------------
[INFO] Total time: 5 seconds
[INFO] Finished at: Tue Apr 04 23:47:45 PDT 2006
[INFO] Final Memory: 11M/158M
[INFO] ----------------------------------------------------------------------------

****************************************************************************



Mime
View raw message