maven-notifications mailing list archives

Site index · List index
Message view « Date » · « Thread »
Top « Date » · « Thread »
From Continuum Build Server <contin...@ci.codehaus.org>
Subject [continuum] BUILD FAILURE: Maven IDEA Plugin
Date Tue, 04 Apr 2006 08:32:34 GMT
Online report : http://ci.codehaus.org/continuum-maven/servlet/continuum/target/ProjectBuild.vm/view/ProjectBuild/id/45/buildId/704
Build statistics:
  State: Failed
  Previous State: Failed
  Started at: Tue, 4 Apr 2006 01:32:23 -0700
  Finished at: Tue, 4 Apr 2006 01:32:33 -0700
  Total time: 9s
  Build Trigger: Schedule
  Exit code: 1
  Building machine hostname: cheddar.simulalabs.com
  Operating system : Linux(unknown)
  Java version : 1.5.0_03(Sun Microsystems Inc.)

Changes
         epunzalan          PR: MIDEA-43

Fixed bug in test project counter and added files from the War MavenProject tests
             /maven/plugins/trunk/maven-idea-plugin/src/test/java/org/apache/maven/plugin/idea/IdeaModuleTest.java
            /maven/plugins/trunk/maven-idea-plugin/src/test/java/org/apache/maven/plugin/idea/stubs/ReactorMavenProjectStub.java
            /maven/plugins/trunk/maven-idea-plugin/src/test/java/org/apache/maven/plugin/idea/stubs/WarMavenProjectStub.java
            /maven/plugins/trunk/maven-idea-plugin/src/test/module-plugin-configs/min-war-plugin-config.xml
        
****************************************************************************
Output:
****************************************************************************
[INFO] Scanning for projects...
[INFO] ----------------------------------------------------------------------------
[INFO] Building Maven IDEA Plugin
[INFO]    task-segment: [clean, install]
[INFO] ----------------------------------------------------------------------------
[INFO] [clean:clean]
[INFO] Deleting directory /home/continuum/continuum-maven/working-directory/45/target
[INFO] Deleting directory /home/continuum/continuum-maven/working-directory/45/target/classes
[INFO] Deleting directory /home/continuum/continuum-maven/working-directory/45/target/test-classes
[INFO] [plugin:descriptor]
[INFO] Using 2 extractors.
[INFO] Applying extractor for language: java
[INFO] Extractor for language: java found 5 mojo descriptors.
[INFO] Applying extractor for language: bsh
[INFO] Extractor for language: bsh found 0 mojo descriptors.
[INFO] [resources:resources]
[INFO] Using default encoding to copy filtered resources.
[INFO] [compiler:compile]
Compiling 7 source files to /home/continuum/continuum-maven/working-directory/45/target/classes
[INFO] [resources:testResources]
[INFO] Using default encoding to copy filtered resources.
[INFO] [compiler:testCompile]
Compiling 10 source files to /home/continuum/continuum-maven/working-directory/45/target/test-classes
[INFO] [surefire:test]
[INFO] Setting reports dir: /home/continuum/continuum-maven/working-directory/45/target/surefire-reports

-------------------------------------------------------
 T E S T S
-------------------------------------------------------
[surefire] Running org.apache.maven.plugin.idea.IdeaProjectTest
[INFO] jdkName is not set, using [java version1.5.0_03] as default.
[INFO] jdkName is not set, using [java version1.5.0_03] as default.
[INFO] jdkName is not set, using [java version1.5.0_03] as default.
[surefire] Tests run: 5, Failures: 0, Errors: 0, Time elapsed: 2.216 sec
[surefire] Running org.apache.maven.plugin.idea.IdeaModuleTest
[surefire] Tests run: 1, Failures: 1, Errors: 0, Time elapsed: 0.235 sec <<<<<<<<
FAILURE !! 
[INFO] ----------------------------------------------------------------------------
[ERROR] BUILD ERROR
[INFO] ----------------------------------------------------------------------------
[INFO] There are test failures.
[INFO] ----------------------------------------------------------------------------
[INFO] For more information, run Maven with the -e switch
[INFO] ----------------------------------------------------------------------------
[INFO] Total time: 8 seconds
[INFO] Finished at: Tue Apr 04 01:32:33 PDT 2006
[INFO] Final Memory: 12M/154M
[INFO] ----------------------------------------------------------------------------

****************************************************************************



Mime
View raw message