maven-notifications mailing list archives

Site index · List index
Message view « Date » · « Thread »
Top « Date » · « Thread »
From Continuum Build Server <contin...@ci.codehaus.org>
Subject [continuum] BUILD FAILURE: Maven Assembly Plugin
Date Mon, 08 May 2006 18:36:57 GMT
Online report : http://ci.codehaus.org/continuum-maven/servlet/continuum/target/ProjectBuild.vm/view/ProjectBuild/id/35/buildId/2953
Build statistics:
  State: Failed
  Previous State: Failed
  Started at: Mon, 8 May 2006 11:31:04 -0700
  Finished at: Mon, 8 May 2006 11:36:57 -0700
  Total time: 5m 52s
  Build Trigger: Schedule
  Exit code: 1
  Building machine hostname: cheddar.simulalabs.com
  Operating system : Linux(unknown)
  Java version : 1.5.0_03(Sun Microsystems Inc.)

Changes
         jdcasey          Updating plexus-archiver version to 1.0-alpha-6.
             /maven/plugins/trunk/maven-assembly-plugin/pom.xml
        
****************************************************************************
Output:
****************************************************************************
[INFO] Scanning for projects...
[INFO] ----------------------------------------------------------------------------
[INFO] Building Maven Assembly Plugin
[INFO]    task-segment: [clean, install]
[INFO] ----------------------------------------------------------------------------
[INFO] [clean:clean]
[INFO] Deleting directory /home/continuum/continuum-maven/working-directory/35/target
[INFO] Deleting directory /home/continuum/continuum-maven/working-directory/35/target/classes
[INFO] Deleting directory /home/continuum/continuum-maven/working-directory/35/target/test-classes
[INFO] Setting property: classpath.resource.loader.class => 'org.codehaus.plexus.velocity.ContextClassLoaderResourceLoader'.
[INFO] Setting property: velocimacro.messages.on => 'false'.
[INFO] Setting property: resource.loader => 'classpath'.
[INFO] Setting property: resource.manager.logwhenfound => 'false'.
[INFO] ************************************************************** 
[INFO] Starting Jakarta Velocity v1.4
[INFO] RuntimeInstance initializing.
[INFO] Default Properties File: org/apache/velocity/runtime/defaults/velocity.properties
[INFO] Default ResourceManager initializing. (class org.apache.velocity.runtime.resource.ResourceManagerImpl)
[INFO] Resource Loader Instantiated: org.codehaus.plexus.velocity.ContextClassLoaderResourceLoader
[INFO] ClasspathResourceLoader : initialization starting.
[INFO] ClasspathResourceLoader : initialization complete.
[INFO] ResourceCache : initialized. (class org.apache.velocity.runtime.resource.ResourceCacheImpl)
[INFO] Default ResourceManager initialization complete.
[INFO] Loaded System Directive: org.apache.velocity.runtime.directive.Literal
[INFO] Loaded System Directive: org.apache.velocity.runtime.directive.Macro
[INFO] Loaded System Directive: org.apache.velocity.runtime.directive.Parse
[INFO] Loaded System Directive: org.apache.velocity.runtime.directive.Include
[INFO] Loaded System Directive: org.apache.velocity.runtime.directive.Foreach
[INFO] Created: 20 parsers.
[INFO] Velocimacro : initialization starting.
[INFO] Velocimacro : adding VMs from VM library template : VM_global_library.vm
[ERROR] ResourceManager : unable to find resource 'VM_global_library.vm' in any resource loader.
[INFO] Velocimacro : error using  VM library template VM_global_library.vm : org.apache.velocity.exception.ResourceNotFoundException:
Unable to find resource 'VM_global_library.vm'
[INFO] Velocimacro :  VM library template macro registration complete.
[INFO] Velocimacro : allowInline = true : VMs can be defined inline in templates
[INFO] Velocimacro : allowInlineToOverride = false : VMs defined inline may NOT replace previous
VM definitions
[INFO] Velocimacro : allowInlineLocal = false : VMs defined inline will be  global in scope
if allowed.
[INFO] Velocimacro : initialization complete.
[INFO] Velocity successfully started.
[INFO] [modello:xpp3-reader {execution: descriptor}]
[INFO] outputDirectory: /home/continuum/continuum-maven/working-directory/35/target/generated-sources/modello
[INFO] [modello:xpp3-writer {execution: descriptor}]
[INFO] outputDirectory: /home/continuum/continuum-maven/working-directory/35/target/generated-sources/modello
[INFO] [modello:java {execution: descriptor}]
[INFO] outputDirectory: /home/continuum/continuum-maven/working-directory/35/target/generated-sources/modello
[INFO] [modello:xsd {execution: descriptor}]
[INFO] outputDirectory: /home/continuum/continuum-maven/working-directory/35/target/generated-site/xsd
[INFO] [modello:xpp3-reader {execution: component}]
[INFO] outputDirectory: /home/continuum/continuum-maven/working-directory/35/target/generated-sources/modello
[INFO] [modello:java {execution: component}]
[INFO] outputDirectory: /home/continuum/continuum-maven/working-directory/35/target/generated-sources/modello
[INFO] [modello:xsd {execution: component}]
[INFO] outputDirectory: /home/continuum/continuum-maven/working-directory/35/target/generated-site/xsd
[INFO] [plugin:descriptor]
[INFO] Using 2 extractors.
[INFO] Applying extractor for language: java
[INFO] Extractor for language: java found 6 mojo descriptors.
[INFO] Applying extractor for language: bsh
[INFO] Extractor for language: bsh found 0 mojo descriptors.
[INFO] [resources:resources]
[INFO] Using default encoding to copy filtered resources.
Downloading: http://repo1.maven.org/maven2/org/codehaus/plexus/plexus-archiver/1.0-alpha-6/plexus-archiver-1.0-alpha-6.pom
[WARNING] Unable to get resource from repository central (http://repo1.maven.org/maven2)
Downloading: http://repo1.maven.org/maven2/org/codehaus/plexus/plexus-archiver/1.0-alpha-6/plexus-archiver-1.0-alpha-6.jar
[WARNING] Unable to get resource from repository central (http://repo1.maven.org/maven2)
[INFO] ------------------------------------------------------------------------
[ERROR] BUILD ERROR
[INFO] ------------------------------------------------------------------------
[INFO] Failed to resolve artifact.

Missing:
----------
1) org.codehaus.plexus:plexus-archiver:jar:1.0-alpha-6

  Try downloading the file manually from the project website.

  Then, install it using the command: 
      mvn install:install-file -DgroupId=org.codehaus.plexus -DartifactId=plexus-archiver
\
          -Dversion=1.0-alpha-6 -Dpackaging=jar -Dfile=/path/to/file

  Path to dependency: 
  	1) org.apache.maven.plugins:maven-assembly-plugin:maven-plugin:2.1-SNAPSHOT
  	2) org.codehaus.plexus:plexus-archiver:jar:1.0-alpha-6

----------
1 required artifact is missing.

for artifact: 
  org.apache.maven.plugins:maven-assembly-plugin:maven-plugin:2.1-SNAPSHOT

from the specified remote repositories:
  central (http://repo1.maven.org/maven2),
  apache.snapshots (http://svn.apache.org/maven-snapshot-repository),
  snapshots (http://snapshots.maven.codehaus.org/maven2)


[INFO] ------------------------------------------------------------------------
[INFO] For more information, run Maven with the -e switch
[INFO] ------------------------------------------------------------------------
[INFO] Total time: 5 minutes 51 seconds
[INFO] Finished at: Mon May 08 11:36:57 PDT 2006
[INFO] Final Memory: 15M/156M
[INFO] ------------------------------------------------------------------------

****************************************************************************



Mime
View raw message