maven-notifications mailing list archives

Site index · List index
Message view « Date » · « Thread »
Top « Date » · « Thread »
From Continuum Build Server <contin...@ci.codehaus.org>
Subject [continuum] BUILD FAILURE: Maven Surefire Plugin
Date Tue, 02 May 2006 00:57:49 GMT
Online report : http://ci.codehaus.org/continuum-maven/servlet/continuum/target/ProjectBuild.vm/view/ProjectBuild/id/59/buildId/2259
Build statistics:
  State: Failed
  Previous State: Failed
  Started at: Mon, 1 May 2006 17:57:44 -0700
  Finished at: Mon, 1 May 2006 17:57:48 -0700
  Total time: 4s
  Build Trigger: Forced
  Exit code: 1
  Building machine hostname: cheddar.simulalabs.com
  Operating system : Linux(unknown)
  Java version : 1.5.0_03(Sun Microsystems Inc.)

Changes
      No files changed
  
****************************************************************************
Output:
****************************************************************************
[INFO] Scanning for projects...
[INFO] ----------------------------------------------------------------------------
[INFO] Building Maven Surefire Plugin
[INFO]    task-segment: [clean, install]
[INFO] ----------------------------------------------------------------------------
[INFO] [clean:clean]
[INFO] Deleting directory /home/continuum/continuum-maven/working-directory/59/target
[INFO] Deleting directory /home/continuum/continuum-maven/working-directory/59/target/classes
[INFO] Deleting directory /home/continuum/continuum-maven/working-directory/59/target/test-classes
[INFO] [plugin:descriptor]
[INFO] Using 2 extractors.
[INFO] Applying extractor for language: java
[INFO] Extractor for language: java found 1 mojo descriptors.
[INFO] Applying extractor for language: bsh
[INFO] Extractor for language: bsh found 0 mojo descriptors.
[INFO] [resources:resources]
[INFO] Using default encoding to copy filtered resources.
[INFO] [compiler:compile]
Compiling 2 source files to /home/continuum/continuum-maven/working-directory/59/target/classes
[INFO] ------------------------------------------------------------------------
[ERROR] BUILD FAILURE
[INFO] ------------------------------------------------------------------------
[INFO] Compilation failure

/home/continuum/continuum-maven/working-directory/59/src/main/java/org/apache/maven/plugin/surefire/SurefirePlugin.java:[607,22]
cannot find symbol
symbol  : method setChildDelegation(boolean)
location: class org.apache.maven.surefire.booter.SurefireBooter


[INFO] ------------------------------------------------------------------------
[INFO] For more information, run Maven with the -e switch
[INFO] ------------------------------------------------------------------------
[INFO] Total time: 3 seconds
[INFO] Finished at: Mon May 01 17:57:48 PDT 2006
[INFO] Final Memory: 9M/140M
[INFO] ------------------------------------------------------------------------

****************************************************************************



Mime
View raw message