maven-notifications mailing list archives

Site index · List index
Message view « Date » · « Thread »
Top « Date » · « Thread »
From Continuum Build Server <contin...@ci.codehaus.org>
Subject [continuum] BUILD FAILURE: Maven Assembly Plugin
Date Fri, 05 May 2006 07:46:47 GMT
Online report : http://ci.codehaus.org/continuum-maven/servlet/continuum/target/ProjectBuild.vm/view/ProjectBuild/id/35/buildId/2875
Build statistics:
  State: Failed
  Previous State: Failed
  Started at: Fri, 5 May 2006 00:46:18 -0700
  Finished at: Fri, 5 May 2006 00:46:47 -0700
  Total time: 29s
  Build Trigger: Schedule
  Exit code: 1
  Building machine hostname: cheddar.simulalabs.com
  Operating system : Linux(unknown)
  Java version : 1.5.0_03(Sun Microsystems Inc.)

Changes
         epunzalan          fixed 1 test failure from BasicAbstractAssemblyMojoFeaturesTest
             /maven/plugins/trunk/maven-assembly-plugin/src/test/java/org/apache/maven/plugin/assembly/BasicAbstractAssemblyMojoFeaturesTest.java
        
****************************************************************************
Output:
****************************************************************************
[INFO] Scanning for projects...
[INFO] ----------------------------------------------------------------------------
[INFO] Building Maven Assembly Plugin
[INFO]    task-segment: [clean, install]
[INFO] ----------------------------------------------------------------------------
[INFO] [clean:clean]
[INFO] Deleting directory /home/continuum/continuum-maven/working-directory/35/target
[INFO] Deleting directory /home/continuum/continuum-maven/working-directory/35/target/classes
[INFO] Deleting directory /home/continuum/continuum-maven/working-directory/35/target/test-classes
[INFO] Setting property: classpath.resource.loader.class => 'org.codehaus.plexus.velocity.ContextClassLoaderResourceLoader'.
[INFO] Setting property: velocimacro.messages.on => 'false'.
[INFO] Setting property: resource.loader => 'classpath'.
[INFO] Setting property: resource.manager.logwhenfound => 'false'.
[INFO] ************************************************************** 
[INFO] Starting Jakarta Velocity v1.4
[INFO] RuntimeInstance initializing.
[INFO] Default Properties File: org/apache/velocity/runtime/defaults/velocity.properties
[INFO] Default ResourceManager initializing. (class org.apache.velocity.runtime.resource.ResourceManagerImpl)
[INFO] Resource Loader Instantiated: org.codehaus.plexus.velocity.ContextClassLoaderResourceLoader
[INFO] ClasspathResourceLoader : initialization starting.
[INFO] ClasspathResourceLoader : initialization complete.
[INFO] ResourceCache : initialized. (class org.apache.velocity.runtime.resource.ResourceCacheImpl)
[INFO] Default ResourceManager initialization complete.
[INFO] Loaded System Directive: org.apache.velocity.runtime.directive.Literal
[INFO] Loaded System Directive: org.apache.velocity.runtime.directive.Macro
[INFO] Loaded System Directive: org.apache.velocity.runtime.directive.Parse
[INFO] Loaded System Directive: org.apache.velocity.runtime.directive.Include
[INFO] Loaded System Directive: org.apache.velocity.runtime.directive.Foreach
[INFO] Created: 20 parsers.
[INFO] Velocimacro : initialization starting.
[INFO] Velocimacro : adding VMs from VM library template : VM_global_library.vm
[ERROR] ResourceManager : unable to find resource 'VM_global_library.vm' in any resource loader.
[INFO] Velocimacro : error using  VM library template VM_global_library.vm : org.apache.velocity.exception.ResourceNotFoundException:
Unable to find resource 'VM_global_library.vm'
[INFO] Velocimacro :  VM library template macro registration complete.
[INFO] Velocimacro : allowInline = true : VMs can be defined inline in templates
[INFO] Velocimacro : allowInlineToOverride = false : VMs defined inline may NOT replace previous
VM definitions
[INFO] Velocimacro : allowInlineLocal = false : VMs defined inline will be  global in scope
if allowed.
[INFO] Velocimacro : initialization complete.
[INFO] Velocity successfully started.
[INFO] [modello:xpp3-reader {execution: descriptor}]
[INFO] outputDirectory: /home/continuum/continuum-maven/working-directory/35/target/generated-sources/modello
[INFO] [modello:xpp3-writer {execution: descriptor}]
[INFO] outputDirectory: /home/continuum/continuum-maven/working-directory/35/target/generated-sources/modello
[INFO] [modello:java {execution: descriptor}]
[INFO] outputDirectory: /home/continuum/continuum-maven/working-directory/35/target/generated-sources/modello
[INFO] [modello:xsd {execution: descriptor}]
[INFO] outputDirectory: /home/continuum/continuum-maven/working-directory/35/target/generated-site/xsd
[INFO] [modello:xpp3-reader {execution: component}]
[INFO] outputDirectory: /home/continuum/continuum-maven/working-directory/35/target/generated-sources/modello
[INFO] [modello:java {execution: component}]
[INFO] outputDirectory: /home/continuum/continuum-maven/working-directory/35/target/generated-sources/modello
[INFO] [modello:xsd {execution: component}]
[INFO] outputDirectory: /home/continuum/continuum-maven/working-directory/35/target/generated-site/xsd
[INFO] snapshot org.apache.maven:maven-plugin-tools-java:2.0.3-SNAPSHOT: checking for updates
from snapshots
[INFO] snapshot org.apache.maven:maven-plugin-tools-java:2.0.3-SNAPSHOT: checking for updates
from apache.snapshots
[INFO] snapshot org.apache.maven:maven-plugin-tools:2.0.3-SNAPSHOT: checking for updates from
snapshots
[INFO] snapshot org.apache.maven:maven-plugin-tools:2.0.3-SNAPSHOT: checking for updates from
apache.snapshots
[INFO] snapshot org.apache.maven:maven:2.0.3-SNAPSHOT: checking for updates from snapshots
[INFO] snapshot org.apache.maven:maven:2.0.3-SNAPSHOT: checking for updates from apache.snapshots
[INFO] snapshot org.apache.maven:maven-plugin-descriptor:2.0.3-SNAPSHOT: checking for updates
from snapshots
[INFO] snapshot org.apache.maven:maven-plugin-descriptor:2.0.3-SNAPSHOT: checking for updates
from apache.snapshots
[INFO] snapshot org.apache.maven:maven-plugin-api:2.0.3-SNAPSHOT: checking for updates from
snapshots
[INFO] snapshot org.apache.maven:maven-plugin-api:2.0.3-SNAPSHOT: checking for updates from
apache.snapshots
[INFO] snapshot org.apache.maven:maven-artifact:2.0.3-SNAPSHOT: checking for updates from
snapshots
[INFO] snapshot org.apache.maven:maven-artifact:2.0.3-SNAPSHOT: checking for updates from
apache.snapshots
[INFO] snapshot org.apache.maven:maven-plugin-tools-api:2.0.3-SNAPSHOT: checking for updates
from snapshots
[INFO] snapshot org.apache.maven:maven-plugin-tools-api:2.0.3-SNAPSHOT: checking for updates
from apache.snapshots
[INFO] snapshot org.apache.maven:maven-project:2.0.3-SNAPSHOT: checking for updates from snapshots
[INFO] snapshot org.apache.maven:maven-project:2.0.3-SNAPSHOT: checking for updates from apache.snapshots
[INFO] snapshot org.apache.maven:maven-profile:2.0.3-SNAPSHOT: checking for updates from snapshots
[INFO] snapshot org.apache.maven:maven-profile:2.0.3-SNAPSHOT: checking for updates from apache.snapshots
[INFO] snapshot org.apache.maven:maven-model:2.0.3-SNAPSHOT: checking for updates from snapshots
[INFO] snapshot org.apache.maven:maven-model:2.0.3-SNAPSHOT: checking for updates from apache.snapshots
[INFO] snapshot org.apache.maven:maven-artifact-manager:2.0.3-SNAPSHOT: checking for updates
from snapshots
[INFO] snapshot org.apache.maven:maven-artifact-manager:2.0.3-SNAPSHOT: checking for updates
from apache.snapshots
[INFO] snapshot org.apache.maven:maven-repository-metadata:2.0.3-SNAPSHOT: checking for updates
from snapshots
[INFO] snapshot org.apache.maven:maven-repository-metadata:2.0.3-SNAPSHOT: checking for updates
from apache.snapshots
[INFO] snapshot org.apache.maven:maven-settings:2.0.3-SNAPSHOT: checking for updates from
snapshots
[INFO] snapshot org.apache.maven:maven-settings:2.0.3-SNAPSHOT: checking for updates from
apache.snapshots
[INFO] snapshot org.apache.maven:maven-plugin-tools-beanshell:2.0.3-SNAPSHOT: checking for
updates from snapshots
[INFO] snapshot org.apache.maven:maven-plugin-tools-beanshell:2.0.3-SNAPSHOT: checking for
updates from apache.snapshots
[INFO] snapshot org.apache.maven:maven-plugin-tools-api:2.0.5-SNAPSHOT: checking for updates
from snapshots
[INFO] snapshot org.apache.maven:maven-plugin-tools-api:2.0.5-SNAPSHOT: checking for updates
from apache.snapshots
[INFO] snapshot org.apache.maven:maven-plugin-tools:2.0.5-SNAPSHOT: checking for updates from
snapshots
[INFO] snapshot org.apache.maven:maven-plugin-tools:2.0.5-SNAPSHOT: checking for updates from
apache.snapshots
[INFO] snapshot org.apache.maven:maven:2.0.5-SNAPSHOT: checking for updates from snapshots
[INFO] snapshot org.apache.maven:maven:2.0.5-SNAPSHOT: checking for updates from apache.snapshots
[INFO] snapshot org.apache.maven:maven-plugin-descriptor:2.0.5-SNAPSHOT: checking for updates
from snapshots
[INFO] snapshot org.apache.maven:maven-plugin-descriptor:2.0.5-SNAPSHOT: checking for updates
from apache.snapshots
[INFO] snapshot org.apache.maven:maven-project:2.0.5-SNAPSHOT: checking for updates from snapshots
[INFO] snapshot org.apache.maven:maven-project:2.0.5-SNAPSHOT: checking for updates from apache.snapshots
[INFO] [plugin:descriptor]
[INFO] Using 2 extractors.
[INFO] Applying extractor for language: java
[INFO] Extractor for language: java found 5 mojo descriptors.
[INFO] Applying extractor for language: bsh
[INFO] Extractor for language: bsh found 0 mojo descriptors.
[INFO] [resources:resources]
[INFO] Using default encoding to copy filtered resources.
[INFO] snapshot org.apache.maven:maven-plugin-testing-harness:1.0-SNAPSHOT: checking for updates
from snapshots
[INFO] snapshot org.apache.maven:maven-plugin-testing-harness:1.0-SNAPSHOT: checking for updates
from apache.snapshots
[INFO] snapshot org.codehaus.plexus:plexus-archiver:1.0-alpha-6-SNAPSHOT: checking for updates
from snapshots
[INFO] snapshot org.codehaus.plexus:plexus-archiver:1.0-alpha-6-SNAPSHOT: checking for updates
from apache.snapshots
[INFO] snapshot org.codehaus.plexus:plexus-utils:1.2-SNAPSHOT: checking for updates from snapshots
[INFO] snapshot org.codehaus.plexus:plexus-utils:1.2-SNAPSHOT: checking for updates from apache.snapshots
[INFO] snapshot org.codehaus.plexus:plexus-compiler-javac:1.6-SNAPSHOT: checking for updates
from snapshots
[INFO] snapshot org.codehaus.plexus:plexus-compiler-javac:1.6-SNAPSHOT: checking for updates
from apache.snapshots
[INFO] snapshot org.codehaus.plexus:plexus-compilers:1.6-SNAPSHOT: checking for updates from
snapshots
[INFO] snapshot org.codehaus.plexus:plexus-compilers:1.6-SNAPSHOT: checking for updates from
apache.snapshots
[INFO] snapshot org.codehaus.plexus:plexus-compiler:1.6-SNAPSHOT: checking for updates from
snapshots
[INFO] snapshot org.codehaus.plexus:plexus-compiler:1.6-SNAPSHOT: checking for updates from
apache.snapshots
[INFO] snapshot org.codehaus.plexus:plexus-compiler-api:1.6-SNAPSHOT: checking for updates
from snapshots
[INFO] snapshot org.codehaus.plexus:plexus-compiler-api:1.6-SNAPSHOT: checking for updates
from apache.snapshots
[INFO] [compiler:compile]
Compiling 33 source files to /home/continuum/continuum-maven/working-directory/35/target/classes
[INFO] [resources:testResources]
[INFO] Using default encoding to copy filtered resources.
[INFO] [compiler:testCompile]
Compiling 15 source files to /home/continuum/continuum-maven/working-directory/35/target/test-classes
[INFO] snapshot org.apache.maven.surefire:surefire-booter:2.0-SNAPSHOT: checking for updates
from snapshots
[INFO] snapshot org.apache.maven.surefire:surefire-booter:2.0-SNAPSHOT: checking for updates
from apache.snapshots
[INFO] snapshot org.apache.maven.surefire:surefire:2.0-SNAPSHOT: checking for updates from
snapshots
[INFO] snapshot org.apache.maven.surefire:surefire:2.0-SNAPSHOT: checking for updates from
apache.snapshots
[INFO] snapshot org.apache.maven.surefire:surefire-api:2.0-SNAPSHOT: checking for updates
from snapshots
[INFO] snapshot org.apache.maven.surefire:surefire-api:2.0-SNAPSHOT: checking for updates
from apache.snapshots
[INFO] [surefire:test]
[INFO] Surefire report directory: /home/continuum/continuum-maven/working-directory/35/target/surefire-reports

-------------------------------------------------------
 T E S T S
-------------------------------------------------------
Running org.apache.maven.plugin.assembly.AssemblyMojoTest
Tests run: 6, Failures: 0, Errors: 6, Skipped: 0, Time elapsed: 0.081 sec <<< FAILURE!
Running org.apache.maven.plugin.assembly.BasicAbstractAssemblyMojoFeaturesTest
Tests run: 2, Failures: 0, Errors: 2, Skipped: 0, Time elapsed: 0.024 sec <<< FAILURE!
Running org.apache.maven.plugin.assembly.UnpackMojoTest
Tests run: 5, Failures: 0, Errors: 5, Skipped: 0, Time elapsed: 0.032 sec <<< FAILURE!
Running org.apache.maven.plugin.assembly.DirectoryMojoTest
Tests run: 3, Failures: 0, Errors: 3, Skipped: 0, Time elapsed: 0.029 sec <<< FAILURE!
Running org.apache.maven.plugin.assembly.interpolation.AssemblyInterpolatorTest
Tests run: 1, Failures: 0, Errors: 0, Skipped: 0, Time elapsed: 0.102 sec

Results :
Tests run: 17, Failures: 0, Errors: 16, Skipped: 0

[INFO] ------------------------------------------------------------------------
[ERROR] BUILD FAILURE
[INFO] ------------------------------------------------------------------------
[INFO] There are test failures.
[INFO] ------------------------------------------------------------------------
[INFO] For more information, run Maven with the -e switch
[INFO] ------------------------------------------------------------------------
[INFO] Total time: 28 seconds
[INFO] Finished at: Fri May 05 00:46:47 PDT 2006
[INFO] Final Memory: 16M/156M
[INFO] ------------------------------------------------------------------------

****************************************************************************



Mime
View raw message