maven-notifications mailing list archives

Site index · List index
Message view « Date » · « Thread »
Top « Date » · « Thread »
From Continuum Build Server <contin...@ci.codehaus.org>
Subject [continuum] BUILD FAILURE: Maven Assembly Plugin
Date Tue, 16 May 2006 06:43:06 GMT
Online report : http://ci.codehaus.org/continuum-maven/servlet/continuum/target/ProjectBuild.vm/view/ProjectBuild/id/35/buildId/5451
Build statistics:
  State: Failed
  Previous State: Failed
  Started at: Mon, 15 May 2006 23:42:24 -0700
  Finished at: Mon, 15 May 2006 23:43:06 -0700
  Total time: 42s
  Build Trigger: Forced
  Exit code: 1
  Building machine hostname: cheddar.simulalabs.com
  Operating system : Linux(unknown)
  Java version : 1.5.0_03(Sun Microsystems Inc.)

Changes
         epunzalan          PR: MASSEMBLY-88

Adding more test cases and see if it fixes the continuum build error in the last commit
             /maven/plugins/trunk/maven-assembly-plugin/src/test/java/org/apache/maven/plugin/assembly/AssemblyMojoTest.java
            /maven/plugins/trunk/maven-assembly-plugin/src/test/java/org/apache/maven/plugin/assembly/BasicAbstractAssemblyMojoFeaturesTest.java
            /maven/plugins/trunk/maven-assembly-plugin/src/test/java/org/apache/maven/plugin/assembly/stubs/ArchiverManagerStub.java
            /maven/plugins/trunk/maven-assembly-plugin/src/test/java/org/apache/maven/plugin/assembly/stubs/ArchiverStub.java
            /maven/plugins/trunk/maven-assembly-plugin/src/test/java/org/apache/maven/plugin/assembly/stubs/DirectoryArchiverStub.java
            /maven/plugins/trunk/maven-assembly-plugin/src/test/java/org/apache/maven/plugin/assembly/stubs/JarArchiverStub.java
(from /maven/plugins/trunk/maven-assembly-plugin/src/test/java/org/apache/maven/plugin/assembly/stubs/ArchiverStub.java:406791)
            /maven/plugins/trunk/maven-assembly-plugin/src/test/java/org/apache/maven/plugin/assembly/stubs/TarArchiverStub.java
            /maven/plugins/trunk/maven-assembly-plugin/src/test/java/org/apache/maven/plugin/assembly/stubs/WarArchiverStub.java
            /maven/plugins/trunk/maven-assembly-plugin/src/test/plugin-configs/assembly/includeSite-plugin-config.xml
            /maven/plugins/trunk/maven-assembly-plugin/src/test/plugin-configs/assembly/tar-bz2-plugin-config.xml
            /maven/plugins/trunk/maven-assembly-plugin/src/test/plugin-configs/assembly/tar-gz-plugin-config.xml
            /maven/plugins/trunk/maven-assembly-plugin/src/test/plugin-configs/assembly/war-plugin-config.xml
            /maven/plugins/trunk/maven-assembly-plugin/src/test/resources/assemblies/tar-bz2.xml
            /maven/plugins/trunk/maven-assembly-plugin/src/test/resources/assemblies/tar-gz.xml
            /maven/plugins/trunk/maven-assembly-plugin/src/test/resources/assemblies/war.xml
        
****************************************************************************
Output:
****************************************************************************
[INFO] Scanning for projects...
[INFO] ----------------------------------------------------------------------------
[INFO] Building Maven Assembly Plugin
[INFO]    task-segment: [clean, install]
[INFO] ----------------------------------------------------------------------------
[INFO] [clean:clean]
[INFO] Deleting directory /home/continuum/continuum-maven/working-directory/35/target
[INFO] Deleting directory /home/continuum/continuum-maven/working-directory/35/target/classes
[INFO] Deleting directory /home/continuum/continuum-maven/working-directory/35/target/test-classes
[INFO] Setting property: classpath.resource.loader.class => 'org.codehaus.plexus.velocity.ContextClassLoaderResourceLoader'.
[INFO] Setting property: velocimacro.messages.on => 'false'.
[INFO] Setting property: resource.loader => 'classpath'.
[INFO] Setting property: resource.manager.logwhenfound => 'false'.
[INFO] ************************************************************** 
[INFO] Starting Jakarta Velocity v1.4
[INFO] RuntimeInstance initializing.
[INFO] Default Properties File: org/apache/velocity/runtime/defaults/velocity.properties
[INFO] Default ResourceManager initializing. (class org.apache.velocity.runtime.resource.ResourceManagerImpl)
[INFO] Resource Loader Instantiated: org.codehaus.plexus.velocity.ContextClassLoaderResourceLoader
[INFO] ClasspathResourceLoader : initialization starting.
[INFO] ClasspathResourceLoader : initialization complete.
[INFO] ResourceCache : initialized. (class org.apache.velocity.runtime.resource.ResourceCacheImpl)
[INFO] Default ResourceManager initialization complete.
[INFO] Loaded System Directive: org.apache.velocity.runtime.directive.Literal
[INFO] Loaded System Directive: org.apache.velocity.runtime.directive.Macro
[INFO] Loaded System Directive: org.apache.velocity.runtime.directive.Parse
[INFO] Loaded System Directive: org.apache.velocity.runtime.directive.Include
[INFO] Loaded System Directive: org.apache.velocity.runtime.directive.Foreach
[INFO] Created: 20 parsers.
[INFO] Velocimacro : initialization starting.
[INFO] Velocimacro : adding VMs from VM library template : VM_global_library.vm
[ERROR] ResourceManager : unable to find resource 'VM_global_library.vm' in any resource loader.
[INFO] Velocimacro : error using  VM library template VM_global_library.vm : org.apache.velocity.exception.ResourceNotFoundException:
Unable to find resource 'VM_global_library.vm'
[INFO] Velocimacro :  VM library template macro registration complete.
[INFO] Velocimacro : allowInline = true : VMs can be defined inline in templates
[INFO] Velocimacro : allowInlineToOverride = false : VMs defined inline may NOT replace previous
VM definitions
[INFO] Velocimacro : allowInlineLocal = false : VMs defined inline will be  global in scope
if allowed.
[INFO] Velocimacro : initialization complete.
[INFO] Velocity successfully started.
[INFO] [modello:xpp3-reader {execution: descriptor}]
[INFO] outputDirectory: /home/continuum/continuum-maven/working-directory/35/target/generated-sources/modello
[INFO] [modello:xpp3-writer {execution: descriptor}]
[INFO] outputDirectory: /home/continuum/continuum-maven/working-directory/35/target/generated-sources/modello
[INFO] [modello:java {execution: descriptor}]
[INFO] outputDirectory: /home/continuum/continuum-maven/working-directory/35/target/generated-sources/modello
[INFO] [modello:xsd {execution: descriptor}]
[INFO] outputDirectory: /home/continuum/continuum-maven/working-directory/35/target/generated-site/xsd
[INFO] [modello:xpp3-reader {execution: component}]
[INFO] outputDirectory: /home/continuum/continuum-maven/working-directory/35/target/generated-sources/modello
[INFO] [modello:java {execution: component}]
[INFO] outputDirectory: /home/continuum/continuum-maven/working-directory/35/target/generated-sources/modello
[INFO] [modello:xsd {execution: component}]
[INFO] outputDirectory: /home/continuum/continuum-maven/working-directory/35/target/generated-site/xsd
[INFO] snapshot org.apache.maven:maven-plugin-descriptor:2.0.3-SNAPSHOT: checking for updates
from snapshots
[WARNING] repository metadata for: 'snapshot org.apache.maven:maven-plugin-descriptor:2.0.3-SNAPSHOT'
could not be retrieved from repository: snapshots due to an error: Error transferring file
[INFO] Repository 'snapshots' will be blacklisted
[INFO] [plugin:descriptor]
[INFO] Using 2 extractors.
[INFO] Applying extractor for language: java
[INFO] Extractor for language: java found 6 mojo descriptors.
[INFO] Applying extractor for language: bsh
[INFO] Extractor for language: bsh found 0 mojo descriptors.
[INFO] [resources:resources]
[INFO] Using default encoding to copy filtered resources.
[INFO] [compiler:compile]
Compiling 35 source files to /home/continuum/continuum-maven/working-directory/35/target/classes
[INFO] [resources:testResources]
[INFO] Using default encoding to copy filtered resources.
[INFO] [compiler:testCompile]
Compiling 20 source files to /home/continuum/continuum-maven/working-directory/35/target/test-classes
[INFO] [surefire:test]
[INFO] Surefire report directory: /home/continuum/continuum-maven/working-directory/35/target/surefire-reports

-------------------------------------------------------
 T E S T S
-------------------------------------------------------
Running org.apache.maven.plugin.assembly.AssemblyMojoTest
Adding dir /home/continuum/continuum-maven/working-directory/35/target/test-harness/assembly/min/target
Adding file /home/continuum/continuum-maven/working-directory/35/target/local-repo/dependency-artifact1-1.0.jar
Adding file /home/continuum/continuum-maven/working-directory/35/target/local-repo/dependency-artifact2-1.0.jar
Adding file /home/continuum/continuum-maven/working-directory/35/target/local-repo/test-project-1.0.jar
Adding file /home/continuum/continuum-maven/working-directory/35/target/local-repo/dependency-artifact3-1.0.jar
Adding file /home/continuum/continuum-maven/working-directory/35/target/local-repo/dependency-artifact1-1.0.jar
Adding file /home/continuum/continuum-maven/working-directory/35/target/local-repo/dependency-artifact2-1.0.jar
Adding file /home/continuum/continuum-maven/working-directory/35/target/local-repo/test-project-1.0.jar
Adding file /home/continuum/continuum-maven/working-directory/35/target/local-repo/dependency-artifact3-1.0.jar
Adding file /home/continuum/continuum-maven/working-directory/35/target/local-repo/dependency-artifact1-1.0.jar
Adding file /home/continuum/continuum-maven/working-directory/35/target/local-repo/dependency-artifact2-1.0.jar
Adding file /home/continuum/continuum-maven/working-directory/35/target/local-repo/test-project-1.0.jar
Adding file /home/continuum/continuum-maven/working-directory/35/target/local-repo/dependency-artifact3-1.0.jar
Adding file /home/continuum/continuum-maven/working-directory/35/target/local-repo/dependency-artifact1-1.0.jar
Adding file /home/continuum/continuum-maven/working-directory/35/target/local-repo/dependency-artifact2-1.0.jar
Adding file /home/continuum/continuum-maven/working-directory/35/target/local-repo/test-project-1.0.jar
Adding dir /home/continuum/continuum-maven/working-directory/35/target/test-harness/assembly/depSet-unpack/work/dependency-artifact1-1.0.jar
Adding dir /home/continuum/continuum-maven/working-directory/35/target/test-harness/assembly/depSet-unpack/work/dependency-artifact2-1.0.jar
Adding dir /home/continuum/continuum-maven/working-directory/35/target/test-harness/assembly/depSet-unpack/work/test-project-1.0.jar
Adding dir /home/continuum/continuum-maven/working-directory/35/target/test-harness/assembly/depSet-unpack/work/dependency-artifact3-1.0.jar
Adding dir /home/continuum/continuum-maven/working-directory/35/target/test-classes/fileSet
Adding dir /home/continuum/continuum-maven/working-directory/35/target/test-classes/fileSet
Adding dir /home/continuum/continuum-maven/working-directory/35/target/test-classes/fileSet
Adding dir /home/continuum/continuum-maven/working-directory/35/target/test-harness/assembly/fileSet-unix-lineEndings/archive-tmp/624093754
Adding dir /home/continuum/continuum-maven/working-directory/35/target/test-harness/assembly/fileSet-lf-lineEndings/archive-tmp/866245758
Adding dir /home/continuum/continuum-maven/working-directory/35/target/test-harness/assembly/fileSet-dos-lineEndings/archive-tmp/1182206187
Adding dir /home/continuum/continuum-maven/working-directory/35/target/test-harness/assembly/fileSet-crlf-lineEndings/archive-tmp/1360589784
Adding file target/test-classes/fileSet/README.txt
Adding file target/test-classes/fileSet/LICENSE.txt
Adding file target/test-classes/fileSet/README.txt
[INFO] Initializing assembly filters...
Adding file /home/continuum/continuum-maven/working-directory/35/target/test-harness/assembly/fileItem-filtered/archive-tmp/README.txt
Adding file /home/continuum/continuum-maven/working-directory/35/target/test-harness/assembly/fileItem-lineEndings/archive-tmp/README.txt.24796
Adding file target/test-classes/fileSet/README.txt
Adding dir /home/continuum/continuum-maven/working-directory/35/target/test-harness/assembly/moduleSet/work/reactor-project-1-1.0.jar
Adding dir /home/continuum/continuum-maven/working-directory/35/target/test-harness/assembly/moduleSet/reactor-project-1
Adding dir /home/continuum/continuum-maven/working-directory/35/target/test-harness/assembly/moduleSet/work/reactor-project-2-1.0.jar
Adding dir /home/continuum/continuum-maven/working-directory/35/target/test-harness/assembly/moduleSet/reactor-project-1
Adding dir /home/continuum/continuum-maven/working-directory/35/target/test-harness/assembly/moduleSet/reactor-project-2
Adding dir /home/continuum/continuum-maven/working-directory/35/target/test-harness/assembly/moduleSet-includes/work/reactor-project-1-1.0.jar
Adding dir /home/continuum/continuum-maven/working-directory/35/target/test-harness/assembly/moduleSet-includes/reactor-project-1
Adding dir /home/continuum/continuum-maven/working-directory/35/target/test-harness/assembly/moduleSet-includes/reactor-project-1
Adding dir /home/continuum/continuum-maven/working-directory/35/target/test-harness/assembly/moduleSet-excludes/work/reactor-project-2-1.0.jar
Adding dir /home/continuum/continuum-maven/working-directory/35/target/test-harness/assembly/moduleSet-excludes/reactor-project-2
Adding dir /home/continuum/continuum-maven/working-directory/35/target/test-harness/assembly/moduleSet-include-dependencies/work/reactor-project-3-1.0.jar
Adding dir /home/continuum/continuum-maven/working-directory/35/target/test-harness/assembly/moduleSet-include-dependencies/reactor-project-3
Adding dir /home/continuum/continuum-maven/working-directory/35/target/test-harness/assembly/moduleSet-include-dependencies/work/reactor-project-4-1.0.jar
Adding dir /home/continuum/continuum-maven/working-directory/35/target/test-harness/assembly/moduleSet-include-dependencies/reactor-project-3
Adding dir /home/continuum/continuum-maven/working-directory/35/target/test-harness/assembly/moduleSet-include-dependencies/reactor-project-4
Adding file /home/continuum/continuum-maven/working-directory/35/target/local-repo/reactor-project-1-1.0.jar
Adding file /home/continuum/continuum-maven/working-directory/35/target/local-repo/reactor-project-2-1.0.jar
Adding file /home/continuum/continuum-maven/working-directory/35/target/local-repo/reactor-project-1-1.0.jar
Adding file /home/continuum/continuum-maven/working-directory/35/target/local-repo/reactor-dependency-1.0.jar
Adding dir /home/continuum/continuum-maven/working-directory/35/target/test-harness/assembly/repository/archive-tmp/repository
Adding dir /home/continuum/continuum-maven/working-directory/35/target/test-harness/assembly/repository-with-metadata/archive-tmp/repository
Adding dir /home/continuum/continuum-maven/working-directory/35/target/test-harness/assembly/repository-groupVersionAlignment/archive-tmp/repository
Adding dir /home/continuum/continuum-maven/working-directory/35/target/test-harness/assembly/repository-groupVersionAlignment-excludes/archive-tmp/repository
Adding dir /home/continuum/continuum-maven/working-directory/35/target/test-harness/assembly/MASSEMBLY-98/archive-tmp/repository
Adding file /home/continuum/continuum-maven/working-directory/35/target/local-repo/test-project-1.0.jar
Adding dir /home/continuum/continuum-maven/working-directory/35/target/test-classes/fileSet
Adding file target/test-classes/fileSet/README.txt
Adding file target/test-classes/fileSet/LICENSE.txt
[INFO] Adding site directory to assembly : /home/continuum/continuum-maven/working-directory/35/target/test-harness/assembly/includeSite/site
Adding dir /home/continuum/continuum-maven/working-directory/35/target/test-harness/assembly/min/target
Adding dir /home/continuum/continuum-maven/working-directory/35/target/test-harness/assembly/includeSite/site
Tests run: 39, Failures: 1, Errors: 0, Skipped: 0, Time elapsed: 14.938 sec <<< FAILURE!
Running org.apache.maven.plugin.assembly.UnpackMojoTest
[INFO] Skip unpacking dependency file with unknown extension: /home/continuum/continuum-maven/working-directory/35/target/local-repo/test-project-1.0.jar
Tests run: 5, Failures: 0, Errors: 0, Skipped: 0, Time elapsed: 0.497 sec
Running org.apache.maven.plugin.assembly.DirectoryMojoTest
Adding dir /home/continuum/continuum-maven/working-directory/35/target/test-harness/assembly/min/target
Adding file /home/continuum/continuum-maven/working-directory/35/target/local-repo/dependency-artifact1-1.0.jar
Adding file /home/continuum/continuum-maven/working-directory/35/target/local-repo/dependency-artifact2-1.0.jar
Adding file /home/continuum/continuum-maven/working-directory/35/target/local-repo/test-project-1.0.jar
Adding file /home/continuum/continuum-maven/working-directory/35/target/local-repo/dependency-artifact3-1.0.jar
Adding file /home/continuum/continuum-maven/working-directory/35/target/local-repo/dependency-artifact1-1.0.jar
Adding file /home/continuum/continuum-maven/working-directory/35/target/local-repo/dependency-artifact2-1.0.jar
Adding file /home/continuum/continuum-maven/working-directory/35/target/local-repo/test-project-1.0.jar
Adding file /home/continuum/continuum-maven/working-directory/35/target/local-repo/dependency-artifact3-1.0.jar
Tests run: 5, Failures: 0, Errors: 0, Skipped: 0, Time elapsed: 0.913 sec
Running org.apache.maven.plugin.assembly.DirectoryInlineMojoTest
Adding dir /home/continuum/continuum-maven/working-directory/35/target/test-harness/assembly/min/target
Tests run: 1, Failures: 0, Errors: 0, Skipped: 0, Time elapsed: 0.232 sec
Running org.apache.maven.plugin.assembly.interpolation.AssemblyInterpolatorTest
Tests run: 1, Failures: 0, Errors: 0, Skipped: 0, Time elapsed: 0.04 sec

Results :
Tests run: 51, Failures: 1, Errors: 0, Skipped: 0

[INFO] ------------------------------------------------------------------------
[ERROR] BUILD FAILURE
[INFO] ------------------------------------------------------------------------
[INFO] There are test failures.
[INFO] ------------------------------------------------------------------------
[INFO] For more information, run Maven with the -e switch
[INFO] ------------------------------------------------------------------------
[INFO] Total time: 40 seconds
[INFO] Finished at: Mon May 15 23:43:06 PDT 2006
[INFO] Final Memory: 17M/151M
[INFO] ------------------------------------------------------------------------

****************************************************************************



Mime
View raw message