maven-notifications mailing list archives

Site index · List index
Message view « Date » · « Thread »
Top « Date » · « Thread »
From Continuum Build Server <contin...@ci.codehaus.org>
Subject [continuum] BUILD FAILURE: Maven Assembly Plugin
Date Mon, 01 May 2006 20:46:08 GMT
Online report : http://ci.codehaus.org/continuum-maven/servlet/continuum/target/ProjectBuild.vm/view/ProjectBuild/id/35/buildId/2237
Build statistics:
  State: Failed
  Previous State: Ok
  Started at: Mon, 1 May 2006 13:45:57 -0700
  Finished at: Mon, 1 May 2006 13:46:08 -0700
  Total time: 11s
  Build Trigger: Schedule
  Exit code: 1
  Building machine hostname: cheddar.simulalabs.com
  Operating system : Linux(unknown)
  Java version : 1.5.0_03(Sun Microsystems Inc.)

Changes
         jdcasey          [MASSEMBLY-89] Adding unit tests. Cannot reproduce error (yet).
             /maven/plugins/trunk/maven-assembly-plugin/pom.xml
            /maven/plugins/trunk/maven-assembly-plugin/src/test/java/org/apache/maven/plugin/assembly/BasicAbstractAssemblyMojoFeaturesTest.java
            /maven/plugins/trunk/maven-assembly-plugin/src/test/plugin-configs/basicAbstractAssemblyMojoFeaturesTest
            /maven/plugins/trunk/maven-assembly-plugin/src/test/plugin-configs/basicAbstractAssemblyMojoFeaturesTest/outputFileNameMapping-pluginConfig.xml
            /maven/plugins/trunk/maven-assembly-plugin/src/test/plugin-configs/basicAbstractAssemblyMojoFeaturesTest/outputFileNameMappingWithTwoDependencySets-pluginConfig.xml
            /maven/plugins/trunk/maven-assembly-plugin/src/test/resources
            /maven/plugins/trunk/maven-assembly-plugin/src/test/resources/basicAbstractAssemblyMojoFeaturesTest
            /maven/plugins/trunk/maven-assembly-plugin/src/test/resources/basicAbstractAssemblyMojoFeaturesTest/outputFileNameMapping-assemblyDescriptor.xml
            /maven/plugins/trunk/maven-assembly-plugin/src/test/resources/basicAbstractAssemblyMojoFeaturesTest/outputFileNameMappingWithTwoDependencySets-assemblyDescriptor.xml
        
****************************************************************************
Output:
****************************************************************************
[INFO] Scanning for projects...
[INFO] ----------------------------------------------------------------------------
[INFO] Building Maven Assembly Plugin
[INFO]    task-segment: [clean, install]
[INFO] ----------------------------------------------------------------------------
[INFO] [clean:clean]
[INFO] Deleting directory /home/continuum/continuum-maven/working-directory/35/target
[INFO] Deleting directory /home/continuum/continuum-maven/working-directory/35/target/classes
[INFO] Deleting directory /home/continuum/continuum-maven/working-directory/35/target/test-classes
[INFO] Setting property: classpath.resource.loader.class => 'org.codehaus.plexus.velocity.ContextClassLoaderResourceLoader'.
[INFO] Setting property: velocimacro.messages.on => 'false'.
[INFO] Setting property: resource.loader => 'classpath'.
[INFO] Setting property: resource.manager.logwhenfound => 'false'.
[INFO] ************************************************************** 
[INFO] Starting Jakarta Velocity v1.4
[INFO] RuntimeInstance initializing.
[INFO] Default Properties File: org/apache/velocity/runtime/defaults/velocity.properties
[INFO] Default ResourceManager initializing. (class org.apache.velocity.runtime.resource.ResourceManagerImpl)
[INFO] Resource Loader Instantiated: org.codehaus.plexus.velocity.ContextClassLoaderResourceLoader
[INFO] ClasspathResourceLoader : initialization starting.
[INFO] ClasspathResourceLoader : initialization complete.
[INFO] ResourceCache : initialized. (class org.apache.velocity.runtime.resource.ResourceCacheImpl)
[INFO] Default ResourceManager initialization complete.
[INFO] Loaded System Directive: org.apache.velocity.runtime.directive.Literal
[INFO] Loaded System Directive: org.apache.velocity.runtime.directive.Macro
[INFO] Loaded System Directive: org.apache.velocity.runtime.directive.Parse
[INFO] Loaded System Directive: org.apache.velocity.runtime.directive.Include
[INFO] Loaded System Directive: org.apache.velocity.runtime.directive.Foreach
[INFO] Created: 20 parsers.
[INFO] Velocimacro : initialization starting.
[INFO] Velocimacro : adding VMs from VM library template : VM_global_library.vm
[ERROR] ResourceManager : unable to find resource 'VM_global_library.vm' in any resource loader.
[INFO] Velocimacro : error using  VM library template VM_global_library.vm : org.apache.velocity.exception.ResourceNotFoundException:
Unable to find resource 'VM_global_library.vm'
[INFO] Velocimacro :  VM library template macro registration complete.
[INFO] Velocimacro : allowInline = true : VMs can be defined inline in templates
[INFO] Velocimacro : allowInlineToOverride = false : VMs defined inline may NOT replace previous
VM definitions
[INFO] Velocimacro : allowInlineLocal = false : VMs defined inline will be  global in scope
if allowed.
[INFO] Velocimacro : initialization complete.
[INFO] Velocity successfully started.
[INFO] [modello:xpp3-reader {execution: descriptor}]
[INFO] outputDirectory: /home/continuum/continuum-maven/working-directory/35/target/generated-sources/modello
[INFO] [modello:xpp3-writer {execution: descriptor}]
[INFO] outputDirectory: /home/continuum/continuum-maven/working-directory/35/target/generated-sources/modello
[INFO] [modello:java {execution: descriptor}]
[INFO] outputDirectory: /home/continuum/continuum-maven/working-directory/35/target/generated-sources/modello
[INFO] [modello:xsd {execution: descriptor}]
[INFO] outputDirectory: /home/continuum/continuum-maven/working-directory/35/target/generated-site/xsd
[INFO] [modello:xpp3-reader {execution: component}]
[INFO] outputDirectory: /home/continuum/continuum-maven/working-directory/35/target/generated-sources/modello
[INFO] [modello:xpp3-writer {execution: component}]
[INFO] outputDirectory: /home/continuum/continuum-maven/working-directory/35/target/generated-sources/modello
[INFO] [modello:java {execution: component}]
[INFO] outputDirectory: /home/continuum/continuum-maven/working-directory/35/target/generated-sources/modello
[INFO] [modello:xsd {execution: component}]
[INFO] outputDirectory: /home/continuum/continuum-maven/working-directory/35/target/generated-site/xsd
[INFO] [plugin:descriptor]
[INFO] Using 2 extractors.
[INFO] Applying extractor for language: java
[INFO] Extractor for language: java found 5 mojo descriptors.
[INFO] Applying extractor for language: bsh
[INFO] Extractor for language: bsh found 0 mojo descriptors.
[INFO] [resources:resources]
[INFO] Using default encoding to copy filtered resources.
[INFO] snapshot org.codehaus.plexus:plexus-utils:1.2-SNAPSHOT: checking for updates from snapshots
[INFO] snapshot org.codehaus.plexus:plexus-utils:1.2-SNAPSHOT: checking for updates from apache.snapshots
[INFO] snapshot org.apache.maven:maven-plugin-testing-harness:1.0-SNAPSHOT: checking for updates
from snapshots
[INFO] snapshot org.apache.maven:maven-plugin-testing-harness:1.0-SNAPSHOT: checking for updates
from apache.snapshots
[INFO] snapshot org.codehaus.plexus:plexus-archiver:1.0-alpha-6-SNAPSHOT: checking for updates
from snapshots
[INFO] snapshot org.codehaus.plexus:plexus-archiver:1.0-alpha-6-SNAPSHOT: checking for updates
from apache.snapshots
[INFO] [compiler:compile]
Compiling 28 source files to /home/continuum/continuum-maven/working-directory/35/target/classes
[INFO] [resources:testResources]
[INFO] Using default encoding to copy filtered resources.
[INFO] [compiler:testCompile]
Compiling 9 source files to /home/continuum/continuum-maven/working-directory/35/target/test-classes
-----------------------------------------------------
this realm = app0.child-container[org.apache.maven.plugins:maven-surefire-plugin]
urls[0] = file:/home/continuum/.m2/repository/org/apache/maven/plugins/maven-surefire-plugin/2.2-SNAPSHOT/maven-surefire-plugin-2.2-SNAPSHOT.jar
urls[1] = file:/home/continuum/.m2/repository/org/apache/maven/surefire/surefire-api/2.0-SNAPSHOT/surefire-api-2.0-SNAPSHOT.jar
urls[2] = file:/home/continuum/.m2/repository/org/apache/maven/surefire/surefire-booter/2.0-SNAPSHOT/surefire-booter-2.0-SNAPSHOT.jar
Number of imports: 0


this realm = plexus.core.maven
urls[0] = file:/usr/local/maven-2.0.4/lib/jsch-0.1.24.jar
urls[1] = file:/usr/local/maven-2.0.4/lib/maven-plugin-registry-2.0.4.jar
urls[2] = file:/usr/local/maven-2.0.4/lib/maven-core-2.0.4.jar
urls[3] = file:/usr/local/maven-2.0.4/lib/plexus-interactivity-api-1.0-alpha-4.jar
urls[4] = file:/usr/local/maven-2.0.4/lib/wagon-ssh-1.0-alpha-7.jar
urls[5] = file:/usr/local/maven-2.0.4/lib/commons-cli-1.0.jar
urls[6] = file:/usr/local/maven-2.0.4/lib/maven-profile-2.0.4.jar
urls[7] = file:/usr/local/maven-2.0.4/lib/maven-model-2.0.4.jar
urls[8] = file:/usr/local/maven-2.0.4/lib/wagon-file-1.0-alpha-7.jar
urls[9] = file:/usr/local/maven-2.0.4/lib/wagon-http-lightweight-1.0-alpha-6.jar
urls[10] = file:/usr/local/maven-2.0.4/lib/maven-project-2.0.4.jar
urls[11] = file:/usr/local/maven-2.0.4/lib/maven-artifact-2.0.4.jar
urls[12] = file:/usr/local/maven-2.0.4/lib/maven-plugin-descriptor-2.0.4.jar
urls[13] = file:/usr/local/maven-2.0.4/lib/maven-artifact-manager-2.0.4.jar
urls[14] = file:/usr/local/maven-2.0.4/lib/maven-plugin-api-2.0.4.jar
urls[15] = file:/usr/local/maven-2.0.4/lib/maven-plugin-parameter-documenter-2.0.4.jar
urls[16] = file:/usr/local/maven-2.0.4/lib/maven-monitor-2.0.4.jar
urls[17] = file:/usr/local/maven-2.0.4/lib/maven-error-diagnostics-2.0.4.jar
urls[18] = file:/usr/local/maven-2.0.4/lib/maven-reporting-api-2.0.4.jar
urls[19] = file:/usr/local/maven-2.0.4/lib/wagon-ssh-external-1.0-alpha-6.jar
urls[20] = file:/usr/local/maven-2.0.4/lib/maven-repository-metadata-2.0.4.jar
urls[21] = file:/usr/local/maven-2.0.4/lib/maven-settings-2.0.4.jar
urls[22] = file:/usr/local/maven-2.0.4/lib/doxia-sink-api-1.0-alpha-7.jar
urls[23] = file:/usr/local/maven-2.0.4/lib/wagon-provider-api-1.0-alpha-6.jar
Number of imports: 0


this realm = plexus.core
urls[0] = file:/usr/local/maven-2.0.4/core/plexus-container-default-1.0-alpha-9.jar
urls[1] = file:/usr/local/maven-2.0.4/core/plexus-utils-1.1.jar
Number of imports: 0
-----------------------------------------------------
[INFO] ------------------------------------------------------------------------
[ERROR] BUILD ERROR
[INFO] ------------------------------------------------------------------------
[INFO] Internal error in the plugin manager executing goal 'org.apache.maven.plugins:maven-surefire-plugin:2.2-SNAPSHOT:test':
Unable to find the mojo 'org.apache.maven.plugins:maven-surefire-plugin:2.2-SNAPSHOT:test'
in the plugin 'org.apache.maven.plugins:maven-surefire-plugin'
org/apache/maven/util/jdk13/NestedCheckedException
[INFO] ------------------------------------------------------------------------
[INFO] For more information, run Maven with the -e switch
[INFO] ------------------------------------------------------------------------
[INFO] Total time: 10 seconds
[INFO] Finished at: Mon May 01 13:46:08 PDT 2006
[INFO] Final Memory: 16M/155M
[INFO] ------------------------------------------------------------------------

****************************************************************************



Mime
View raw message