maven-notifications mailing list archives

Site index · List index
Message view « Date » · « Thread »
Top « Date » · « Thread »
From Continuum Build Server <contin...@ci.codehaus.org>
Subject [continuum] BUILD FAILURE: Maven Assembly Plugin
Date Thu, 04 May 2006 11:19:33 GMT
Online report : http://ci.codehaus.org/continuum-maven/servlet/continuum/target/ProjectBuild.vm/view/ProjectBuild/id/35/buildId/2444
Build statistics:
  State: Failed
  Previous State: Failed
  Started at: Thu, 4 May 2006 04:19:15 -0700
  Finished at: Thu, 4 May 2006 04:19:33 -0700
  Total time: 17s
  Build Trigger: Schedule
  Exit code: 1
  Building machine hostname: cheddar.simulalabs.com
  Operating system : Linux(unknown)
  Java version : 1.5.0_03(Sun Microsystems Inc.)

Changes
         aramirez          PR: MASSEMBLY-88

added test for directory mojo
             /maven/plugins/trunk/maven-assembly-plugin/src/test/java/org/apache/maven/plugin/assembly/DirectoryMojoTest.java
            /maven/plugins/trunk/maven-assembly-plugin/src/test/plugin-configs/directory
            /maven/plugins/trunk/maven-assembly-plugin/src/test/plugin-configs/directory/dependency-set-plugin-config.xml
            /maven/plugins/trunk/maven-assembly-plugin/src/test/plugin-configs/directory/min-plugin-config.xml
        
****************************************************************************
Output:
****************************************************************************
[INFO] Scanning for projects...
[INFO] ----------------------------------------------------------------------------
[INFO] Building Maven Assembly Plugin
[INFO]    task-segment: [clean, install]
[INFO] ----------------------------------------------------------------------------
[INFO] [clean:clean]
[INFO] Deleting directory /home/continuum/continuum-maven/working-directory/35/target
[INFO] Deleting directory /home/continuum/continuum-maven/working-directory/35/target/classes
[INFO] Deleting directory /home/continuum/continuum-maven/working-directory/35/target/test-classes
[INFO] Setting property: classpath.resource.loader.class => 'org.codehaus.plexus.velocity.ContextClassLoaderResourceLoader'.
[INFO] Setting property: velocimacro.messages.on => 'false'.
[INFO] Setting property: resource.loader => 'classpath'.
[INFO] Setting property: resource.manager.logwhenfound => 'false'.
[INFO] ************************************************************** 
[INFO] Starting Jakarta Velocity v1.4
[INFO] RuntimeInstance initializing.
[INFO] Default Properties File: org/apache/velocity/runtime/defaults/velocity.properties
[INFO] Default ResourceManager initializing. (class org.apache.velocity.runtime.resource.ResourceManagerImpl)
[INFO] Resource Loader Instantiated: org.codehaus.plexus.velocity.ContextClassLoaderResourceLoader
[INFO] ClasspathResourceLoader : initialization starting.
[INFO] ClasspathResourceLoader : initialization complete.
[INFO] ResourceCache : initialized. (class org.apache.velocity.runtime.resource.ResourceCacheImpl)
[INFO] Default ResourceManager initialization complete.
[INFO] Loaded System Directive: org.apache.velocity.runtime.directive.Literal
[INFO] Loaded System Directive: org.apache.velocity.runtime.directive.Macro
[INFO] Loaded System Directive: org.apache.velocity.runtime.directive.Parse
[INFO] Loaded System Directive: org.apache.velocity.runtime.directive.Include
[INFO] Loaded System Directive: org.apache.velocity.runtime.directive.Foreach
[INFO] Created: 20 parsers.
[INFO] Velocimacro : initialization starting.
[INFO] Velocimacro : adding VMs from VM library template : VM_global_library.vm
[ERROR] ResourceManager : unable to find resource 'VM_global_library.vm' in any resource loader.
[INFO] Velocimacro : error using  VM library template VM_global_library.vm : org.apache.velocity.exception.ResourceNotFoundException:
Unable to find resource 'VM_global_library.vm'
[INFO] Velocimacro :  VM library template macro registration complete.
[INFO] Velocimacro : allowInline = true : VMs can be defined inline in templates
[INFO] Velocimacro : allowInlineToOverride = false : VMs defined inline may NOT replace previous
VM definitions
[INFO] Velocimacro : allowInlineLocal = false : VMs defined inline will be  global in scope
if allowed.
[INFO] Velocimacro : initialization complete.
[INFO] Velocity successfully started.
[INFO] [modello:xpp3-reader {execution: descriptor}]
[INFO] outputDirectory: /home/continuum/continuum-maven/working-directory/35/target/generated-sources/modello
[INFO] [modello:xpp3-writer {execution: descriptor}]
[INFO] outputDirectory: /home/continuum/continuum-maven/working-directory/35/target/generated-sources/modello
[INFO] [modello:java {execution: descriptor}]
[INFO] outputDirectory: /home/continuum/continuum-maven/working-directory/35/target/generated-sources/modello
[INFO] [modello:xsd {execution: descriptor}]
[INFO] outputDirectory: /home/continuum/continuum-maven/working-directory/35/target/generated-site/xsd
[INFO] [modello:xpp3-reader {execution: component}]
[INFO] outputDirectory: /home/continuum/continuum-maven/working-directory/35/target/generated-sources/modello
[INFO] [modello:xpp3-writer {execution: component}]
[INFO] outputDirectory: /home/continuum/continuum-maven/working-directory/35/target/generated-sources/modello
[INFO] [modello:java {execution: component}]
[INFO] outputDirectory: /home/continuum/continuum-maven/working-directory/35/target/generated-sources/modello
[INFO] [modello:xsd {execution: component}]
[INFO] outputDirectory: /home/continuum/continuum-maven/working-directory/35/target/generated-site/xsd
[INFO] [plugin:descriptor]
[INFO] Using 2 extractors.
[INFO] Applying extractor for language: java
[INFO] Extractor for language: java found 5 mojo descriptors.
[INFO] Applying extractor for language: bsh
[INFO] Extractor for language: bsh found 0 mojo descriptors.
[INFO] [resources:resources]
[INFO] Using default encoding to copy filtered resources.
[INFO] [compiler:compile]
Compiling 30 source files to /home/continuum/continuum-maven/working-directory/35/target/classes
[INFO] [resources:testResources]
[INFO] Using default encoding to copy filtered resources.
[INFO] [compiler:testCompile]
Compiling 15 source files to /home/continuum/continuum-maven/working-directory/35/target/test-classes
[INFO] [surefire:test]
[INFO] Surefire report directory: /home/continuum/continuum-maven/working-directory/35/target/surefire-reports

-------------------------------------------------------
 T E S T S
-------------------------------------------------------
Running org.apache.maven.plugin.assembly.AssemblyMojoTest
Adding file /home/continuum/continuum-maven/working-directory/35/target/local-repo/dependency-artifact1-1.0.jar
Adding file /home/continuum/continuum-maven/working-directory/35/target/local-repo/dependency-artifact2-1.0.jar
Adding file /home/continuum/continuum-maven/working-directory/35/target/local-repo/test-project-1.0.jar
Adding file /home/continuum/continuum-maven/working-directory/35/target/local-repo/dependency-artifact3-1.0.jar
Adding file /home/continuum/continuum-maven/working-directory/35/target/local-repo/dependency-artifact1-1.0.jar
Adding file /home/continuum/continuum-maven/working-directory/35/target/local-repo/dependency-artifact2-1.0.jar
Adding file /home/continuum/continuum-maven/working-directory/35/target/local-repo/test-project-1.0.jar
Adding file /home/continuum/continuum-maven/working-directory/35/target/local-repo/dependency-artifact3-1.0.jar
Adding file /home/continuum/continuum-maven/working-directory/35/target/local-repo/dependency-artifact1-1.0.jar
Adding file /home/continuum/continuum-maven/working-directory/35/target/local-repo/dependency-artifact2-1.0.jar
Adding file /home/continuum/continuum-maven/working-directory/35/target/local-repo/test-project-1.0.jar
Adding dir /home/continuum/continuum-maven/working-directory/35/target/test-harness/assembly/depSet-unpack/work/dependency-artifact1-1.0
Adding dir /home/continuum/continuum-maven/working-directory/35/target/test-harness/assembly/depSet-unpack/work/dependency-artifact2-1.0
Adding dir /home/continuum/continuum-maven/working-directory/35/target/test-harness/assembly/depSet-unpack/work/test-project-1.0
Adding dir /home/continuum/continuum-maven/working-directory/35/target/test-harness/assembly/depSet-unpack/work/dependency-artifact3-1.0
Tests run: 5, Failures: 0, Errors: 0, Skipped: 0, Time elapsed: 1.164 sec
Running org.apache.maven.plugin.assembly.BasicAbstractAssemblyMojoFeaturesTest
Tests run: 2, Failures: 2, Errors: 0, Skipped: 0, Time elapsed: 0.119 sec <<< FAILURE!
Running org.apache.maven.plugin.assembly.UnpackMojoTest
[INFO] Skip unpacking dependency file with unknown extension: /home/continuum/continuum-maven/working-directory/35/target/local-repo/test-project-1.0.jar
Tests run: 5, Failures: 0, Errors: 0, Skipped: 0, Time elapsed: 0.322 sec
Running org.apache.maven.plugin.assembly.DirectoryMojoTest
Adding dir /home/continuum/continuum-maven/working-directory/35/target/test-harness/assembly/min/target
Adding file /home/continuum/continuum-maven/working-directory/35/target/local-repo/dependency-artifact1-1.0.jar
Adding file /home/continuum/continuum-maven/working-directory/35/target/local-repo/dependency-artifact2-1.0.jar
Adding file /home/continuum/continuum-maven/working-directory/35/target/local-repo/test-project-1.0.jar
Adding file /home/continuum/continuum-maven/working-directory/35/target/local-repo/dependency-artifact3-1.0.jar
Tests run: 3, Failures: 0, Errors: 0, Skipped: 0, Time elapsed: 0.257 sec
Running org.apache.maven.plugin.assembly.interpolation.AssemblyInterpolatorTest
Tests run: 1, Failures: 0, Errors: 0, Skipped: 0, Time elapsed: 0.035 sec

Results :
Tests run: 16, Failures: 2, Errors: 0, Skipped: 0

[INFO] ------------------------------------------------------------------------
[ERROR] BUILD FAILURE
[INFO] ------------------------------------------------------------------------
[INFO] There are test failures.
[INFO] ------------------------------------------------------------------------
[INFO] For more information, run Maven with the -e switch
[INFO] ------------------------------------------------------------------------
[INFO] Total time: 16 seconds
[INFO] Finished at: Thu May 04 04:19:33 PDT 2006
[INFO] Final Memory: 16M/154M
[INFO] ------------------------------------------------------------------------

****************************************************************************



Mime
View raw message