maven-notifications mailing list archives

Site index · List index
Message view « Date » · « Thread »
Top « Date » · « Thread »
From Continuum Build Server <contin...@ci.codehaus.org>
Subject [continuum] BUILD FAILURE: Maven Release plugin
Date Wed, 03 May 2006 08:03:23 GMT
Online report : http://ci.codehaus.org/continuum-maven/servlet/continuum/target/ProjectBuild.vm/view/ProjectBuild/id/54/buildId/2377
Build statistics:
  State: Failed
  Previous State: Ok
  Started at: Wed, 3 May 2006 01:02:30 -0700
  Finished at: Wed, 3 May 2006 01:03:23 -0700
  Total time: 53s
  Build Trigger: Schedule
  Exit code: 1
  Building machine hostname: cheddar.simulalabs.com
  Operating system : Linux(unknown)
  Java version : 1.5.0_03(Sun Microsystems Inc.)

Changes
         brett          [MRELEASE-98] rename connection URL
             /maven/plugins/trunk/maven-release-plugin/src/main/java/org/apache/maven/plugins/release/PerformReleaseMojo.java
        
****************************************************************************
Output:
****************************************************************************
[INFO] Scanning for projects...
[INFO] ----------------------------------------------------------------------------
[INFO] Building Maven Release plugin
[INFO]    task-segment: [clean, install]
[INFO] ----------------------------------------------------------------------------
[INFO] [clean:clean]
[INFO] Deleting directory /home/continuum/continuum-maven/working-directory/54/target
[INFO] Deleting directory /home/continuum/continuum-maven/working-directory/54/target/classes
[INFO] Deleting directory /home/continuum/continuum-maven/working-directory/54/target/test-classes
[INFO] [plugin:descriptor]
[INFO] Using 2 extractors.
[INFO] Applying extractor for language: java
[INFO] Extractor for language: java found 3 mojo descriptors.
[INFO] Applying extractor for language: bsh
[INFO] Extractor for language: bsh found 0 mojo descriptors.
[INFO] [resources:resources]
[INFO] Using default encoding to copy filtered resources.
[INFO] [compiler:compile]
Compiling 43 source files to /home/continuum/continuum-maven/working-directory/54/target/classes
[INFO] [resources:testResources]
[INFO] Using default encoding to copy filtered resources.
[INFO] [compiler:testCompile]
Compiling 27 source files to /home/continuum/continuum-maven/working-directory/54/target/test-classes
[INFO] [surefire:test]
[INFO] Surefire report directory: /home/continuum/continuum-maven/working-directory/54/target/surefire-reports

-------------------------------------------------------
 T E S T S
-------------------------------------------------------
Running org.apache.maven.plugins.release.exec.ForkedMavenExecutorTest
Tests run: 5, Failures: 0, Errors: 0, Skipped: 0, Time elapsed: 0.832 sec
Running org.apache.maven.plugins.release.phase.RewritePomsForDevelopmentPhaseTest
Tests run: 34, Failures: 0, Errors: 0, Skipped: 0, Time elapsed: 9.211 sec
Running org.apache.maven.plugins.release.config.PropertiesReleaseConfigurationStoreTest
Tests run: 13, Failures: 0, Errors: 0, Skipped: 0, Time elapsed: 4.798 sec
Running org.apache.maven.plugins.release.phase.ScmCommitPhaseTest
Tests run: 10, Failures: 0, Errors: 0, Skipped: 0, Time elapsed: 1.853 sec
Running org.apache.maven.plugins.release.CleanReleaseMojoTest
Tests run: 1, Failures: 0, Errors: 0, Skipped: 0, Time elapsed: 0.472 sec
Running org.apache.maven.plugins.release.scm.DefaultScmRepositoryConfiguratorTest
Tests run: 8, Failures: 0, Errors: 0, Skipped: 0, Time elapsed: 0.459 sec
Running org.apache.maven.plugins.release.versions.DefaultVersionInfoTest
Tests run: 23, Failures: 0, Errors: 0, Skipped: 0, Time elapsed: 1.419 sec
Running org.apache.maven.plugins.release.phase.ScmTagPhaseTest
Tests run: 9, Failures: 0, Errors: 0, Skipped: 0, Time elapsed: 1.385 sec
Running org.apache.maven.plugins.release.phase.CheckPomPhaseTest
Tests run: 7, Failures: 0, Errors: 0, Skipped: 0, Time elapsed: 0.345 sec
Running org.apache.maven.plugins.release.DefaultReleaseManagerTest
Tests run: 25, Failures: 0, Errors: 0, Skipped: 0, Time elapsed: 3.568 sec
Running org.apache.maven.plugins.release.exec.CommandLineFactoryTest
Tests run: 1, Failures: 0, Errors: 0, Skipped: 0, Time elapsed: 0.068 sec
Running org.apache.maven.plugins.release.phase.CheckDependencySnapshotsPhaseTest
Tests run: 26, Failures: 0, Errors: 0, Skipped: 0, Time elapsed: 2.189 sec
Running org.apache.maven.plugins.release.phase.MapVersionsPhaseTest
Tests run: 7, Failures: 0, Errors: 0, Skipped: 0, Time elapsed: 0.36 sec
Running org.apache.maven.plugins.release.config.ReleaseConfigurationTest
Tests run: 5, Failures: 0, Errors: 0, Skipped: 0, Time elapsed: 0.025 sec
Running org.apache.maven.plugins.release.PrepareReleaseMojoTest
Tests run: 3, Failures: 0, Errors: 0, Skipped: 0, Time elapsed: 2.126 sec
Running org.apache.maven.plugins.release.exec.TeeConsumerTest
Tests run: 1, Failures: 0, Errors: 0, Skipped: 0, Time elapsed: 0.002 sec
Running org.apache.maven.plugins.release.PerformReleaseMojoTest
Tests run: 6, Failures: 0, Errors: 1, Skipped: 0, Time elapsed: 4.772 sec <<< FAILURE!
Running org.apache.maven.plugins.release.phase.InputVariablesPhaseTest
Tests run: 6, Failures: 0, Errors: 0, Skipped: 0, Time elapsed: 0.281 sec
Running org.apache.maven.plugins.release.phase.EndReleasePhaseTest
Tests run: 2, Failures: 0, Errors: 0, Skipped: 0, Time elapsed: 0.09 sec
Running org.apache.maven.plugins.release.phase.ScmCheckModificationsPhaseTest
Tests run: 8, Failures: 0, Errors: 0, Skipped: 0, Time elapsed: 0.445 sec
Running org.apache.maven.plugins.release.phase.RewritePomsForReleasePhaseTest
Tests run: 33, Failures: 0, Errors: 0, Skipped: 0, Time elapsed: 2.953 sec
Running org.apache.maven.plugins.release.phase.RunGoalsPhaseTest
Tests run: 5, Failures: 0, Errors: 0, Skipped: 0, Time elapsed: 0.322 sec

Results :
Tests run: 238, Failures: 0, Errors: 1, Skipped: 0

[INFO] ------------------------------------------------------------------------
[ERROR] BUILD FAILURE
[INFO] ------------------------------------------------------------------------
[INFO] There are test failures.
[INFO] ------------------------------------------------------------------------
[INFO] For more information, run Maven with the -e switch
[INFO] ------------------------------------------------------------------------
[INFO] Total time: 51 seconds
[INFO] Finished at: Wed May 03 01:03:23 PDT 2006
[INFO] Final Memory: 16M/188M
[INFO] ------------------------------------------------------------------------

****************************************************************************



Mime
View raw message