maven-notifications mailing list archives

Site index · List index
Message view « Date » · « Thread »
Top « Date » · « Thread »
From Continuum Build Server <contin...@ci.codehaus.org>
Subject [continuum] BUILD FAILURE: Maven Release plugin
Date Tue, 02 May 2006 15:33:17 GMT
Online report : http://ci.codehaus.org/continuum-maven/servlet/continuum/target/ProjectBuild.vm/view/ProjectBuild/id/54/buildId/2287
Build statistics:
  State: Failed
  Previous State: Ok
  Started at: Tue, 2 May 2006 08:32:50 -0700
  Finished at: Tue, 2 May 2006 08:33:17 -0700
  Total time: 26s
  Build Trigger: Schedule
  Exit code: 1
  Building machine hostname: cheddar.simulalabs.com
  Operating system : Linux(unknown)
  Java version : 1.5.0_03(Sun Microsystems Inc.)

Changes
         brett          [MRELEASE-98] rolling new components into the mojos
             /maven/plugins/trunk/maven-release-plugin/src/main/java/org/apache/maven/plugins/release/AbstractReleaseMojo.java
            /maven/plugins/trunk/maven-release-plugin/src/main/java/org/apache/maven/plugins/release/DefaultReleaseManager.java
            /maven/plugins/trunk/maven-release-plugin/src/main/java/org/apache/maven/plugins/release/PerformReleaseMojo.java
            /maven/plugins/trunk/maven-release-plugin/src/main/java/org/apache/maven/plugins/release/PrepareReleaseMojo.java
            /maven/plugins/trunk/maven-release-plugin/src/main/java/org/apache/maven/plugins/release/ReleaseManager.java
            /maven/plugins/trunk/maven-release-plugin/src/main/java/org/apache/maven/plugins/release/config/PropertiesReleaseConfigurationStore.java
            /maven/plugins/trunk/maven-release-plugin/src/main/java/org/apache/maven/plugins/release/config/ReleaseConfiguration.java
            /maven/plugins/trunk/maven-release-plugin/src/main/java/org/apache/maven/plugins/release/exec/ForkedMavenExecutor.java
            /maven/plugins/trunk/maven-release-plugin/src/main/java/org/apache/maven/plugins/release/exec/TeeConsumer.java
            /maven/plugins/trunk/maven-release-plugin/src/main/java/org/apache/maven/plugins/release/helpers
            /maven/plugins/trunk/maven-release-plugin/src/main/java/org/apache/maven/plugins/release/phase/AbstractRewritePomsPhase.java
            /maven/plugins/trunk/maven-release-plugin/src/main/java/org/apache/maven/plugins/release/phase/GenerateReleasePomsPhase.java
            /maven/plugins/trunk/maven-release-plugin/src/main/java/org/apache/maven/plugins/release/phase/RemoveReleasePomsPhase.java
            /maven/plugins/trunk/maven-release-plugin/src/main/java/org/apache/maven/plugins/release/phase/RunGoalsPhase.java
            /maven/plugins/trunk/maven-release-plugin/src/main/java/org/apache/maven/plugins/release/phase/ScmCheckModificationsPhase.java
            /maven/plugins/trunk/maven-release-plugin/src/main/java/org/apache/maven/plugins/release/phase/ScmCommitPhase.java
            /maven/plugins/trunk/maven-release-plugin/src/main/java/org/apache/maven/plugins/release/phase/ScmTagPhase.java
            /maven/plugins/trunk/maven-release-plugin/src/main/resources/META-INF/plexus/components.xml
            /maven/plugins/trunk/maven-release-plugin/src/test/java/org/apache/maven/plugins/release/PrepareReleaseMojoTest.java
            /maven/plugins/trunk/maven-release-plugin/src/test/java/org/apache/maven/plugins/release/config/PropertiesReleaseConfigurationStoreTest.java
            /maven/plugins/trunk/maven-release-plugin/src/test/java/org/apache/maven/plugins/release/phase/RewritePomsForReleasePhaseTest.java
            /maven/plugins/trunk/maven-release-plugin/src/test/resources/release.properties
           brett          [MRELEASE-98] clean up some items, add pom execution configurability
             /maven/plugins/trunk/maven-release-plugin/src/main/java/org/apache/maven/plugins/release/DefaultReleaseManager.java
            /maven/plugins/trunk/maven-release-plugin/src/main/java/org/apache/maven/plugins/release/PrepareReleaseMojo.java
            /maven/plugins/trunk/maven-release-plugin/src/main/java/org/apache/maven/plugins/release/exec/ForkedMavenExecutor.java
            /maven/plugins/trunk/maven-release-plugin/src/main/java/org/apache/maven/plugins/release/exec/MavenExecutor.java
            /maven/plugins/trunk/maven-release-plugin/src/main/java/org/apache/maven/plugins/release/phase/CheckPomPhase.java
            /maven/plugins/trunk/maven-release-plugin/src/main/java/org/apache/maven/plugins/release/phase/ScmCheckModificationsPhase.java
            /maven/plugins/trunk/maven-release-plugin/src/test/java/org/apache/maven/plugins/release/exec/ForkedMavenExecutorTest.java
           brett          [MRELEASE-98] split exception into failure and exception
             /maven/plugins/trunk/maven-release-plugin/src/main/java/org/apache/maven/plugins/release/DefaultReleaseManager.java
            /maven/plugins/trunk/maven-release-plugin/src/main/java/org/apache/maven/plugins/release/PerformReleaseMojo.java
            /maven/plugins/trunk/maven-release-plugin/src/main/java/org/apache/maven/plugins/release/PrepareReleaseMojo.java
            /maven/plugins/trunk/maven-release-plugin/src/main/java/org/apache/maven/plugins/release/ReleaseFailureException.java
            /maven/plugins/trunk/maven-release-plugin/src/main/java/org/apache/maven/plugins/release/ReleaseManager.java
            /maven/plugins/trunk/maven-release-plugin/src/main/java/org/apache/maven/plugins/release/phase/AbstractRewritePomsPhase.java
            /maven/plugins/trunk/maven-release-plugin/src/main/java/org/apache/maven/plugins/release/phase/CheckDependencySnapshotsPhase.java
            /maven/plugins/trunk/maven-release-plugin/src/main/java/org/apache/maven/plugins/release/phase/CheckPomPhase.java
            /maven/plugins/trunk/maven-release-plugin/src/main/java/org/apache/maven/plugins/release/phase/ReleasePhase.java
            /maven/plugins/trunk/maven-release-plugin/src/main/java/org/apache/maven/plugins/release/phase/ScmCheckModificationsPhase.java
            /maven/plugins/trunk/maven-release-plugin/src/main/java/org/apache/maven/plugins/release/phase/ScmCommitPhase.java
            /maven/plugins/trunk/maven-release-plugin/src/main/java/org/apache/maven/plugins/release/phase/ScmTagPhase.java
            /maven/plugins/trunk/maven-release-plugin/src/main/java/org/apache/maven/plugins/release/scm/ReleaseScmCommandException.java
            /maven/plugins/trunk/maven-release-plugin/src/main/java/org/apache/maven/plugins/release/scm/ReleaseScmRepositoryException.java
        
****************************************************************************
Output:
****************************************************************************
[INFO] Scanning for projects...
[INFO] ----------------------------------------------------------------------------
[INFO] Building Maven Release plugin
[INFO]    task-segment: [clean, install]
[INFO] ----------------------------------------------------------------------------
[INFO] [clean:clean]
[INFO] Deleting directory /home/continuum/continuum-maven/working-directory/54/target
[INFO] Deleting directory /home/continuum/continuum-maven/working-directory/54/target/classes
[INFO] Deleting directory /home/continuum/continuum-maven/working-directory/54/target/test-classes
[INFO] [plugin:descriptor]
[INFO] Using 2 extractors.
[INFO] Applying extractor for language: java
[INFO] Extractor for language: java found 2 mojo descriptors.
[INFO] Applying extractor for language: bsh
[INFO] Extractor for language: bsh found 0 mojo descriptors.
[INFO] [resources:resources]
[INFO] Using default encoding to copy filtered resources.
[INFO] [compiler:compile]
Compiling 40 source files to /home/continuum/continuum-maven/working-directory/54/target/classes
[INFO] [resources:testResources]
[INFO] Using default encoding to copy filtered resources.
[INFO] [compiler:testCompile]
Compiling 22 source files to /home/continuum/continuum-maven/working-directory/54/target/test-classes
[INFO] [surefire:test]
[INFO] Surefire report directory: /home/continuum/continuum-maven/working-directory/54/target/surefire-reports

-------------------------------------------------------
 T E S T S
-------------------------------------------------------
Running org.apache.maven.plugins.release.exec.ForkedMavenExecutorTest
[INFO] Executing: mockCommandline
[INFO] Executing: mockCommandline
[INFO] Executing: mockCommandline
[INFO] Executing: mockCommandline
Tests run: 4, Failures: 0, Errors: 0, Skipped: 0, Time elapsed: 0.937 sec
Running org.apache.maven.plugins.release.phase.RewritePomsForDevelopmentPhaseTest
Tests run: 31, Failures: 0, Errors: 8, Skipped: 0, Time elapsed: 3.61 sec <<< FAILURE!
Running org.apache.maven.plugins.release.phase.ScmCommitPhaseTest
Tests run: 10, Failures: 0, Errors: 2, Skipped: 0, Time elapsed: 0.492 sec <<< FAILURE!
Running org.apache.maven.plugins.release.config.PropertiesReleaseConfigurationStoreTest
Tests run: 8, Failures: 0, Errors: 0, Skipped: 0, Time elapsed: 0.348 sec
Running org.apache.maven.plugins.release.scm.DefaultScmRepositoryConfiguratorTest
Tests run: 8, Failures: 0, Errors: 0, Skipped: 0, Time elapsed: 0.353 sec
Running org.apache.maven.plugins.release.versions.DefaultVersionInfoTest
Tests run: 23, Failures: 0, Errors: 0, Skipped: 0, Time elapsed: 0.832 sec
Running org.apache.maven.plugins.release.phase.ScmTagPhaseTest
Tests run: 9, Failures: 0, Errors: 2, Skipped: 0, Time elapsed: 0.636 sec <<< FAILURE!
Running org.apache.maven.plugins.release.phase.CheckPomPhaseTest
Tests run: 3, Failures: 0, Errors: 2, Skipped: 0, Time elapsed: 0.11 sec <<< FAILURE!
Running org.apache.maven.plugins.release.DefaultReleaseManagerTest
Tests run: 11, Failures: 0, Errors: 0, Skipped: 0, Time elapsed: 1.063 sec
Running org.apache.maven.plugins.release.exec.CommandLineFactoryTest
Tests run: 1, Failures: 0, Errors: 0, Skipped: 0, Time elapsed: 0.064 sec
Running org.apache.maven.plugins.release.phase.CheckDependencySnapshotsPhaseTest
Tests run: 26, Failures: 0, Errors: 11, Skipped: 0, Time elapsed: 1.679 sec <<< FAILURE!
Running org.apache.maven.plugins.release.phase.MapVersionsPhaseTest
Tests run: 7, Failures: 0, Errors: 0, Skipped: 0, Time elapsed: 0.282 sec
Running org.apache.maven.plugins.release.config.ReleaseConfigurationTest
Tests run: 3, Failures: 0, Errors: 0, Skipped: 0, Time elapsed: 0.001 sec
Running org.apache.maven.plugins.release.phase.InputVariablesPhaseTest
Tests run: 6, Failures: 0, Errors: 0, Skipped: 0, Time elapsed: 0.219 sec
Running org.apache.maven.plugins.release.phase.ScmCheckModificationsPhaseTest
Tests run: 8, Failures: 0, Errors: 2, Skipped: 0, Time elapsed: 0.312 sec <<< FAILURE!
Running org.apache.maven.plugins.release.phase.RewritePomsForReleasePhaseTest
Tests run: 31, Failures: 0, Errors: 8, Skipped: 0, Time elapsed: 2.865 sec <<< FAILURE!
Running org.apache.maven.plugins.release.phase.RunGoalsPhaseTest
Tests run: 5, Failures: 0, Errors: 0, Skipped: 0, Time elapsed: 0.211 sec

Results :
Tests run: 194, Failures: 0, Errors: 35, Skipped: 0

[INFO] ------------------------------------------------------------------------
[ERROR] BUILD FAILURE
[INFO] ------------------------------------------------------------------------
[INFO] There are test failures.
[INFO] ------------------------------------------------------------------------
[INFO] For more information, run Maven with the -e switch
[INFO] ------------------------------------------------------------------------
[INFO] Total time: 25 seconds
[INFO] Finished at: Tue May 02 08:33:17 PDT 2006
[INFO] Final Memory: 16M/177M
[INFO] ------------------------------------------------------------------------

****************************************************************************



Mime
View raw message