maven-notifications mailing list archives

Site index · List index
Message view « Date » · « Thread »
Top « Date » · « Thread »
From Continuum Build Server <contin...@ci.codehaus.org>
Subject [continuum] BUILD FAILURE: Maven Release plugin
Date Wed, 03 May 2006 04:47:16 GMT
Online report : http://ci.codehaus.org/continuum-maven/servlet/continuum/target/ProjectBuild.vm/view/ProjectBuild/id/54/buildId/2359
Build statistics:
  State: Failed
  Previous State: Ok
  Started at: Tue, 2 May 2006 21:46:50 -0700
  Finished at: Tue, 2 May 2006 21:47:16 -0700
  Total time: 25s
  Build Trigger: Schedule
  Exit code: 1
  Building machine hostname: cheddar.simulalabs.com
  Operating system : Linux(unknown)
  Java version : 1.5.0_03(Sun Microsystems Inc.)

Changes
         brett          [MRELEASE-98] configuration tests
             /maven/plugins/trunk/maven-release-plugin/src/test/java/org/apache/maven/plugins/release/config/PropertiesReleaseConfigurationStoreTest.java
            /maven/plugins/trunk/maven-release-plugin/src/test/java/org/apache/maven/plugins/release/config/ReleaseConfigurationTest.java
        
****************************************************************************
Output:
****************************************************************************
[INFO] Scanning for projects...
[INFO] ----------------------------------------------------------------------------
[INFO] Building Maven Release plugin
[INFO]    task-segment: [clean, install]
[INFO] ----------------------------------------------------------------------------
[INFO] [clean:clean]
[INFO] Deleting directory /home/continuum/continuum-maven/working-directory/54/target
[INFO] Deleting directory /home/continuum/continuum-maven/working-directory/54/target/classes
[INFO] Deleting directory /home/continuum/continuum-maven/working-directory/54/target/test-classes
[INFO] [plugin:descriptor]
[INFO] Using 2 extractors.
[INFO] Applying extractor for language: java
[INFO] Extractor for language: java found 3 mojo descriptors.
[INFO] Applying extractor for language: bsh
[INFO] Extractor for language: bsh found 0 mojo descriptors.
[INFO] [resources:resources]
[INFO] Using default encoding to copy filtered resources.
[INFO] [compiler:compile]
Compiling 43 source files to /home/continuum/continuum-maven/working-directory/54/target/classes
[INFO] [resources:testResources]
[INFO] Using default encoding to copy filtered resources.
[INFO] [compiler:testCompile]
Compiling 22 source files to /home/continuum/continuum-maven/working-directory/54/target/test-classes
[INFO] [surefire:test]
[INFO] Surefire report directory: /home/continuum/continuum-maven/working-directory/54/target/surefire-reports

-------------------------------------------------------
 T E S T S
-------------------------------------------------------
Running org.apache.maven.plugins.release.exec.ForkedMavenExecutorTest
Tests run: 4, Failures: 0, Errors: 0, Skipped: 0, Time elapsed: 1.668 sec
Running org.apache.maven.plugins.release.phase.RewritePomsForDevelopmentPhaseTest
Tests run: 31, Failures: 0, Errors: 0, Skipped: 0, Time elapsed: 3.908 sec
Running org.apache.maven.plugins.release.phase.ScmCommitPhaseTest
Tests run: 10, Failures: 0, Errors: 0, Skipped: 0, Time elapsed: 0.51 sec
Running org.apache.maven.plugins.release.config.PropertiesReleaseConfigurationStoreTest
Tests run: 10, Failures: 0, Errors: 0, Skipped: 0, Time elapsed: 0.41 sec
Running org.apache.maven.plugins.release.scm.DefaultScmRepositoryConfiguratorTest
Tests run: 8, Failures: 0, Errors: 0, Skipped: 0, Time elapsed: 0.303 sec
Running org.apache.maven.plugins.release.versions.DefaultVersionInfoTest
Tests run: 23, Failures: 0, Errors: 0, Skipped: 0, Time elapsed: 0.867 sec
Running org.apache.maven.plugins.release.phase.ScmTagPhaseTest
Tests run: 9, Failures: 0, Errors: 0, Skipped: 0, Time elapsed: 0.456 sec
Running org.apache.maven.plugins.release.phase.CheckPomPhaseTest
Tests run: 3, Failures: 0, Errors: 0, Skipped: 0, Time elapsed: 0.109 sec
Running org.apache.maven.plugins.release.DefaultReleaseManagerTest
Tests run: 11, Failures: 0, Errors: 0, Skipped: 0, Time elapsed: 1.088 sec
Running org.apache.maven.plugins.release.exec.CommandLineFactoryTest
Tests run: 1, Failures: 0, Errors: 0, Skipped: 0, Time elapsed: 0.067 sec
Running org.apache.maven.plugins.release.phase.CheckDependencySnapshotsPhaseTest
Tests run: 26, Failures: 0, Errors: 0, Skipped: 0, Time elapsed: 1.82 sec
Running org.apache.maven.plugins.release.phase.MapVersionsPhaseTest
Tests run: 7, Failures: 0, Errors: 0, Skipped: 0, Time elapsed: 0.355 sec
Running org.apache.maven.plugins.release.config.ReleaseConfigurationTest
Tests run: 5, Failures: 0, Errors: 1, Skipped: 0, Time elapsed: 0.01 sec <<< FAILURE!
Running org.apache.maven.plugins.release.phase.InputVariablesPhaseTest
Tests run: 6, Failures: 0, Errors: 0, Skipped: 0, Time elapsed: 0.231 sec
Running org.apache.maven.plugins.release.phase.ScmCheckModificationsPhaseTest
Tests run: 8, Failures: 0, Errors: 0, Skipped: 0, Time elapsed: 0.347 sec
Running org.apache.maven.plugins.release.phase.RewritePomsForReleasePhaseTest
Tests run: 31, Failures: 0, Errors: 0, Skipped: 0, Time elapsed: 2.464 sec
Running org.apache.maven.plugins.release.phase.RunGoalsPhaseTest
Tests run: 5, Failures: 0, Errors: 0, Skipped: 0, Time elapsed: 0.214 sec

Results :
Tests run: 198, Failures: 0, Errors: 1, Skipped: 0

[INFO] ------------------------------------------------------------------------
[ERROR] BUILD FAILURE
[INFO] ------------------------------------------------------------------------
[INFO] There are test failures.
[INFO] ------------------------------------------------------------------------
[INFO] For more information, run Maven with the -e switch
[INFO] ------------------------------------------------------------------------
[INFO] Total time: 24 seconds
[INFO] Finished at: Tue May 02 21:47:15 PDT 2006
[INFO] Final Memory: 16M/182M
[INFO] ------------------------------------------------------------------------

****************************************************************************



Mime
View raw message