maven-notifications mailing list archives

Site index · List index
Message view « Date » · « Thread »
Top « Date » · « Thread »
From Continuum Build Server <contin...@ci.codehaus.org>
Subject [continuum] BUILD FAILURE: Maven Release plugin
Date Tue, 09 May 2006 09:18:13 GMT
Online report : http://ci.codehaus.org/continuum-maven/servlet/continuum/target/ProjectBuild.vm/view/ProjectBuild/id/54/buildId/2994
Build statistics:
  State: Failed
  Previous State: Ok
  Started at: Tue, 9 May 2006 02:18:05 -0700
  Finished at: Tue, 9 May 2006 02:18:13 -0700
  Total time: 8s
  Build Trigger: Schedule
  Exit code: 1
  Building machine hostname: cheddar.simulalabs.com
  Operating system : Linux(unknown)
  Java version : 1.5.0_03(Sun Microsystems Inc.)

Changes
         brett          jaxen exclusions

             /maven/plugins/trunk/maven-release-plugin/pom.xml
        
****************************************************************************
Output:
****************************************************************************
[INFO] Scanning for projects...
[INFO] ----------------------------------------------------------------------------
[INFO] Building Maven Release plugin
[INFO]    task-segment: [clean, install]
[INFO] ----------------------------------------------------------------------------
[INFO] snapshot org.apache.maven.plugins:maven-surefire-plugin:2.2-SNAPSHOT: checking for
updates from snapshots
[INFO] snapshot org.apache.maven.plugins:maven-surefire-plugin:2.2-SNAPSHOT: checking for
updates from apache.snapshots
[INFO] [clean:clean]
[INFO] Deleting directory /home/continuum/continuum-maven/working-directory/54/target
[INFO] Deleting directory /home/continuum/continuum-maven/working-directory/54/target/classes
[INFO] Deleting directory /home/continuum/continuum-maven/working-directory/54/target/test-classes
[INFO] [plugin:descriptor]
[INFO] Using 2 extractors.
[INFO] Applying extractor for language: java
[INFO] Extractor for language: java found 3 mojo descriptors.
[INFO] Applying extractor for language: bsh
[INFO] Extractor for language: bsh found 0 mojo descriptors.
[INFO] [resources:resources]
[INFO] Using default encoding to copy filtered resources.
[INFO] [compiler:compile]
Compiling 44 source files to /home/continuum/continuum-maven/working-directory/54/target/classes
[INFO] ------------------------------------------------------------------------
[ERROR] BUILD FAILURE
[INFO] ------------------------------------------------------------------------
[INFO] Compilation failure

/home/continuum/continuum-maven/working-directory/54/src/main/java/org/apache/maven/plugins/release/phase/RewritePomsForDevelopmentPhase.java:[25,16]
package org.jdom does not exist

/home/continuum/continuum-maven/working-directory/54/src/main/java/org/apache/maven/plugins/release/phase/RewritePomsForDevelopmentPhase.java:[26,16]
package org.jdom does not exist

/home/continuum/continuum-maven/working-directory/54/src/main/java/org/apache/maven/plugins/release/phase/AbstractRewritePomsPhase.java:[41,16]
package org.jdom does not exist

/home/continuum/continuum-maven/working-directory/54/src/main/java/org/apache/maven/plugins/release/phase/AbstractRewritePomsPhase.java:[42,16]
package org.jdom does not exist

/home/continuum/continuum-maven/working-directory/54/src/main/java/org/apache/maven/plugins/release/phase/AbstractRewritePomsPhase.java:[43,16]
package org.jdom does not exist

/home/continuum/continuum-maven/working-directory/54/src/main/java/org/apache/maven/plugins/release/phase/AbstractRewritePomsPhase.java:[44,16]
package org.jdom does not exist

/home/continuum/continuum-maven/working-directory/54/src/main/java/org/apache/maven/plugins/release/phase/AbstractRewritePomsPhase.java:[45,16]
package org.jdom does not exist

/home/continuum/continuum-maven/working-directory/54/src/main/java/org/apache/maven/plugins/release/phase/AbstractRewritePomsPhase.java:[46,16]
package org.jdom does not exist

/home/continuum/continuum-maven/working-directory/54/src/main/java/org/apache/maven/plugins/release/phase/AbstractRewritePomsPhase.java:[47,23]
package org.jdom.filter does not exist

/home/continuum/continuum-maven/working-directory/54/src/main/java/org/apache/maven/plugins/release/phase/AbstractRewritePomsPhase.java:[48,23]
package org.jdom.filter does not exist

/home/continuum/continuum-maven/working-directory/54/src/main/java/org/apache/maven/plugins/release/phase/AbstractRewritePomsPhase.java:[49,22]
package org.jdom.input does not exist

/home/continuum/continuum-maven/working-directory/54/src/main/java/org/apache/maven/plugins/release/phase/AbstractRewritePomsPhase.java:[50,23]
package org.jdom.output does not exist

/home/continuum/continuum-maven/working-directory/54/src/main/java/org/apache/maven/plugins/release/phase/AbstractRewritePomsPhase.java:[51,23]
package org.jdom.output does not exist

/home/continuum/continuum-maven/working-directory/54/src/main/java/org/apache/maven/plugins/release/phase/AbstractRewritePomsPhase.java:[52,22]
package org.jdom.xpath does not exist

/home/continuum/continuum-maven/working-directory/54/src/main/java/org/apache/maven/plugins/release/phase/RewritePomsForDevelopmentPhase.java:[43,55]
cannot find symbol
symbol  : class Element
location: class org.apache.maven.plugins.release.phase.RewritePomsForDevelopmentPhase

/home/continuum/continuum-maven/working-directory/54/src/main/java/org/apache/maven/plugins/release/phase/RewritePomsForDevelopmentPhase.java:[43,76]
cannot find symbol
symbol  : class Namespace
location: class org.apache.maven.plugins.release.phase.RewritePomsForDevelopmentPhase

/home/continuum/continuum-maven/working-directory/54/src/main/java/org/apache/maven/plugins/release/phase/AbstractRewritePomsPhase.java:[179,39]
cannot find symbol
symbol  : class Document
location: class org.apache.maven.plugins.release.phase.AbstractRewritePomsPhase

/home/continuum/continuum-maven/working-directory/54/src/main/java/org/apache/maven/plugins/release/phase/AbstractRewritePomsPhase.java:[188,58]
cannot find symbol
symbol  : class Element
location: class org.apache.maven.plugins.release.phase.AbstractRewritePomsPhase

/home/continuum/continuum-maven/working-directory/54/src/main/java/org/apache/maven/plugins/release/phase/AbstractRewritePomsPhase.java:[247,33]
cannot find symbol
symbol  : class Element
location: class org.apache.maven.plugins.release.phase.AbstractRewritePomsPhase

/home/continuum/continuum-maven/working-directory/54/src/main/java/org/apache/maven/plugins/release/phase/AbstractRewritePomsPhase.java:[247,54]
cannot find symbol
symbol  : class Namespace
location: class org.apache.maven.plugins.release.phase.AbstractRewritePomsPhase

/home/continuum/continuum-maven/working-directory/54/src/main/java/org/apache/maven/plugins/release/phase/AbstractRewritePomsPhase.java:[278,56]
cannot find symbol
symbol  : class Element
location: class org.apache.maven.plugins.release.phase.AbstractRewritePomsPhase

/home/continuum/continuum-maven/working-directory/54/src/main/java/org/apache/maven/plugins/release/phase/AbstractRewritePomsPhase.java:[278,77]
cannot find symbol
symbol  : class Namespace
location: class org.apache.maven.plugins.release.phase.AbstractRewritePomsPhase

/home/continuum/continuum-maven/working-directory/54/src/main/java/org/apache/maven/plugins/release/phase/AbstractRewritePomsPhase.java:[305,57]
cannot find symbol
symbol  : class Element
location: class org.apache.maven.plugins.release.phase.AbstractRewritePomsPhase

/home/continuum/continuum-maven/working-directory/54/src/main/java/org/apache/maven/plugins/release/phase/AbstractRewritePomsPhase.java:[321,47]
cannot find symbol
symbol  : class Element
location: class org.apache.maven.plugins.release.phase.AbstractRewritePomsPhase

/home/continuum/continuum-maven/working-directory/54/src/main/java/org/apache/maven/plugins/release/phase/AbstractRewritePomsPhase.java:[341,53]
cannot find symbol
symbol  : class Element
location: class org.apache.maven.plugins.release.phase.AbstractRewritePomsPhase

/home/continuum/continuum-maven/working-directory/54/src/main/java/org/apache/maven/plugins/release/phase/AbstractRewritePomsPhase.java:[358,53]
cannot find symbol
symbol  : class Element
location: class org.apache.maven.plugins.release.phase.AbstractRewritePomsPhase

/home/continuum/continuum-maven/working-directory/54/src/main/java/org/apache/maven/plugins/release/phase/AbstractRewritePomsPhase.java:[379,94]
cannot find symbol
symbol  : class Element
location: class org.apache.maven.plugins.release.phase.AbstractRewritePomsPhase

/home/continuum/continuum-maven/working-directory/54/src/main/java/org/apache/maven/plugins/release/phase/AbstractRewritePomsPhase.java:[439,41]
cannot find symbol
symbol  : class Document
location: class org.apache.maven.plugins.release.phase.AbstractRewritePomsPhase

/home/continuum/continuum-maven/working-directory/54/src/main/java/org/apache/maven/plugins/release/phase/AbstractRewritePomsPhase.java:[465,41]
cannot find symbol
symbol  : class Document
location: class org.apache.maven.plugins.release.phase.AbstractRewritePomsPhase

/home/continuum/continuum-maven/working-directory/54/src/main/java/org/apache/maven/plugins/release/phase/AbstractRewritePomsPhase.java:[555,64]
cannot find symbol
symbol  : class Element
location: class org.apache.maven.plugins.release.phase.AbstractRewritePomsPhase

/home/continuum/continuum-maven/working-directory/54/src/main/java/org/apache/maven/plugins/release/phase/AbstractRewritePomsPhase.java:[555,85]
cannot find symbol
symbol  : class Namespace
location: class org.apache.maven.plugins.release.phase.AbstractRewritePomsPhase

/home/continuum/continuum-maven/working-directory/54/src/main/java/org/apache/maven/plugins/release/phase/AbstractRewritePomsPhase.java:[560,65]
cannot find symbol
symbol  : class Element
location: class org.apache.maven.plugins.release.phase.AbstractRewritePomsPhase

/home/continuum/continuum-maven/working-directory/54/src/main/java/org/apache/maven/plugins/release/phase/AbstractRewritePomsPhase.java:[560,79]
cannot find symbol
symbol  : class Namespace
location: class org.apache.maven.plugins.release.phase.AbstractRewritePomsPhase

/home/continuum/continuum-maven/working-directory/54/src/main/java/org/apache/maven/plugins/release/phase/AbstractRewritePomsPhase.java:[560,14]
cannot find symbol
symbol  : class Element
location: class org.apache.maven.plugins.release.phase.AbstractRewritePomsPhase

/home/continuum/continuum-maven/working-directory/54/src/main/java/org/apache/maven/plugins/release/phase/RewritePomsForReleasePhase.java:[25,16]
package org.jdom does not exist

/home/continuum/continuum-maven/working-directory/54/src/main/java/org/apache/maven/plugins/release/phase/RewritePomsForReleasePhase.java:[26,16]
package org.jdom does not exist

/home/continuum/continuum-maven/working-directory/54/src/main/java/org/apache/maven/plugins/release/phase/RewritePomsForReleasePhase.java:[43,55]
cannot find symbol
symbol  : class Element
location: class org.apache.maven.plugins.release.phase.RewritePomsForReleasePhase

/home/continuum/continuum-maven/working-directory/54/src/main/java/org/apache/maven/plugins/release/phase/RewritePomsForReleasePhase.java:[43,76]
cannot find symbol
symbol  : class Namespace
location: class org.apache.maven.plugins.release.phase.RewritePomsForReleasePhase

/home/continuum/continuum-maven/working-directory/54/src/main/java/org/apache/maven/plugins/release/phase/RewritePomsForReleasePhase.java:[83,99]
cannot find symbol
symbol  : class Element
location: class org.apache.maven.plugins.release.phase.RewritePomsForReleasePhase

/home/continuum/continuum-maven/working-directory/54/src/main/java/org/apache/maven/plugins/release/phase/RewritePomsForReleasePhase.java:[84,34]
cannot find symbol
symbol  : class Namespace
location: class org.apache.maven.plugins.release.phase.RewritePomsForReleasePhase

/home/continuum/continuum-maven/working-directory/54/src/main/java/org/apache/maven/plugins/release/phase/AbstractRewritePomsPhase.java:[109,8]
cannot find symbol
symbol  : class Document
location: class org.apache.maven.plugins.release.phase.AbstractRewritePomsPhase

/home/continuum/continuum-maven/working-directory/54/src/main/java/org/apache/maven/plugins/release/phase/AbstractRewritePomsPhase.java:[118,12]
cannot find symbol
symbol  : class SAXBuilder
location: class org.apache.maven.plugins.release.phase.AbstractRewritePomsPhase

/home/continuum/continuum-maven/working-directory/54/src/main/java/org/apache/maven/plugins/release/phase/AbstractRewritePomsPhase.java:[118,37]
cannot find symbol
symbol  : class SAXBuilder
location: class org.apache.maven.plugins.release.phase.AbstractRewritePomsPhase

/home/continuum/continuum-maven/working-directory/54/src/main/java/org/apache/maven/plugins/release/phase/AbstractRewritePomsPhase.java:[126,12]
cannot find symbol
symbol  : class Format
location: class org.apache.maven.plugins.release.phase.AbstractRewritePomsPhase

/home/continuum/continuum-maven/working-directory/54/src/main/java/org/apache/maven/plugins/release/phase/AbstractRewritePomsPhase.java:[126,28]
cannot find symbol
symbol  : variable Format
location: class org.apache.maven.plugins.release.phase.AbstractRewritePomsPhase

/home/continuum/continuum-maven/working-directory/54/src/main/java/org/apache/maven/plugins/release/phase/AbstractRewritePomsPhase.java:[128,12]
cannot find symbol
symbol  : class XMLOutputter
location: class org.apache.maven.plugins.release.phase.AbstractRewritePomsPhase

/home/continuum/continuum-maven/working-directory/54/src/main/java/org/apache/maven/plugins/release/phase/AbstractRewritePomsPhase.java:[128,35]
cannot find symbol
symbol  : class XMLOutputter
location: class org.apache.maven.plugins.release.phase.AbstractRewritePomsPhase

/home/continuum/continuum-maven/working-directory/54/src/main/java/org/apache/maven/plugins/release/phase/AbstractRewritePomsPhase.java:[138,16]
cannot find symbol
symbol  : class JDOMException
location: class org.apache.maven.plugins.release.phase.AbstractRewritePomsPhase

/home/continuum/continuum-maven/working-directory/54/src/main/java/org/apache/maven/plugins/release/phase/AbstractRewritePomsPhase.java:[181,56]
cannot find symbol
symbol  : class ContentFilter
location: class org.apache.maven.plugins.release.phase.AbstractRewritePomsPhase

/home/continuum/continuum-maven/working-directory/54/src/main/java/org/apache/maven/plugins/release/phase/AbstractRewritePomsPhase.java:[181,71]
cannot find symbol
symbol  : variable ContentFilter
location: class org.apache.maven.plugins.release.phase.AbstractRewritePomsPhase

/home/continuum/continuum-maven/working-directory/54/src/main/java/org/apache/maven/plugins/release/phase/AbstractRewritePomsPhase.java:[183,12]
cannot find symbol
symbol  : class Comment
location: class org.apache.maven.plugins.release.phase.AbstractRewritePomsPhase

/home/continuum/continuum-maven/working-directory/54/src/main/java/org/apache/maven/plugins/release/phase/AbstractRewritePomsPhase.java:[183,25]
cannot find symbol
symbol  : class Comment
location: class org.apache.maven.plugins.release.phase.AbstractRewritePomsPhase

/home/continuum/continuum-maven/working-directory/54/src/main/java/org/apache/maven/plugins/release/phase/AbstractRewritePomsPhase.java:[192,8]
cannot find symbol
symbol  : class Namespace
location: class org.apache.maven.plugins.release.phase.AbstractRewritePomsPhase

/home/continuum/continuum-maven/working-directory/54/src/main/java/org/apache/maven/plugins/release/phase/AbstractRewritePomsPhase.java:[206,12]
cannot find symbol
symbol  : class Element
location: class org.apache.maven.plugins.release.phase.AbstractRewritePomsPhase

/home/continuum/continuum-maven/working-directory/54/src/main/java/org/apache/maven/plugins/release/phase/AbstractRewritePomsPhase.java:[216,12]
cannot find symbol
symbol  : class Element
location: class org.apache.maven.plugins.release.phase.AbstractRewritePomsPhase

/home/continuum/continuum-maven/working-directory/54/src/main/java/org/apache/maven/plugins/release/phase/AbstractRewritePomsPhase.java:[222,20]
cannot find symbol
symbol  : class Element
location: class org.apache.maven.plugins.release.phase.AbstractRewritePomsPhase

/home/continuum/continuum-maven/working-directory/54/src/main/java/org/apache/maven/plugins/release/phase/AbstractRewritePomsPhase.java:[236,12]
cannot find symbol
symbol  : class Element
location: class org.apache.maven.plugins.release.phase.AbstractRewritePomsPhase

/home/continuum/continuum-maven/working-directory/54/src/main/java/org/apache/maven/plugins/release/phase/AbstractRewritePomsPhase.java:[251,8]
cannot find symbol
symbol  : class Element
location: class org.apache.maven.plugins.release.phase.AbstractRewritePomsPhase

/home/continuum/continuum-maven/working-directory/54/src/main/java/org/apache/maven/plugins/release/phase/AbstractRewritePomsPhase.java:[263,16]
cannot find symbol
symbol  : class Element
location: class org.apache.maven.plugins.release.phase.AbstractRewritePomsPhase

/home/continuum/continuum-maven/working-directory/54/src/main/java/org/apache/maven/plugins/release/phase/AbstractRewritePomsPhase.java:[266,37]
cannot find symbol
symbol  : class Element
location: class org.apache.maven.plugins.release.phase.AbstractRewritePomsPhase

/home/continuum/continuum-maven/working-directory/54/src/main/java/org/apache/maven/plugins/release/phase/AbstractRewritePomsPhase.java:[268,55]
cannot find symbol
symbol  : class Text
location: class org.apache.maven.plugins.release.phase.AbstractRewritePomsPhase

/home/continuum/continuum-maven/working-directory/54/src/main/java/org/apache/maven/plugins/release/phase/AbstractRewritePomsPhase.java:[285,12]
cannot find symbol
symbol  : class Element
location: class org.apache.maven.plugins.release.phase.AbstractRewritePomsPhase

/home/continuum/continuum-maven/working-directory/54/src/main/java/org/apache/maven/plugins/release/phase/AbstractRewritePomsPhase.java:[286,12]
cannot find symbol
symbol  : class Element
location: class org.apache.maven.plugins.release.phase.AbstractRewritePomsPhase

/home/continuum/continuum-maven/working-directory/54/src/main/java/org/apache/maven/plugins/release/phase/AbstractRewritePomsPhase.java:[395,20]
cannot find symbol
symbol  : class XPath
location: class org.apache.maven.plugins.release.phase.AbstractRewritePomsPhase

/home/continuum/continuum-maven/working-directory/54/src/main/java/org/apache/maven/plugins/release/phase/AbstractRewritePomsPhase.java:[398,32]
cannot find symbol
symbol  : variable XPath
location: class org.apache.maven.plugins.release.phase.AbstractRewritePomsPhase

/home/continuum/continuum-maven/working-directory/54/src/main/java/org/apache/maven/plugins/release/phase/AbstractRewritePomsPhase.java:[404,32]
cannot find symbol
symbol  : variable XPath
location: class org.apache.maven.plugins.release.phase.AbstractRewritePomsPhase

/home/continuum/continuum-maven/working-directory/54/src/main/java/org/apache/maven/plugins/release/phase/AbstractRewritePomsPhase.java:[408,20]
cannot find symbol
symbol  : class Element
location: class org.apache.maven.plugins.release.phase.AbstractRewritePomsPhase

/home/continuum/continuum-maven/working-directory/54/src/main/java/org/apache/maven/plugins/release/phase/AbstractRewritePomsPhase.java:[408,42]
cannot find symbol
symbol  : class Element
location: class org.apache.maven.plugins.release.phase.AbstractRewritePomsPhase

/home/continuum/continuum-maven/working-directory/54/src/main/java/org/apache/maven/plugins/release/phase/AbstractRewritePomsPhase.java:[412,24]
cannot find symbol
symbol  : class Element
location: class org.apache.maven.plugins.release.phase.AbstractRewritePomsPhase

/home/continuum/continuum-maven/working-directory/54/src/main/java/org/apache/maven/plugins/release/phase/AbstractRewritePomsPhase.java:[426,24]
cannot find symbol
symbol  : class JDOMException
location: class org.apache.maven.plugins.release.phase.AbstractRewritePomsPhase

/home/continuum/continuum-maven/working-directory/54/src/main/java/org/apache/maven/plugins/release/phase/AbstractRewritePomsPhase.java:[469,8]
cannot find symbol
symbol  : class Element
location: class org.apache.maven.plugins.release.phase.AbstractRewritePomsPhase

/home/continuum/continuum-maven/working-directory/54/src/main/java/org/apache/maven/plugins/release/phase/AbstractRewritePomsPhase.java:[473,12]
cannot find symbol
symbol  : class Namespace
location: class org.apache.maven.plugins.release.phase.AbstractRewritePomsPhase

/home/continuum/continuum-maven/working-directory/54/src/main/java/org/apache/maven/plugins/release/phase/AbstractRewritePomsPhase.java:[473,37]
cannot find symbol
symbol  : variable Namespace
location: class org.apache.maven.plugins.release.phase.AbstractRewritePomsPhase

/home/continuum/continuum-maven/working-directory/54/src/main/java/org/apache/maven/plugins/release/phase/AbstractRewritePomsPhase.java:[475,12]
cannot find symbol
symbol  : class Namespace
location: class org.apache.maven.plugins.release.phase.AbstractRewritePomsPhase

/home/continuum/continuum-maven/working-directory/54/src/main/java/org/apache/maven/plugins/release/phase/AbstractRewritePomsPhase.java:[475,37]
cannot find symbol
symbol  : variable Namespace
location: class org.apache.maven.plugins.release.phase.AbstractRewritePomsPhase

/home/continuum/continuum-maven/working-directory/54/src/main/java/org/apache/maven/plugins/release/phase/AbstractRewritePomsPhase.java:[485,12]
cannot find symbol
symbol  : class ElementFilter
location: class org.apache.maven.plugins.release.phase.AbstractRewritePomsPhase

/home/continuum/continuum-maven/working-directory/54/src/main/java/org/apache/maven/plugins/release/phase/AbstractRewritePomsPhase.java:[485,46]
cannot find symbol
symbol  : class ElementFilter
location: class org.apache.maven.plugins.release.phase.AbstractRewritePomsPhase

/home/continuum/continuum-maven/working-directory/54/src/main/java/org/apache/maven/plugins/release/phase/AbstractRewritePomsPhase.java:[485,61]
cannot find symbol
symbol  : variable Namespace
location: class org.apache.maven.plugins.release.phase.AbstractRewritePomsPhase

/home/continuum/continuum-maven/working-directory/54/src/main/java/org/apache/maven/plugins/release/phase/AbstractRewritePomsPhase.java:[488,16]
cannot find symbol
symbol  : class Element
location: class org.apache.maven.plugins.release.phase.AbstractRewritePomsPhase

/home/continuum/continuum-maven/working-directory/54/src/main/java/org/apache/maven/plugins/release/phase/AbstractRewritePomsPhase.java:[488,29]
cannot find symbol
symbol  : class Element
location: class org.apache.maven.plugins.release.phase.AbstractRewritePomsPhase

/home/continuum/continuum-maven/working-directory/54/src/main/java/org/apache/maven/plugins/release/phase/AbstractRewritePomsPhase.java:[505,12]
cannot find symbol
symbol  : class Format
location: class org.apache.maven.plugins.release.phase.AbstractRewritePomsPhase

/home/continuum/continuum-maven/working-directory/54/src/main/java/org/apache/maven/plugins/release/phase/AbstractRewritePomsPhase.java:[505,28]
cannot find symbol
symbol  : variable Format
location: class org.apache.maven.plugins.release.phase.AbstractRewritePomsPhase

/home/continuum/continuum-maven/working-directory/54/src/main/java/org/apache/maven/plugins/release/phase/AbstractRewritePomsPhase.java:[507,12]
cannot find symbol
symbol  : class XMLOutputter
location: class org.apache.maven.plugins.release.phase.AbstractRewritePomsPhase

/home/continuum/continuum-maven/working-directory/54/src/main/java/org/apache/maven/plugins/release/phase/AbstractRewritePomsPhase.java:[507,35]
cannot find symbol
symbol  : class XMLOutputter
location: class org.apache.maven.plugins.release.phase.AbstractRewritePomsPhase

/home/continuum/continuum-maven/working-directory/54/src/main/java/org/apache/maven/plugins/release/phase/AbstractRewritePomsPhase.java:[562,8]
cannot find symbol
symbol  : class Element
location: class org.apache.maven.plugins.release.phase.AbstractRewritePomsPhase

/home/continuum/continuum-maven/working-directory/54/src/main/java/org/apache/maven/plugins/release/phase/AbstractRewritePomsPhase.java:[575,57]
cannot find symbol
symbol  : class Text
location: class org.apache.maven.plugins.release.phase.AbstractRewritePomsPhase

/home/continuum/continuum-maven/working-directory/54/src/main/java/org/apache/maven/plugins/release/phase/AbstractRewritePomsPhase.java:[590,16]
cannot find symbol
symbol  : class Element
location: class org.apache.maven.plugins.release.phase.AbstractRewritePomsPhase

/home/continuum/continuum-maven/working-directory/54/src/main/java/org/apache/maven/plugins/release/phase/AbstractRewritePomsPhase.java:[590,38]
cannot find symbol
symbol  : class Element
location: class org.apache.maven.plugins.release.phase.AbstractRewritePomsPhase

/home/continuum/continuum-maven/working-directory/54/src/main/java/org/apache/maven/plugins/release/phase/RewritePomsForDevelopmentPhase.java:[51,12]
cannot find symbol
symbol  : class Element
location: class org.apache.maven.plugins.release.phase.RewritePomsForDevelopmentPhase

/home/continuum/continuum-maven/working-directory/54/src/main/java/org/apache/maven/plugins/release/phase/RewritePomsForReleasePhase.java:[50,12]
cannot find symbol
symbol  : class Element
location: class org.apache.maven.plugins.release.phase.RewritePomsForReleasePhase

/home/continuum/continuum-maven/working-directory/54/src/main/java/org/apache/maven/plugins/release/phase/RewritePomsForReleasePhase.java:[70,38]
cannot find symbol
symbol  : class Element
location: class org.apache.maven.plugins.release.phase.RewritePomsForReleasePhase


[INFO] ------------------------------------------------------------------------
[INFO] For more information, run Maven with the -e switch
[INFO] ------------------------------------------------------------------------
[INFO] Total time: 7 seconds
[INFO] Finished at: Tue May 09 02:18:13 PDT 2006
[INFO] Final Memory: 13M/156M
[INFO] ------------------------------------------------------------------------

****************************************************************************



Mime
View raw message