maven-notifications mailing list archives

Site index · List index
Message view « Date » · « Thread »
Top « Date » · « Thread »
From Continuum Build Server <contin...@ci.codehaus.org>
Subject [continuum] BUILD SUCCESSFUL: Maven Eclipse Plugin
Date Thu, 20 Jul 2006 22:07:04 GMT
Online report : http://ci.codehaus.org/continuum-maven/servlet/continuum/target/ProjectBuild.vm/view/ProjectBuild/id/41/buildId/6824
Build statistics:
  State: Ok
  Previous State: Failed
  Started at: Thu, 20 Jul 2006 15:04:28 -0700
  Finished at: Thu, 20 Jul 2006 15:07:04 -0700
  Total time: 2m 35s
  Build Trigger: Schedule
  Exit code: 0
  Building machine hostname: cheddar.simulalabs.com
  Operating system : Linux(unknown)
  Java version : 1.5.0_03(Sun Microsystems Inc.)

Changes
         fgiust          time to refactor the writers, begin by creating a configuration holder passed through all the writers
             /maven/plugins/trunk/maven-eclipse-plugin/src/main/java/org/apache/maven/plugin/eclipse/EclipsePlugin.java
            /maven/plugins/trunk/maven-eclipse-plugin/src/main/java/org/apache/maven/plugin/eclipse/writers/AbstractEclipseResourceWriter.java
            /maven/plugins/trunk/maven-eclipse-plugin/src/main/java/org/apache/maven/plugin/eclipse/writers/AbstractEclipseWriter.java
            /maven/plugins/trunk/maven-eclipse-plugin/src/main/java/org/apache/maven/plugin/eclipse/writers/AbstractWtpResourceWriter.java
            /maven/plugins/trunk/maven-eclipse-plugin/src/main/java/org/apache/maven/plugin/eclipse/writers/EclipseClasspathWriter.java
            /maven/plugins/trunk/maven-eclipse-plugin/src/main/java/org/apache/maven/plugin/eclipse/writers/EclipseOSGiManifestWriter.java
            /maven/plugins/trunk/maven-eclipse-plugin/src/main/java/org/apache/maven/plugin/eclipse/writers/EclipseProjectWriter.java
            /maven/plugins/trunk/maven-eclipse-plugin/src/main/java/org/apache/maven/plugin/eclipse/writers/EclipseSettingsWriter.java
            /maven/plugins/trunk/maven-eclipse-plugin/src/main/java/org/apache/maven/plugin/eclipse/writers/EclipseWriter.java
            /maven/plugins/trunk/maven-eclipse-plugin/src/main/java/org/apache/maven/plugin/eclipse/writers/EclipseWriterConfig.java
            /maven/plugins/trunk/maven-eclipse-plugin/src/main/java/org/apache/maven/plugin/eclipse/writers/EclipseWtpComponent15Writer.java
            /maven/plugins/trunk/maven-eclipse-plugin/src/main/java/org/apache/maven/plugin/eclipse/writers/EclipseWtpComponentWriter.java
            /maven/plugins/trunk/maven-eclipse-plugin/src/main/java/org/apache/maven/plugin/eclipse/writers/EclipseWtpFacetsWriter.java
            /maven/plugins/trunk/maven-eclipse-plugin/src/main/java/org/apache/maven/plugin/eclipse/writers/EclipseWtpmodulesWriter.java
           fgiust          don't add project references for plugins
             /maven/plugins/trunk/maven-eclipse-plugin/src/main/java/org/apache/maven/plugin/eclipse/writers/EclipseProjectWriter.java
           fgiust          handle context-root element changed in WTP 1.5
             /maven/plugins/trunk/maven-eclipse-plugin/src/main/java/org/apache/maven/plugin/eclipse/writers/EclipseWtpComponent15Writer.java
            /maven/plugins/trunk/maven-eclipse-plugin/src/main/java/org/apache/maven/plugin/eclipse/writers/EclipseWtpComponentWriter.java
            /maven/plugins/trunk/maven-eclipse-plugin/src/test/resources/projects/project-20/org.eclipse.wst.common.component
            /maven/plugins/trunk/maven-eclipse-plugin/src/test/resources/projects/project-20/pom.xml
           fgiust          better handling of wtp version, fix builders/natures for WTP 1.5
             /maven/plugins/trunk/maven-eclipse-plugin/src/main/java/org/apache/maven/plugin/eclipse/EclipsePlugin.java
            /maven/plugins/trunk/maven-eclipse-plugin/src/test/resources/projects/project-20/project
        
****************************************************************************
Output:
****************************************************************************
[INFO] Scanning for projects...
[INFO] ----------------------------------------------------------------------------
[INFO] Building Maven Eclipse Plugin
[INFO]    task-segment: [clean, install]
[INFO] ----------------------------------------------------------------------------
[INFO] [clean:clean]
[INFO] Deleting directory /home/continuum/continuum-maven/working-directory/41/target
[INFO] Deleting directory /home/continuum/continuum-maven/working-directory/41/target/classes
[INFO] Deleting directory /home/continuum/continuum-maven/working-directory/41/target/test-classes
[INFO] [plugin:descriptor]
[INFO] Using 2 extractors.
[INFO] Applying extractor for language: java
[INFO] Extractor for language: java found 3 mojo descriptors.
[INFO] Applying extractor for language: bsh
[INFO] Extractor for language: bsh found 0 mojo descriptors.
[INFO] [resources:resources]
[INFO] Using default encoding to copy filtered resources.
[INFO] [compiler:compile]
Compiling 21 source files to /home/continuum/continuum-maven/working-directory/41/target/classes
[INFO] [resources:testResources]
[INFO] Using default encoding to copy filtered resources.
[INFO] [compiler:testCompile]
Compiling 4 source files to /home/continuum/continuum-maven/working-directory/41/target/test-classes
[INFO] [surefire:test]
[INFO] Surefire report directory: /home/continuum/continuum-maven/working-directory/41/target/surefire-reports

-------------------------------------------------------
 T E S T S
-------------------------------------------------------
Running org.apache.maven.plugin.eclipse.AddMavenRepoMojoTest
Tests run: 1, Failures: 0, Errors: 0, Skipped: 0, Time elapsed: 1.234 sec
Running org.apache.maven.plugin.eclipse.EclipsePluginTest
[ maven embedder INFO] ----------------------------------------------------------------------------
[ maven embedder INFO] Building Maven
[ maven embedder INFO]    task-segment: [org.apache.maven.plugins:maven-eclipse-plugin:clean, org.apache.maven.plugins:maven-eclipse-plugin:eclipse]
[ maven embedder INFO] ----------------------------------------------------------------------------
[ maven embedder INFO] artifact org.apache.maven.plugins:maven-eclipse-plugin: checking for updates from central
Downloading: http://repo1.maven.org/maven2/org/apache/maven/plugins/maven-eclipse-plugin/2.2/maven-eclipse-plugin-2.2.pom
2/2K
2K downloaded
Downloading: http://repo1.maven.org/maven2/org/apache/maven/plugins/maven-plugins/1/maven-plugins-1.pom
3/3K
3K downloaded
Downloading: http://repo1.maven.org/maven2/org/apache/maven/maven-parent/1/maven-parent-1.pom
3/6K
6/6K
6K downloaded
Downloading: http://repo1.maven.org/maven2/org/apache/apache/1/apache-1.pom
3/3K
3K downloaded
Downloading: http://repo1.maven.org/maven2/org/apache/maven/plugins/maven-eclipse-plugin/2.2/maven-eclipse-plugin-2.2.jar
3/47K
6/47K
7/47K
9/47K
10/47K
11/47K
15/47K
19/47K
21/47K
23/47K
27/47K
31/47K
35/47K
39/47K
41/47K
42/47K
43/47K
45/47K
47/47K
47K downloaded
Downloading: http://repo1.maven.org/maven2/org/apache/maven/maven-project/2.0.1/maven-project-2.0.1.pom
1/1K
1K downloaded
Downloading: http://repo1.maven.org/maven2/org/apache/maven/maven/2.0.1/maven-2.0.1.pom
1/11K
2/11K
3/11K
5/11K
7/11K
9/11K
11/11K
11K downloaded
Downloading: http://repo1.maven.org/maven2/org/apache/maven/maven-model/2.0.1/maven-model-2.0.1.pom
1/2K
2/2K
2K downloaded
Downloading: http://repo1.maven.org/maven2/org/codehaus/plexus/plexus-utils/1.0.5/plexus-utils-1.0.5.pom
918/918b
918b downloaded
Downloading: http://repo1.maven.org/maven2/org/codehaus/plexus/plexus/1.0.4/plexus-1.0.4.pom
4/5K
5/5K
5K downloaded
Downloading: http://repo1.maven.org/maven2/classworlds/classworlds/1.1-alpha-2/classworlds-1.1-alpha-2.pom
3/3K
3K downloaded
Downloading: http://repo1.maven.org/maven2/org/apache/maven/maven-profile/2.0.1/maven-profile-2.0.1.pom
1/1K
1K downloaded
Downloading: http://repo1.maven.org/maven2/org/codehaus/plexus/plexus-container-default/1.0-alpha-9/plexus-container-default-1.0-alpha-9.pom
1/1K
1K downloaded
Downloading: http://repo1.maven.org/maven2/org/codehaus/plexus/plexus-containers/1.0.3/plexus-containers-1.0.3.pom
492/492b
492b downloaded
Downloading: http://repo1.maven.org/maven2/org/codehaus/plexus/plexus-utils/1.0.4/plexus-utils-1.0.4.pom
2/6K
3/6K
6/6K
6K downloaded
Downloading: http://repo1.maven.org/maven2/junit/junit/3.8.1/junit-3.8.1.pom
145/145b
145b downloaded
Downloading: http://repo1.maven.org/maven2/org/apache/maven/maven-artifact-manager/2.0.1/maven-artifact-manager-2.0.1.pom
1/1K
1K downloaded
Downloading: http://repo1.maven.org/maven2/org/apache/maven/maven-repository-metadata/2.0.1/maven-repository-metadata-2.0.1.pom
1/1K
1K downloaded
Downloading: http://repo1.maven.org/maven2/org/apache/maven/wagon/wagon-provider-api/1.0-alpha-5/wagon-provider-api-1.0-alpha-5.pom
2/4K
4/4K
4K downloaded
Downloading: http://repo1.maven.org/maven2/org/apache/maven/maven-artifact/2.0.1/maven-artifact-2.0.1.pom
765/765b
765b downloaded
Downloading: http://repo1.maven.org/maven2/org/apache/maven/maven-plugin-api/2.0.1/maven-plugin-api-2.0.1.pom
643/643b
643b downloaded
[ maven embedder INFO] [eclipse:clean]
[ maven embedder INFO] Deleting file: .project
[ maven embedder INFO] Deleting file: .classpath
[ maven embedder INFO] Deleting file: .wtpmodules
[ maven embedder INFO] Deleting file: .component
[ maven embedder INFO] Deleting file: org.eclipse.wst.common.component
[ maven embedder INFO] Deleting file: org.eclipse.wst.common.project.facet.core.xml
[ maven embedder INFO] Preparing eclipse:eclipse
[ maven embedder INFO] No goals needed for project - skipping
[ maven embedder INFO] [eclipse:eclipse]
[ maven embedder INFO] Adding support for WTP version R7.
[ maven embedder INFO] Not writing settings - defaults suffice
[ maven embedder INFO] Wrote Eclipse project for "maven-eclipse-plugin-test-project-1" to /home/continuum/continuum-maven/working-directory/41/target/test-classes/projects/project-1.
[ maven embedder INFO] ----------------------------------------------------------------------------
[ maven embedder INFO] Building Maven
[ maven embedder INFO]    task-segment: [org.apache.maven.plugins:maven-eclipse-plugin:clean, org.apache.maven.plugins:maven-eclipse-plugin:eclipse]
[ maven embedder INFO] ----------------------------------------------------------------------------
[ maven embedder INFO] [eclipse:clean]
[ maven embedder INFO] Deleting file: .project
[ maven embedder INFO] Deleting file: .classpath
[ maven embedder INFO] Deleting file: .wtpmodules
[ maven embedder INFO] Deleting file: .component
[ maven embedder INFO] Deleting file: org.eclipse.wst.common.component
[ maven embedder INFO] Deleting file: org.eclipse.wst.common.project.facet.core.xml
[ maven embedder INFO] Preparing eclipse:eclipse
[ maven embedder INFO] artifact org.apache.maven.plugins:maven-compiler-plugin: checking for updates from central
Downloading: http://repo1.maven.org/maven2/org/apache/maven/plugins/maven-compiler-plugin/2.0.1/maven-compiler-plugin-2.0.1.pom
1/1K
1K downloaded
Downloading: http://repo1.maven.org/maven2/org/apache/maven/plugins/maven-compiler-plugin/2.0.1/maven-compiler-plugin-2.0.1.jar
3/14K
5/14K
6/14K
7/14K
9/14K
10/14K
12/14K
13/14K
14/14K
14K downloaded
[ maven embedder INFO] No goals needed for project - skipping
[ maven embedder INFO] [eclipse:eclipse]
[ maven embedder INFO] Adding support for WTP version R7.
[ maven embedder INFO] Wrote settings to /home/continuum/continuum-maven/working-directory/41/target/test-classes/projects/project-2/.settings/org.eclipse.jdt.core.prefs
[ maven embedder INFO] Wrote Eclipse project for "maven-eclipse-plugin-test-project-2" to /home/continuum/continuum-maven/working-directory/41/target/test-classes/projects/project-2.
[ maven embedder INFO] 
       Sources for some artifacts are not available.
       Please run the same goal with the -DdownloadSources=true parameter in order to check remote repositories for sources.
       List of artifacts without a source archive:
         o junit:junit:2.0

[ maven embedder INFO] ----------------------------------------------------------------------------
[ maven embedder INFO] Building Maven
[ maven embedder INFO]    task-segment: [org.apache.maven.plugins:maven-eclipse-plugin:clean, org.apache.maven.plugins:maven-eclipse-plugin:eclipse]
[ maven embedder INFO] ----------------------------------------------------------------------------
[ maven embedder INFO] [eclipse:clean]
[ maven embedder INFO] Deleting file: .project
[ maven embedder INFO] Deleting file: .classpath
[ maven embedder INFO] Deleting file: .wtpmodules
[ maven embedder INFO] Deleting file: .component
[ maven embedder INFO] Deleting file: org.eclipse.wst.common.component
[ maven embedder INFO] Deleting file: org.eclipse.wst.common.project.facet.core.xml
[ maven embedder INFO] Preparing eclipse:eclipse
[ maven embedder INFO] No goals needed for project - skipping
[ maven embedder INFO] [eclipse:eclipse]
[ maven embedder INFO] Adding support for WTP version R7.
[ maven embedder WARNING] This plugin currently doesn't support include patterns for resources. Adding the entire directory.
[ maven embedder WARNING] This plugin currently doesn't support exclude patterns for resources. Adding the entire directory.
[ maven embedder WARNING] This plugin currently doesn't support include patterns for resources. Adding the entire directory.
[ maven embedder WARNING] This plugin currently doesn't support exclude patterns for resources. Adding the entire directory.
[ maven embedder INFO] Not writing settings - defaults suffice
[ maven embedder INFO] Wrote Eclipse project for "maven-eclipse-plugin-test-project-3" to /home/continuum/continuum-maven/working-directory/41/target/test-classes/projects/project-3.
[ maven embedder INFO] 
       Sources for some artifacts are not available.
       Please run the same goal with the -DdownloadSources=true parameter in order to check remote repositories for sources.
       List of artifacts without a source archive:
         o junit:junit:2.0

[ maven embedder INFO] ----------------------------------------------------------------------------
[ maven embedder INFO] Building Maven
[ maven embedder INFO]    task-segment: [org.apache.maven.plugins:maven-eclipse-plugin:clean, org.apache.maven.plugins:maven-eclipse-plugin:eclipse]
[ maven embedder INFO] ----------------------------------------------------------------------------
[ maven embedder INFO] [eclipse:clean]
[ maven embedder INFO] Deleting file: .project
[ maven embedder INFO] Deleting file: .classpath
[ maven embedder INFO] Deleting file: .wtpmodules
[ maven embedder INFO] Deleting file: .component
[ maven embedder INFO] Deleting file: org.eclipse.wst.common.component
[ maven embedder INFO] Deleting file: org.eclipse.wst.common.project.facet.core.xml
[ maven embedder INFO] Preparing eclipse:eclipse
[ maven embedder INFO] No goals needed for project - skipping
[ maven embedder INFO] [eclipse:eclipse]
[ maven embedder INFO] Adding support for WTP version R7.
[ maven embedder INFO] Wrote settings to /home/continuum/continuum-maven/working-directory/41/target/project-4-test/maven-eclipse-plugin-test-project-4/.settings/org.eclipse.jdt.core.prefs
[ maven embedder INFO] Wrote Eclipse project for "maven-eclipse-plugin-test-project-4" to /home/continuum/continuum-maven/working-directory/41/target/test-classes/projects/project-4/../../../../target/project-4-test/maven-eclipse-plugin-test-project-4.
[ maven embedder INFO] 
       Sources for some artifacts are not available.
       Please run the same goal with the -DdownloadSources=true parameter in order to check remote repositories for sources.
       List of artifacts without a source archive:
         o junit:junit:2.0

[ maven embedder INFO] ----------------------------------------------------------------------------
[ maven embedder INFO] Building Maven
[ maven embedder INFO]    task-segment: [org.apache.maven.plugins:maven-eclipse-plugin:clean, org.apache.maven.plugins:maven-eclipse-plugin:eclipse]
[ maven embedder INFO] ----------------------------------------------------------------------------
[ maven embedder INFO] [eclipse:clean]
[ maven embedder INFO] Deleting file: .project
[ maven embedder INFO] Deleting file: .classpath
[ maven embedder INFO] Deleting file: .wtpmodules
[ maven embedder INFO] Deleting file: .component
[ maven embedder INFO] Deleting file: org.eclipse.wst.common.component
[ maven embedder INFO] Deleting file: org.eclipse.wst.common.project.facet.core.xml
[ maven embedder INFO] Preparing eclipse:eclipse
[ maven embedder INFO] No goals needed for project - skipping
[ maven embedder INFO] [eclipse:eclipse]
[ maven embedder INFO] Adding support for WTP version R7.
[ maven embedder WARNING] You did specify a list of classpath containers without the base org.eclipse.jdt.launching.JRE_CONTAINER.
       If you specify custom classpath containers you should also add org.eclipse.jdt.launching.JRE_CONTAINER to the list
[ maven embedder INFO] Wrote settings to /home/continuum/continuum-maven/working-directory/41/target/test-classes/projects/project-5/.settings/org.eclipse.jdt.core.prefs
[ maven embedder INFO] Wrote Eclipse project for "maven-eclipse-plugin-test-project-5" to /home/continuum/continuum-maven/working-directory/41/target/test-classes/projects/project-5.
[ maven embedder INFO] ----------------------------------------------------------------------------
[ maven embedder INFO] Building Maven
[ maven embedder INFO]    task-segment: [org.apache.maven.plugins:maven-eclipse-plugin:clean, org.apache.maven.plugins:maven-eclipse-plugin:eclipse]
[ maven embedder INFO] ----------------------------------------------------------------------------
[ maven embedder INFO] [eclipse:clean]
[ maven embedder INFO] Deleting file: .project
[ maven embedder INFO] Deleting file: .classpath
[ maven embedder INFO] Deleting file: .wtpmodules
[ maven embedder INFO] Deleting file: .component
[ maven embedder INFO] Deleting file: org.eclipse.wst.common.component
[ maven embedder INFO] Deleting file: org.eclipse.wst.common.project.facet.core.xml
[ maven embedder INFO] Preparing eclipse:eclipse
[ maven embedder INFO] No goals needed for project - skipping
[ maven embedder INFO] [eclipse:eclipse]
[ maven embedder INFO] Adding support for WTP version R7.
[ maven embedder INFO] Not writing settings - defaults suffice
[ maven embedder INFO] Wrote Eclipse project for "maven-eclipse-plugin-test-project-6" to /home/continuum/continuum-maven/working-directory/41/target/test-classes/projects/project-6.
[ maven embedder INFO] ----------------------------------------------------------------------------
[ maven embedder INFO] Building Maven
[ maven embedder INFO]    task-segment: [org.apache.maven.plugins:maven-eclipse-plugin:clean, org.apache.maven.plugins:maven-eclipse-plugin:eclipse]
[ maven embedder INFO] ----------------------------------------------------------------------------
[ maven embedder INFO] [eclipse:clean]
[ maven embedder INFO] Deleting file: .project
[ maven embedder INFO] Deleting file: .classpath
[ maven embedder INFO] Deleting file: .wtpmodules
[ maven embedder INFO] Deleting file: .component
[ maven embedder INFO] Deleting file: org.eclipse.wst.common.component
[ maven embedder INFO] Deleting file: org.eclipse.wst.common.project.facet.core.xml
[ maven embedder INFO] Preparing eclipse:eclipse
[ maven embedder INFO] No goals needed for project - skipping
[ maven embedder INFO] [eclipse:eclipse]
[ maven embedder INFO] Adding support for WTP version R7.
[ maven embedder INFO] Not writing settings - defaults suffice
[ maven embedder INFO] Wrote Eclipse project for "maven-eclipse-plugin-test-project-8" to /home/continuum/continuum-maven/working-directory/41/target/test-classes/projects/project-8.
[ maven embedder INFO] ----------------------------------------------------------------------------
[ maven embedder INFO] Building Maven
[ maven embedder INFO]    task-segment: [org.apache.maven.plugins:maven-eclipse-plugin:clean, org.apache.maven.plugins:maven-eclipse-plugin:eclipse]
[ maven embedder INFO] ----------------------------------------------------------------------------
[ maven embedder INFO] [eclipse:clean]
[ maven embedder INFO] Deleting file: .project
[ maven embedder INFO] Deleting file: .classpath
[ maven embedder INFO] Deleting file: .wtpmodules
[ maven embedder INFO] Deleting file: .component
[ maven embedder INFO] Deleting file: org.eclipse.wst.common.component
[ maven embedder INFO] Deleting file: org.eclipse.wst.common.project.facet.core.xml
[ maven embedder INFO] Preparing eclipse:eclipse
[ maven embedder INFO] No goals needed for project - skipping
[ maven embedder INFO] [eclipse:eclipse]
[ maven embedder INFO] Adding support for WTP version R7.
[ maven embedder INFO] Not writing settings - defaults suffice
[ maven embedder INFO] Wrote Eclipse project for "maven-eclipse-plugin-test-project-9" to /home/continuum/continuum-maven/working-directory/41/target/test-classes/projects/project-9/../../../../target/project-9-test/maven-eclipse-plugin-test-project-9.
[ maven embedder INFO] 
       Sources for some artifacts are not available.
       Please run the same goal with the -DdownloadSources=true parameter in order to check remote repositories for sources.
       List of artifacts without a source archive:
         o junit:junit:2.0

[ maven embedder INFO] ----------------------------------------------------------------------------
[ maven embedder INFO] Building Maven
[ maven embedder INFO]    task-segment: [org.apache.maven.plugins:maven-eclipse-plugin:clean, org.apache.maven.plugins:maven-eclipse-plugin:eclipse]
[ maven embedder INFO] ----------------------------------------------------------------------------
[ maven embedder INFO] [eclipse:clean]
[ maven embedder INFO] Deleting file: .project
[ maven embedder INFO] Deleting file: .classpath
[ maven embedder INFO] Deleting file: .wtpmodules
[ maven embedder INFO] Deleting file: .component
[ maven embedder INFO] Deleting file: org.eclipse.wst.common.component
[ maven embedder INFO] Deleting file: org.eclipse.wst.common.project.facet.core.xml
[ maven embedder INFO] Preparing eclipse:eclipse
[ maven embedder INFO] No goals needed for project - skipping
[ maven embedder INFO] [eclipse:eclipse]
[ maven embedder INFO] Adding support for WTP version R7.
[ maven embedder INFO] Wrote settings to /home/continuum/continuum-maven/working-directory/41/target/test-classes/projects/project-10/.settings/org.eclipse.jdt.core.prefs
[ maven embedder INFO] Wrote Eclipse project for "maven-eclipse-plugin-test-project-2" to /home/continuum/continuum-maven/working-directory/41/target/test-classes/projects/project-10.
[ maven embedder INFO] 
       Sources for some artifacts are not available.
       Please run the same goal with the -DdownloadSources=true parameter in order to check remote repositories for sources.
       List of artifacts without a source archive:
         o junit:junit:3.0

[ maven embedder INFO] ----------------------------------------------------------------------------
[ maven embedder INFO] Building Maven
[ maven embedder INFO]    task-segment: [org.apache.maven.plugins:maven-eclipse-plugin:clean, org.apache.maven.plugins:maven-eclipse-plugin:eclipse]
[ maven embedder INFO] ----------------------------------------------------------------------------
[ maven embedder INFO] [eclipse:clean]
[ maven embedder INFO] Deleting file: .project
[ maven embedder INFO] Deleting file: .classpath
[ maven embedder INFO] Deleting file: .wtpmodules
[ maven embedder INFO] Deleting file: .component
[ maven embedder INFO] Deleting file: org.eclipse.wst.common.component
[ maven embedder INFO] Deleting file: org.eclipse.wst.common.project.facet.core.xml
[ maven embedder INFO] Preparing eclipse:eclipse
[ maven embedder INFO] artifact org.codehaus.modello:modello-maven-plugin: checking for updates from central
Downloading: http://repo1.maven.org/maven2/org/codehaus/modello/modello-maven-plugin/1.0-alpha-10/modello-maven-plugin-1.0-alpha-10.pom
1/1K
1K downloaded
Downloading: http://repo1.maven.org/maven2/org/codehaus/modello/modello/1.0-alpha-10/modello-1.0-alpha-10.pom
3/8K
5/8K
8/8K
8K downloaded
Downloading: http://repo1.maven.org/maven2/org/codehaus/modello/modello-maven-plugin/1.0-alpha-10/modello-maven-plugin-1.0-alpha-10.jar
4/10K
5/10K
7/10K
9/10K
10/10K
10K downloaded
Downloading: http://repo1.maven.org/maven2/org/codehaus/modello/modello-core/1.0-alpha-10/modello-core-1.0-alpha-10.pom
824/824b
824b downloaded
Downloading: http://repo1.maven.org/maven2/org/codehaus/plexus/plexus-container-default/1.0-alpha-8/plexus-container-default-1.0-alpha-8.pom
2/7K
5/7K
6/7K
7/7K
7K downloaded
Downloading: http://repo1.maven.org/maven2/org/codehaus/modello/modello-plugin-prevayler/1.0-alpha-10/modello-plugin-prevayler-1.0-alpha-10.pom
660/660b
660b downloaded
Downloading: http://repo1.maven.org/maven2/org/codehaus/modello/modello-plugins/1.0-alpha-10/modello-plugins-1.0-alpha-10.pom
1/1K
1K downloaded
Downloading: http://repo1.maven.org/maven2/org/codehaus/modello/modello-plugin-store/1.0-alpha-10/modello-plugin-store-1.0-alpha-10.pom
608/608b
608b downloaded
Downloading: http://repo1.maven.org/maven2/org/codehaus/plexus/plexus-velocity/1.1.2/plexus-velocity-1.1.2.pom
2/7K
3/7K
7/7K
7K downloaded
Downloading: http://repo1.maven.org/maven2/org/codehaus/plexus/plexus-container-default/1.0-alpha-7/plexus-container-default-1.0-alpha-7.pom
1/1K
1K downloaded
Downloading: http://repo1.maven.org/maven2/plexus/plexus-containers/1.0.2/plexus-containers-1.0.2.pom
471/471b
471b downloaded
Downloading: http://repo1.maven.org/maven2/plexus/plexus-root/1.0.3/plexus-root-1.0.3.pom
3/5K
5/5K
5K downloaded
Downloading: http://repo1.maven.org/maven2/commons-logging/commons-logging-api/1.0.4/commons-logging-api-1.0.4.pom
168/168b
168b downloaded
Downloading: http://repo1.maven.org/maven2/commons-collections/commons-collections/2.0/commons-collections-2.0.pom
171/171b
171b downloaded
Downloading: http://repo1.maven.org/maven2/velocity/velocity/1.4/velocity-1.4.pom
2/2K
2K downloaded
Downloading: http://repo1.maven.org/maven2/velocity/velocity-dep/1.4/velocity-dep-1.4.pom
1/1K
1K downloaded
Downloading: http://repo1.maven.org/maven2/plexus/plexus-utils/1.0.2/plexus-utils-1.0.2.pom
740/740b
740b downloaded
Downloading: http://repo1.maven.org/maven2/org/codehaus/modello/modello-plugin-xpp3/1.0-alpha-10/modello-plugin-xpp3-1.0-alpha-10.pom
803/803b
803b downloaded
Downloading: http://repo1.maven.org/maven2/org/codehaus/modello/modello-plugin-xml/1.0-alpha-10/modello-plugin-xml-1.0-alpha-10.pom
442/442b
442b downloaded
Downloading: http://repo1.maven.org/maven2/org/codehaus/modello/modello-plugin-xdoc/1.0-alpha-10/modello-plugin-xdoc-1.0-alpha-10.pom
610/610b
610b downloaded
Downloading: http://repo1.maven.org/maven2/org/codehaus/modello/modello-plugin-xsd/1.0-alpha-10/modello-plugin-xsd-1.0-alpha-10.pom
646/646b
646b downloaded
Downloading: http://repo1.maven.org/maven2/org/apache/maven/maven-project/2.0/maven-project-2.0.pom
1/1K
1K downloaded
Downloading: http://repo1.maven.org/maven2/org/apache/maven/maven/2.0/maven-2.0.pom
1/8K
5/8K
7/8K
8/8K
8K downloaded
Downloading: http://repo1.maven.org/maven2/org/apache/maven/maven-artifact/2.0/maven-artifact-2.0.pom
723/723b
723b downloaded
Downloading: http://repo1.maven.org/maven2/org/apache/maven/maven-model/2.0/maven-model-2.0.pom
2/2K
2K downloaded
Downloading: http://repo1.maven.org/maven2/org/apache/maven/maven-artifact-manager/2.0/maven-artifact-manager-2.0.pom
1/1K
1K downloaded
Downloading: http://repo1.maven.org/maven2/org/apache/maven/maven-repository-metadata/2.0/maven-repository-metadata-2.0.pom
1/1K
1K downloaded
Downloading: http://repo1.maven.org/maven2/org/apache/maven/maven-profile/2.0/maven-profile-2.0.pom
1/1K
1K downloaded
Downloading: http://repo1.maven.org/maven2/org/apache/maven/maven-plugin-api/2.0/maven-plugin-api-2.0.pom
601/601b
601b downloaded
Downloading: http://repo1.maven.org/maven2/org/codehaus/modello/modello-plugin-jdom/1.0-alpha-10/modello-plugin-jdom-1.0-alpha-10.pom
803/803b
803b downloaded
Downloading: http://repo1.maven.org/maven2/org/codehaus/modello/modello-plugin-jpox/1.0-alpha-10/modello-plugin-jpox-1.0-alpha-10.pom
650/650b
650b downloaded
Downloading: http://repo1.maven.org/maven2/org/codehaus/modello/modello-plugin-store/1.0-alpha-10/modello-plugin-store-1.0-alpha-10.jar
2/14K
6/14K
6/14K
8/14K
11/14K
12/14K
13/14K
14/14K
14K downloaded
Downloading: http://repo1.maven.org/maven2/velocity/velocity-dep/1.4/velocity-dep-1.4.jar
4/505K
5/505K
7/505K
9/505K
11/505K
13/505K
17/505K
19/505K
22/505K
23/505K
25/505K
27/505K
30/505K
31/505K
33/505K
35/505K
37/505K
39/505K
41/505K
42/505K
43/505K
46/505K
47/505K
49/505K
51/505K
53/505K
54/505K
55/505K
57/505K
59/505K
61/505K
63/505K
65/505K
67/505K
69/505K
71/505K
73/505K
77/505K
78/505K
79/505K
81/505K
83/505K
87/505K
89/505K
91/505K
93/505K
94/505K
95/505K
97/505K
101/505K
105/505K
107/505K
109/505K
110/505K
111/505K
114/505K
116/505K
119/505K
120/505K
124/505K
124/505K
128/505K
130/505K
131/505K
134/505K
136/505K
137/505K
141/505K
143/505K
145/505K
146/505K
147/505K
149/505K
150/505K
154/505K
158/505K
161/505K
163/505K
165/505K
169/505K
169/505K
170/505K
172/505K
175/505K
176/505K
179/505K
182/505K
183/505K
187/505K
190/505K
193/505K
195/505K
197/505K
198/505K
199/505K
203/505K
205/505K
207/505K
209/505K
210/505K
211/505K
213/505K
214/505K
218/505K
222/505K
224/505K
225/505K
227/505K
227/505K
229/505K
230/505K
231/505K
233/505K
234/505K
236/505K
237/505K
240/505K
241/505K
244/505K
246/505K
249/505K
251/505K
253/505K
254/505K
256/505K
257/505K
259/505K
263/505K
266/505K
268/505K
269/505K
271/505K
272/505K
273/505K
275/505K
276/505K
278/505K
279/505K
282/505K
283/505K
285/505K
286/505K
287/505K
289/505K
290/505K
291/505K
293/505K
294/505K
296/505K
297/505K
300/505K
303/505K
303/505K
305/505K
307/505K
309/505K
311/505K
314/505K
315/505K
319/505K
320/505K
321/505K
325/505K
325/505K
327/505K
330/505K
331/505K
333/505K
335/505K
337/505K
338/505K
339/505K
341/505K
342/505K
344/505K
345/505K
347/505K
348/505K
349/505K
351/505K
351/505K
353/505K
355/505K
357/505K
359/505K
361/505K
362/505K
363/505K
367/505K
368/505K
369/505K
372/505K
373/505K
375/505K
378/505K
379/505K
381/505K
382/505K
383/505K
385/505K
386/505K
387/505K
390/505K
392/505K
393/505K
395/505K
399/505K
403/505K
405/505K
406/505K
407/505K
409/505K
412/505K
413/505K
415/505K
416/505K
417/505K
421/505K
425/505K
426/505K
427/505K
429/505K
430/505K
432/505K
433/505K
435/505K
436/505K
437/505K
439/505K
440/505K
443/505K
444/505K
446/505K
447/505K
449/505K
450/505K
452/505K
453/505K
454/505K
456/505K
457/505K
459/505K
461/505K
462/505K
463/505K
465/505K
467/505K
469/505K
470/505K
471/505K
473/505K
475/505K
477/505K
478/505K
479/505K
481/505K
482/505K
486/505K
490/505K
493/505K
494/505K
495/505K
497/505K
498/505K
501/505K
502/505K
504/505K
505/505K
505K downloaded
Downloading: http://repo1.maven.org/maven2/velocity/velocity/1.4/velocity-1.4.jar
3/352K
5/352K
6/352K
7/352K
9/352K
10/352K
12/352K
13/352K
15/352K
19/352K
23/352K
25/352K
26/352K
27/352K
29/352K
30/352K
32/352K
33/352K
35/352K
37/352K
39/352K
40/352K
42/352K
43/352K
46/352K
47/352K
49/352K
50/352K
51/352K
53/352K
55/352K
57/352K
59/352K
61/352K
62/352K
64/352K
65/352K
67/352K
69/352K
71/352K
74/352K
77/352K
78/352K
80/352K
83/352K
85/352K
87/352K
89/352K
91/352K
93/352K
96/352K
97/352K
99/352K
101/352K
103/352K
104/352K
107/352K
109/352K
110/352K
111/352K
113/352K
114/352K
118/352K
122/352K
126/352K
127/352K
127/352K
129/352K
130/352K
131/352K
133/352K
134/352K
136/352K
137/352K
139/352K
140/352K
141/352K
143/352K
144/352K
147/352K
149/352K
150/352K
151/352K
153/352K
154/352K
156/352K
157/352K
159/352K
160/352K
163/352K
164/352K
166/352K
167/352K
170/352K
171/352K
173/352K
175/352K
177/352K
178/352K
179/352K
181/352K
183/352K
185/352K
186/352K
187/352K
189/352K
191/352K
193/352K
195/352K
197/352K
198/352K
202/352K
206/352K
210/352K
211/352K
213/352K
215/352K
218/352K
221/352K
223/352K
227/352K
231/352K
233/352K
234/352K
235/352K
237/352K
238/352K
240/352K
241/352K
243/352K
244/352K
245/352K
247/352K
250/352K
251/352K
253/352K
254/352K
255/352K
257/352K
260/352K
261/352K
264/352K
267/352K
268/352K
270/352K
272/352K
274/352K
277/352K
278/352K
281/352K
283/352K
285/352K
286/352K
289/352K
291/352K
293/352K
294/352K
295/352K
297/352K
298/352K
299/352K
301/352K
302/352K
306/352K
310/352K
311/352K
313/352K
314/352K
315/352K
317/352K
320/352K
321/352K
324/352K
325/352K
327/352K
327/352K
329/352K
331/352K
333/352K
334/352K
335/352K
337/352K
340/352K
341/352K
343/352K
344/352K
345/352K
349/352K
350/352K
351/352K
352/352K
352K downloaded
Downloading: http://repo1.maven.org/maven2/org/codehaus/modello/modello-plugin-jdom/1.0-alpha-10/modello-plugin-jdom-1.0-alpha-10.jar
3/12K
5/12K
6/12K
9/12K
10/12K
12/12K
12K downloaded
Downloading: http://repo1.maven.org/maven2/org/codehaus/modello/modello-core/1.0-alpha-10/modello-core-1.0-alpha-10.jar
3/112K
6/112K
9/112K
12/112K
15/112K
17/112K
19/112K
22/112K
25/112K
26/112K
28/112K
29/112K
31/112K
33/112K
34/112K
35/112K
37/112K
39/112K
41/112K
43/112K
45/112K
49/112K
49/112K
50/112K
54/112K
56/112K
59/112K
61/112K
63/112K
66/112K
69/112K
70/112K
72/112K
75/112K
76/112K
77/112K
81/112K
85/112K
89/112K
91/112K
95/112K
99/112K
99/112K
101/112K
102/112K
104/112K
105/112K
107/112K
108/112K
109/112K
111/112K
112/112K
112K downloaded
Downloading: http://repo1.maven.org/maven2/org/codehaus/modello/modello-plugin-xpp3/1.0-alpha-10/modello-plugin-xpp3-1.0-alpha-10.jar
3/22K
6/22K
7/22K
9/22K
10/22K
12/22K
13/22K
15/22K
16/22K
17/22K
21/22K
22/22K
22K downloaded
Downloading: http://repo1.maven.org/maven2/commons-collections/commons-collections/2.0/commons-collections-2.0.jar
2/88K
3/88K
5/88K
6/88K
9/88K
11/88K
12/88K
15/88K
17/88K
19/88K
21/88K
23/88K
25/88K
27/88K
29/88K
32/88K
35/88K
37/88K
39/88K
41/88K
42/88K
43/88K
46/88K
48/88K
49/88K
51/88K
52/88K
55/88K
57/88K
59/88K
61/88K
63/88K
65/88K
66/88K
68/88K
69/88K
71/88K
72/88K
75/88K
78/88K
79/88K
81/88K
82/88K
83/88K
85/88K
86/88K
88/88K
88K downloaded
Downloading: http://repo1.maven.org/maven2/org/codehaus/modello/modello-plugin-xml/1.0-alpha-10/modello-plugin-xml-1.0-alpha-10.jar
3/8K
5/8K
6/8K
8/8K
8K downloaded
Downloading: http://repo1.maven.org/maven2/commons-logging/commons-logging-api/1.0.4/commons-logging-api-1.0.4.jar
3/25K
5/25K
7/25K
9/25K
10/25K
11/25K
13/25K
14/25K
17/25K
19/25K
20/25K
21/25K
23/25K
24/25K
25/25K
25K downloaded
Downloading: http://repo1.maven.org/maven2/org/codehaus/modello/modello-plugin-xdoc/1.0-alpha-10/modello-plugin-xdoc-1.0-alpha-10.jar
3/6K
6/6K
6K downloaded
Downloading: http://repo1.maven.org/maven2/org/codehaus/plexus/plexus-velocity/1.1.2/plexus-velocity-1.1.2.jar
3/7K
7/7K
7/7K
7K downloaded
Downloading: http://repo1.maven.org/maven2/org/codehaus/modello/modello-plugin-jpox/1.0-alpha-10/modello-plugin-jpox-1.0-alpha-10.jar
3/16K
6/16K
9/16K
10/16K
13/16K
15/16K
16/16K
16/16K
16K downloaded
Downloading: http://repo1.maven.org/maven2/org/codehaus/modello/modello-plugin-prevayler/1.0-alpha-10/modello-plugin-prevayler-1.0-alpha-10.jar
3/5K
5/5K
5K downloaded
Downloading: http://repo1.maven.org/maven2/org/codehaus/modello/modello-plugin-xsd/1.0-alpha-10/modello-plugin-xsd-1.0-alpha-10.jar
3/6K
6/6K
6K downloaded
[ maven embedder INFO] Setting property: classpath.resource.loader.class => 'org.codehaus.plexus.velocity.ContextClassLoaderResourceLoader'.
[ maven embedder INFO] Setting property: velocimacro.messages.on => 'false'.
[ maven embedder INFO] Setting property: resource.loader => 'classpath'.
[ maven embedder INFO] Setting property: resource.manager.logwhenfound => 'false'.
[ maven embedder INFO] ************************************************************** 
[ maven embedder INFO] Starting Jakarta Velocity v1.4
[ maven embedder INFO] RuntimeInstance initializing.
[ maven embedder INFO] Default Properties File: org/apache/velocity/runtime/defaults/velocity.properties
[ maven embedder INFO] Default ResourceManager initializing. (class org.apache.velocity.runtime.resource.ResourceManagerImpl)
[ maven embedder INFO] Resource Loader Instantiated: org.codehaus.plexus.velocity.ContextClassLoaderResourceLoader
[ maven embedder INFO] ClasspathResourceLoader : initialization starting.
[ maven embedder INFO] ClasspathResourceLoader : initialization complete.
[ maven embedder INFO] ResourceCache : initialized. (class org.apache.velocity.runtime.resource.ResourceCacheImpl)
[ maven embedder INFO] Default ResourceManager initialization complete.
[ maven embedder INFO] Loaded System Directive: org.apache.velocity.runtime.directive.Literal
[ maven embedder INFO] Loaded System Directive: org.apache.velocity.runtime.directive.Macro
[ maven embedder INFO] Loaded System Directive: org.apache.velocity.runtime.directive.Parse
[ maven embedder INFO] Loaded System Directive: org.apache.velocity.runtime.directive.Include
[ maven embedder INFO] Loaded System Directive: org.apache.velocity.runtime.directive.Foreach
[ maven embedder INFO] Created: 20 parsers.
[ maven embedder INFO] Velocimacro : initialization starting.
[ maven embedder INFO] Velocimacro : adding VMs from VM library template : VM_global_library.vm
[ maven embedder ERROR] ResourceManager : unable to find resource 'VM_global_library.vm' in any resource loader.
[ maven embedder INFO] Velocimacro : error using  VM library template VM_global_library.vm : org.apache.velocity.exception.ResourceNotFoundException: Unable to find resource 'VM_global_library.vm'
[ maven embedder INFO] Velocimacro :  VM library template macro registration complete.
[ maven embedder INFO] Velocimacro : allowInline = true : VMs can be defined inline in templates
[ maven embedder INFO] Velocimacro : allowInlineToOverride = false : VMs defined inline may NOT replace previous VM definitions
[ maven embedder INFO] Velocimacro : allowInlineLocal = false : VMs defined inline will be  global in scope if allowed.
[ maven embedder INFO] Velocimacro : initialization complete.
[ maven embedder INFO] Velocity successfully started.
[ maven embedder INFO] [modello:java {execution: default}]
[ maven embedder INFO] outputDirectory: /home/continuum/continuum-maven/working-directory/41/target/test-classes/projects/project-11/target/generated-sources/modello
[ maven embedder INFO] [eclipse:eclipse]
[ maven embedder INFO] Adding support for WTP version R7.
[ maven embedder INFO] Not writing settings - defaults suffice
[ maven embedder INFO] Wrote Eclipse project for "maven-eclipse-plugin-test-project-2" to /home/continuum/continuum-maven/working-directory/41/target/test-classes/projects/project-11.
[ maven embedder INFO] ----------------------------------------------------------------------------
[ maven embedder INFO] Building Unnamed - eclipse:maven-eclipse-plugin-test-project-12:ear:12
[ maven embedder INFO]    task-segment: [org.apache.maven.plugins:maven-eclipse-plugin:clean, org.apache.maven.plugins:maven-eclipse-plugin:eclipse]
[ maven embedder INFO] ----------------------------------------------------------------------------
[ maven embedder INFO] [eclipse:clean]
[ maven embedder INFO] Deleting file: .project
[ maven embedder INFO] Deleting file: .classpath
[ maven embedder INFO] Deleting file: .wtpmodules
[ maven embedder INFO] Deleting file: .component
[ maven embedder INFO] Deleting file: org.eclipse.wst.common.component
[ maven embedder INFO] Deleting file: org.eclipse.wst.common.project.facet.core.xml
[ maven embedder INFO] Preparing eclipse:eclipse
[ maven embedder INFO] artifact org.apache.maven.plugins:maven-ear-plugin: checking for updates from central
[ maven embedder WARNING] *** CHECKSUM FAILED - Checksum failed on download: local = 'e672c73f1430e99f1886bdf5bb9ae7a3cc2faf63'; remote = '5ac53c281a15f370daf30b13ebddb5ae2f6e8bdf' - RETRYING
[ maven embedder WARNING] *** CHECKSUM FAILED - Checksum failed on download: local = 'e672c73f1430e99f1886bdf5bb9ae7a3cc2faf63'; remote = '5ac53c281a15f370daf30b13ebddb5ae2f6e8bdf' - IGNORING
Downloading: http://repo1.maven.org/maven2/org/apache/maven/plugins/maven-ear-plugin/2.2/maven-ear-plugin-2.2.pom
1/1K
1K downloaded
Downloading: http://repo1.maven.org/maven2/org/apache/maven/plugins/maven-ear-plugin/2.2/maven-ear-plugin-2.2.jar
2/29K
3/29K
5/29K
6/29K
8/29K
12/29K
12/29K
13/29K
15/29K
16/29K
18/29K
19/29K
22/29K
25/29K
26/29K
29/29K
29K downloaded
Downloading: http://repo1.maven.org/maven2/org/apache/maven/maven-archiver/2.0.1/maven-archiver-2.0.1.pom
912/912b
912b downloaded
Downloading: http://repo1.maven.org/maven2/org/codehaus/plexus/plexus-archiver/1.0-alpha-4/plexus-archiver-1.0-alpha-4.pom
439/439b
439b downloaded
Downloading: http://repo1.maven.org/maven2/org/codehaus/plexus/plexus-components/1.1.4/plexus-components-1.1.4.pom
2/2K
2K downloaded
Downloading: http://repo1.maven.org/maven2/org/codehaus/plexus/plexus-archiver/1.0-alpha-4/plexus-archiver-1.0-alpha-4.jar
3/127K
5/127K
7/127K
9/127K
10/127K
12/127K
13/127K
15/127K
16/127K
19/127K
22/127K
23/127K
25/127K
27/127K
30/127K
33/127K
34/127K
36/127K
39/127K
40/127K
41/127K
43/127K
46/127K
47/127K
49/127K
51/127K
53/127K
54/127K
57/127K
58/127K
60/127K
61/127K
65/127K
67/127K
71/127K
71/127K
73/127K
74/127K
76/127K
77/127K
79/127K
80/127K
81/127K
83/127K
84/127K
86/127K
87/127K
89/127K
90/127K
94/127K
98/127K
100/127K
101/127K
103/127K
104/127K
107/127K
109/127K
110/127K
111/127K
113/127K
116/127K
117/127K
119/127K
121/127K
123/127K
125/127K
127/127K
127K downloaded
Downloading: http://repo1.maven.org/maven2/org/apache/maven/maven-archiver/2.0.1/maven-archiver-2.0.1.jar
4/9K
6/9K
9/9K
9K downloaded
[ maven embedder INFO] [ear:generate-application-xml]
[ maven embedder INFO] Generating application.xml
[ maven embedder INFO] [eclipse:eclipse]
[ maven embedder INFO] Adding support for WTP version 1.0.
[ maven embedder INFO] Not writing settings - defaults suffice
[ maven embedder INFO] Wrote Eclipse project for "maven-eclipse-plugin-test-project-12" to /home/continuum/continuum-maven/working-directory/41/target/test-classes/projects/project-12.
[ maven embedder INFO] ----------------------------------------------------------------------------
[ maven embedder INFO] Building Unnamed - eclipse:maven-eclipse-plugin-test-project-13:jar:13
[ maven embedder INFO]    task-segment: [org.apache.maven.plugins:maven-eclipse-plugin:clean, org.apache.maven.plugins:maven-eclipse-plugin:eclipse]
[ maven embedder INFO] ----------------------------------------------------------------------------
[ maven embedder INFO] [eclipse:clean]
[ maven embedder INFO] Deleting file: .project
[ maven embedder INFO] Deleting file: .classpath
[ maven embedder INFO] Deleting file: .wtpmodules
[ maven embedder INFO] Deleting file: .component
[ maven embedder INFO] Deleting file: org.eclipse.wst.common.component
[ maven embedder INFO] Deleting file: org.eclipse.wst.common.project.facet.core.xml
[ maven embedder INFO] Preparing eclipse:eclipse
[ maven embedder INFO] No goals needed for project - skipping
[ maven embedder INFO] [eclipse:eclipse]
[ maven embedder INFO] Not writing settings - defaults suffice
[ maven embedder INFO] Wrote Eclipse project for "maven-eclipse-plugin-test-project-13" to /home/continuum/continuum-maven/working-directory/41/target/test-classes/projects/project-13.
[ maven embedder INFO] 
       Sources for some artifacts are not available.
       Please run the same goal with the -DdownloadSources=true parameter in order to check remote repositories for sources.
       List of artifacts without a source archive:
         o junit:junit:3.8.1

[ maven embedder INFO] ----------------------------------------------------------------------------
[ maven embedder INFO] Building maven-eclipse-plugin-test-project-14en
[ maven embedder INFO]    task-segment: [org.apache.maven.plugins:maven-eclipse-plugin:clean, org.apache.maven.plugins:maven-eclipse-plugin:eclipse]
[ maven embedder INFO] ----------------------------------------------------------------------------
[ maven embedder INFO] [eclipse:clean]
[ maven embedder INFO] Deleting file: .project
[ maven embedder INFO] Deleting file: .classpath
[ maven embedder INFO] Deleting file: .wtpmodules
[ maven embedder INFO] Deleting file: .component
[ maven embedder INFO] Deleting file: org.eclipse.wst.common.component
[ maven embedder INFO] Deleting file: org.eclipse.wst.common.project.facet.core.xml
[ maven embedder INFO] Preparing eclipse:eclipse
[ maven embedder INFO] No goals needed for project - skipping
[ maven embedder INFO] [eclipse:eclipse]
[ maven embedder INFO] Not writing settings - defaults suffice
[ maven embedder INFO] Wrote Eclipse project for "maven-eclipse-plugin-test-project-14" to /home/continuum/continuum-maven/working-directory/41/target/test-classes/projects/project-14.
[ maven embedder INFO] ----------------------------------------------------------------------------
[ maven embedder INFO] Building maven-eclipse-plugin-test-project-15
[ maven embedder INFO]    task-segment: [org.apache.maven.plugins:maven-eclipse-plugin:clean, org.apache.maven.plugins:maven-eclipse-plugin:eclipse]
[ maven embedder INFO] ----------------------------------------------------------------------------
[ maven embedder INFO] [eclipse:clean]
[ maven embedder INFO] Deleting file: .project
[ maven embedder INFO] Deleting file: .classpath
[ maven embedder INFO] Deleting file: .wtpmodules
[ maven embedder INFO] Deleting file: .component
[ maven embedder INFO] Deleting file: org.eclipse.wst.common.component
[ maven embedder INFO] Deleting file: org.eclipse.wst.common.project.facet.core.xml
[ maven embedder INFO] Preparing eclipse:eclipse
[ maven embedder INFO] No goals needed for project - skipping
[ maven embedder INFO] [eclipse:eclipse]
[ maven embedder INFO] Not writing settings - defaults suffice
[ maven embedder INFO] Wrote Eclipse project for "maven-eclipse-plugin-test-project-15" to /home/continuum/continuum-maven/working-directory/41/target/test-classes/projects/project-15.
[ maven embedder INFO] ----------------------------------------------------------------------------
[ maven embedder INFO] Building maven-eclipse-plugin-test-project-18
[ maven embedder INFO]    task-segment: [org.apache.maven.plugins:maven-eclipse-plugin:clean, org.apache.maven.plugins:maven-eclipse-plugin:eclipse]
[ maven embedder INFO] ----------------------------------------------------------------------------
[ maven embedder INFO] [eclipse:clean]
[ maven embedder INFO] Deleting file: .project
[ maven embedder INFO] Deleting file: .classpath
[ maven embedder INFO] Deleting file: .wtpmodules
[ maven embedder INFO] Deleting file: .component
[ maven embedder INFO] Deleting file: org.eclipse.wst.common.component
[ maven embedder INFO] Deleting file: org.eclipse.wst.common.project.facet.core.xml
[ maven embedder INFO] Preparing eclipse:eclipse
[ maven embedder INFO] No goals needed for project - skipping
[ maven embedder INFO] [eclipse:eclipse]
[ maven embedder INFO] Not writing settings - defaults suffice
[ maven embedder INFO] Wrote Eclipse project for "maven-eclipse-plugin-test-project-18" to /home/continuum/continuum-maven/working-directory/41/target/test-classes/projects/project-18/../../../../target/project-18-test/maven-eclipse-plugin-test-project-18.
[ maven embedder INFO] ----------------------------------------------------------------------------
[ maven embedder INFO] Building maven-eclipse-plugin-test-project-19
[ maven embedder INFO]    task-segment: [org.apache.maven.plugins:maven-eclipse-plugin:clean, org.apache.maven.plugins:maven-eclipse-plugin:eclipse]
[ maven embedder INFO] ----------------------------------------------------------------------------
[ maven embedder INFO] [eclipse:clean]
[ maven embedder INFO] Deleting file: .project
[ maven embedder INFO] Deleting file: .classpath
[ maven embedder INFO] Deleting file: .wtpmodules
[ maven embedder INFO] Deleting file: .component
[ maven embedder INFO] Deleting file: org.eclipse.wst.common.component
[ maven embedder INFO] Deleting file: org.eclipse.wst.common.project.facet.core.xml
[ maven embedder INFO] Preparing eclipse:eclipse
[ maven embedder INFO] No goals needed for project - skipping
[ maven embedder INFO] [eclipse:eclipse]
[ maven embedder INFO] Not writing settings - defaults suffice
[ maven embedder INFO] Wrote Eclipse project for "maven-eclipse-plugin-test-project-19" to /home/continuum/continuum-maven/working-directory/41/target/test-classes/projects/project-19.
[ maven embedder INFO] ----------------------------------------------------------------------------
[ maven embedder INFO] Building maven-eclipse-plugin-test-project-20
[ maven embedder INFO]    task-segment: [org.apache.maven.plugins:maven-eclipse-plugin:clean, org.apache.maven.plugins:maven-eclipse-plugin:eclipse]
[ maven embedder INFO] ----------------------------------------------------------------------------
[ maven embedder INFO] [eclipse:clean]
[ maven embedder INFO] Deleting file: .project
[ maven embedder INFO] Deleting file: .classpath
[ maven embedder INFO] Deleting file: .wtpmodules
[ maven embedder INFO] Deleting file: .component
[ maven embedder INFO] Deleting file: org.eclipse.wst.common.component
[ maven embedder INFO] Deleting file: org.eclipse.wst.common.project.facet.core.xml
[ maven embedder INFO] Preparing eclipse:eclipse
[ maven embedder INFO] No goals needed for project - skipping
[ maven embedder INFO] [eclipse:eclipse]
[ maven embedder INFO] Adding support for WTP version 1.5.
[ maven embedder INFO] Not writing settings - defaults suffice
[ maven embedder INFO] Wrote Eclipse project for "maven-eclipse-plugin-test-project-20" to /home/continuum/continuum-maven/working-directory/41/target/test-classes/projects/project-20.
[ maven embedder INFO] ----------------------------------------------------------------------------
[ maven embedder INFO] Building maven-eclipse-plugin-test-project-21
[ maven embedder INFO]    task-segment: [org.apache.maven.plugins:maven-eclipse-plugin:clean, org.apache.maven.plugins:maven-eclipse-plugin:eclipse]
[ maven embedder INFO] ----------------------------------------------------------------------------
[ maven embedder INFO] [eclipse:clean]
[ maven embedder INFO] Deleting file: .project
[ maven embedder INFO] Deleting file: .classpath
[ maven embedder INFO] Deleting file: .wtpmodules
[ maven embedder INFO] Deleting file: .component
[ maven embedder INFO] Deleting file: org.eclipse.wst.common.component
[ maven embedder INFO] Deleting file: org.eclipse.wst.common.project.facet.core.xml
[ maven embedder INFO] Preparing eclipse:eclipse
[ maven embedder INFO] No goals needed for project - skipping
[ maven embedder INFO] [eclipse:eclipse]
[ maven embedder INFO] Not writing settings - defaults suffice
[ maven embedder INFO] The Maven Eclipse plugin runs in 'pde'-mode.
[ maven embedder WARNING] The references manifest file doesn't exist, plugin dependencies will not be updated: /home/continuum/continuum-maven/working-directory/41/target/test-classes/projects/project-21/META-INF/MANIFEST.MF
[ maven embedder INFO] Wrote Eclipse project for "maven-eclipse-plugin-test-project-21" to /home/continuum/continuum-maven/working-directory/41/target/test-classes/projects/project-21.
[ maven embedder INFO] ----------------------------------------------------------------------------
[ maven embedder INFO] Building maven-eclipse-plugin-test-project-22
[ maven embedder INFO]    task-segment: [org.apache.maven.plugins:maven-eclipse-plugin:clean, org.apache.maven.plugins:maven-eclipse-plugin:eclipse]
[ maven embedder INFO] ----------------------------------------------------------------------------
[ maven embedder INFO] [eclipse:clean]
[ maven embedder INFO] Deleting file: .project
[ maven embedder INFO] Deleting file: .classpath
[ maven embedder INFO] Deleting file: .wtpmodules
[ maven embedder INFO] Deleting file: .component
[ maven embedder INFO] Deleting file: org.eclipse.wst.common.component
[ maven embedder INFO] Deleting file: org.eclipse.wst.common.project.facet.core.xml
[ maven embedder INFO] Preparing eclipse:eclipse
[ maven embedder INFO] No goals needed for project - skipping
[ maven embedder INFO] [eclipse:eclipse]
[ maven embedder INFO] Not writing settings - defaults suffice
[ maven embedder INFO] The Maven Eclipse plugin runs in 'pde'-mode.
[ maven embedder WARNING] The references manifest file doesn't exist, plugin dependencies will not be updated: /home/continuum/continuum-maven/working-directory/41/target/test-classes/projects/project-22/META-INF/MANIFEST.MF
[ maven embedder INFO] Wrote Eclipse project for "maven-eclipse-plugin-test-project-22" to /home/continuum/continuum-maven/working-directory/41/target/test-classes/projects/project-22.
Tests run: 19, Failures: 0, Errors: 0, Skipped: 0, Time elapsed: 136.814 sec

Results :
Tests run: 20, Failures: 0, Errors: 0, Skipped: 0

[INFO] [jar:jar]
[INFO] Building jar: /home/continuum/continuum-maven/working-directory/41/target/maven-eclipse-plugin-2.3-SNAPSHOT.jar
[INFO] [plugin:addPluginArtifactMetadata]
[INFO] [install:install]
[INFO] Installing /home/continuum/continuum-maven/working-directory/41/target/maven-eclipse-plugin-2.3-SNAPSHOT.jar to /home/continuum/.m2/repository/org/apache/maven/plugins/maven-eclipse-plugin/2.3-SNAPSHOT/maven-eclipse-plugin-2.3-SNAPSHOT.jar
[INFO] [plugin:updateRegistry]
[INFO] ------------------------------------------------------------------------
[INFO] BUILD SUCCESSFUL
[INFO] ------------------------------------------------------------------------
[INFO] Total time: 2 minutes 33 seconds
[INFO] Finished at: Thu Jul 20 15:07:04 PDT 2006
[INFO] Final Memory: 13M/157M
[INFO] ------------------------------------------------------------------------

****************************************************************************



Mime
View raw message