maven-notifications mailing list archives

Site index · List index
Message view « Date » · « Thread »
Top « Date » · « Thread »
From Continuum Build Server <contin...@ci.codehaus.org>
Subject [continuum] BUILD FAILURE: Maven Eclipse Plugin
Date Sun, 16 Jul 2006 13:06:19 GMT
Online report : http://ci.codehaus.org/continuum-maven/servlet/continuum/target/ProjectBuild.vm/view/ProjectBuild/id/41/buildId/6673
Build statistics:
  State: Failed
  Previous State: Ok
  Started at: Sun, 16 Jul 2006 06:04:59 -0700
  Finished at: Sun, 16 Jul 2006 06:06:19 -0700
  Total time: 1m 19s
  Build Trigger: Schedule
  Exit code: 1
  Building machine hostname: cheddar.simulalabs.com
  Operating system : Linux(unknown)
  Java version : 1.5.0_03(Sun Microsystems Inc.)

Changes
         fgiust          execute tests in the target/test-classes dir instead of src/test.
Avoid modification of directories stored in svn and be sure to always start from a clean dir.
             /maven/plugins/trunk/maven-eclipse-plugin/src/test/java/org/apache/maven/plugin/eclipse/AbstractEclipsePluginTestCase.java
            /maven/plugins/trunk/maven-eclipse-plugin/src/test/java/org/apache/maven/plugin/eclipse/AddMavenRepoMojoTest.java
            /maven/plugins/trunk/maven-eclipse-plugin/src/test/m2repo
            /maven/plugins/trunk/maven-eclipse-plugin/src/test/projects
            /maven/plugins/trunk/maven-eclipse-plugin/src/test/resources/m2repo (from /maven/plugins/trunk/maven-eclipse-plugin/src/test/m2repo:422431)
            /maven/plugins/trunk/maven-eclipse-plugin/src/test/resources/projects (from /maven/plugins/trunk/maven-eclipse-plugin/src/test/projects:422431)
            /maven/plugins/trunk/maven-eclipse-plugin/src/test/resources/projects/project-18/classpath
            /maven/plugins/trunk/maven-eclipse-plugin/src/test/resources/projects/project-18/project
            /maven/plugins/trunk/maven-eclipse-plugin/src/test/resources/projects/project-4/project
            /maven/plugins/trunk/maven-eclipse-plugin/src/test/resources/projects/project-9/project
            /maven/plugins/trunk/maven-eclipse-plugin/src/test/resources/test-harness (from
/maven/plugins/trunk/maven-eclipse-plugin/src/test/test-harness:422431)
            /maven/plugins/trunk/maven-eclipse-plugin/src/test/test-harness
           fgiust          execute in target dir
             /maven/plugins/trunk/maven-eclipse-plugin/src/test/java/org/apache/maven/plugin/eclipse/EclipsePluginMasterProjectTest.java
        
****************************************************************************
Output:
****************************************************************************
[INFO] Scanning for projects...
[INFO] ----------------------------------------------------------------------------
[INFO] Building Maven Eclipse Plugin
[INFO]    task-segment: [clean, install]
[INFO] ----------------------------------------------------------------------------
[INFO] [clean:clean]
[INFO] Deleting directory /home/continuum/continuum-maven/working-directory/41/target
[INFO] Deleting directory /home/continuum/continuum-maven/working-directory/41/target/classes
[INFO] Deleting directory /home/continuum/continuum-maven/working-directory/41/target/test-classes
[INFO] [plugin:descriptor]
[INFO] Using 2 extractors.
[INFO] Applying extractor for language: java
[INFO] Extractor for language: java found 3 mojo descriptors.
[INFO] Applying extractor for language: bsh
[INFO] Extractor for language: bsh found 0 mojo descriptors.
[INFO] [resources:resources]
[INFO] Using default encoding to copy filtered resources.
[INFO] snapshot org.apache.maven:maven-plugin-testing-harness:1.0-SNAPSHOT: checking for updates
from snapshots
[INFO] snapshot org.apache.maven:maven-plugin-testing-harness:1.0-SNAPSHOT: checking for updates
from apache.snapshots
[INFO] snapshot org.codehaus.plexus:plexus-compiler-javac:1.6-SNAPSHOT: checking for updates
from apache.snapshots
[INFO] snapshot org.codehaus.plexus:plexus-compilers:1.6-SNAPSHOT: checking for updates from
apache.snapshots
[INFO] snapshot org.codehaus.plexus:plexus-compiler:1.6-SNAPSHOT: checking for updates from
snapshots
[INFO] snapshot org.codehaus.plexus:plexus-compiler:1.6-SNAPSHOT: checking for updates from
apache.snapshots
[INFO] snapshot org.codehaus.plexus:plexus-compiler-api:1.6-SNAPSHOT: checking for updates
from apache.snapshots
[INFO] [compiler:compile]
Compiling 18 source files to /home/continuum/continuum-maven/working-directory/41/target/classes
[INFO] [resources:testResources]
[INFO] Using default encoding to copy filtered resources.
[INFO] [compiler:testCompile]
Compiling 4 source files to /home/continuum/continuum-maven/working-directory/41/target/test-classes
[INFO] snapshot org.apache.maven.surefire:surefire-booter:2.1-SNAPSHOT: checking for updates
from snapshots
[INFO] snapshot org.apache.maven.surefire:surefire-booter:2.1-SNAPSHOT: checking for updates
from apache.snapshots
[INFO] snapshot org.apache.maven.surefire:surefire:2.1-SNAPSHOT: checking for updates from
snapshots
[INFO] snapshot org.apache.maven.surefire:surefire:2.1-SNAPSHOT: checking for updates from
apache.snapshots
[INFO] snapshot org.apache.maven.surefire:surefire-api:2.1-SNAPSHOT: checking for updates
from snapshots
[INFO] snapshot org.apache.maven.surefire:surefire-api:2.1-SNAPSHOT: checking for updates
from apache.snapshots
[INFO] [surefire:test]
[INFO] Surefire report directory: /home/continuum/continuum-maven/working-directory/41/target/surefire-reports

-------------------------------------------------------
 T E S T S
-------------------------------------------------------
Running org.apache.maven.plugin.eclipse.AddMavenRepoMojoTest
Tests run: 1, Failures: 0, Errors: 0, Skipped: 0, Time elapsed: 0.815 sec
Running org.apache.maven.plugin.eclipse.EclipsePluginTest
[ maven embedder INFO] ----------------------------------------------------------------------------
[ maven embedder INFO] Building Maven
[ maven embedder INFO]    task-segment: [org.apache.maven.plugins:maven-eclipse-plugin:clean,
org.apache.maven.plugins:maven-eclipse-plugin:eclipse]
[ maven embedder INFO] ----------------------------------------------------------------------------
[ maven embedder INFO] artifact org.apache.maven.plugins:maven-eclipse-plugin: checking for
updates from central
Downloading: http://repo1.maven.org/maven2/org/apache/maven/plugins/maven-eclipse-plugin/2.2/maven-eclipse-plugin-2.2.pom
2/2K
2K downloaded
Downloading: http://repo1.maven.org/maven2/org/apache/maven/plugins/maven-plugins/1/maven-plugins-1.pom
3/3K
3K downloaded
Downloading: http://repo1.maven.org/maven2/org/apache/maven/maven-parent/1/maven-parent-1.pom
3/6K
6/6K
6K downloaded
Downloading: http://repo1.maven.org/maven2/org/apache/apache/1/apache-1.pom
3/3K
3K downloaded
Downloading: http://repo1.maven.org/maven2/org/apache/maven/plugins/maven-eclipse-plugin/2.2/maven-eclipse-plugin-2.2.jar
3/47K
5/47K
6/47K
7/47K
11/47K
13/47K
15/47K
17/47K
18/47K
21/47K
22/47K
26/47K
27/47K
28/47K
29/47K
31/47K
33/47K
35/47K
38/47K
39/47K
41/47K
43/47K
45/47K
47/47K
47K downloaded
Downloading: http://repo1.maven.org/maven2/org/apache/maven/maven-project/2.0.1/maven-project-2.0.1.pom
1/1K
1K downloaded
Downloading: http://repo1.maven.org/maven2/org/apache/maven/maven/2.0.1/maven-2.0.1.pom
3/11K
5/11K
6/11K
7/11K
9/11K
11/11K
11K downloaded
Downloading: http://repo1.maven.org/maven2/org/apache/maven/maven-model/2.0.1/maven-model-2.0.1.pom
2/2K
2K downloaded
Downloading: http://repo1.maven.org/maven2/org/codehaus/plexus/plexus-utils/1.0.5/plexus-utils-1.0.5.pom
918/918b
918b downloaded
Downloading: http://repo1.maven.org/maven2/org/codehaus/plexus/plexus/1.0.4/plexus-1.0.4.pom
2/5K
5/5K
5K downloaded
Downloading: http://repo1.maven.org/maven2/classworlds/classworlds/1.1-alpha-2/classworlds-1.1-alpha-2.pom
3/3K
3K downloaded
Downloading: http://repo1.maven.org/maven2/org/apache/maven/maven-profile/2.0.1/maven-profile-2.0.1.pom
1/1K
1K downloaded
Downloading: http://repo1.maven.org/maven2/org/codehaus/plexus/plexus-container-default/1.0-alpha-9/plexus-container-default-1.0-alpha-9.pom
[ maven embedder INFO] ----------------------------------------------------------------------------
[ maven embedder INFO] Building Maven
[ maven embedder INFO]    task-segment: [org.apache.maven.plugins:maven-eclipse-plugin:clean,
org.apache.maven.plugins:maven-eclipse-plugin:eclipse]
[ maven embedder INFO] ----------------------------------------------------------------------------
Downloading: http://repo1.maven.org/maven2/org/codehaus/plexus/plexus-container-default/1.0-alpha-9/plexus-container-default-1.0-alpha-9.pom
1/1K
1K downloaded
Downloading: http://repo1.maven.org/maven2/org/codehaus/plexus/plexus-containers/1.0.3/plexus-containers-1.0.3.pom
492/492b
492b downloaded
Downloading: http://repo1.maven.org/maven2/org/codehaus/plexus/plexus-utils/1.0.4/plexus-utils-1.0.4.pom
3/6K
5/6K
6/6K
6K downloaded
Downloading: http://repo1.maven.org/maven2/junit/junit/3.8.1/junit-3.8.1.pom
145/145b
145b downloaded
Downloading: http://repo1.maven.org/maven2/org/apache/maven/maven-artifact-manager/2.0.1/maven-artifact-manager-2.0.1.pom
1/1K
1K downloaded
Downloading: http://repo1.maven.org/maven2/org/apache/maven/maven-repository-metadata/2.0.1/maven-repository-metadata-2.0.1.pom
1/1K
1K downloaded
Downloading: http://repo1.maven.org/maven2/org/apache/maven/wagon/wagon-provider-api/1.0-alpha-5/wagon-provider-api-1.0-alpha-5.pom
3/4K
4/4K
4K downloaded
Downloading: http://repo1.maven.org/maven2/org/apache/maven/maven-artifact/2.0.1/maven-artifact-2.0.1.pom
765/765b
765b downloaded
[ maven embedder INFO] ----------------------------------------------------------------------------
[ maven embedder INFO] Building Maven
[ maven embedder INFO]    task-segment: [org.apache.maven.plugins:maven-eclipse-plugin:clean,
org.apache.maven.plugins:maven-eclipse-plugin:eclipse]
[ maven embedder INFO] ----------------------------------------------------------------------------
Downloading: http://repo1.maven.org/maven2/org/apache/maven/maven-artifact/2.0.1/maven-artifact-2.0.1.pom
765/765b
765b downloaded
Downloading: http://repo1.maven.org/maven2/org/apache/maven/maven-plugin-api/2.0.1/maven-plugin-api-2.0.1.pom
643/643b
643b downloaded
[ maven embedder INFO] [eclipse:clean]
[ maven embedder INFO] Deleting .project file...
[ maven embedder INFO] Deleting .classpath file...
[ maven embedder INFO] Deleting .wtpmodules file...
[ maven embedder INFO] Deleting .component file...
[ maven embedder INFO] Deleting org.eclipse.wst.common.component file...
[ maven embedder INFO] Deleting org.eclipse.wst.common.project.facet.core.xml file...
[ maven embedder INFO] Preparing eclipse:eclipse
[ maven embedder INFO] artifact org.apache.maven.plugins:maven-compiler-plugin: checking for
updates from central
Downloading: http://repo1.maven.org/maven2/org/apache/maven/plugins/maven-compiler-plugin/2.0.1/maven-compiler-plugin-2.0.1.pom
1/1K
1K downloaded
Downloading: http://repo1.maven.org/maven2/org/apache/maven/plugins/maven-compiler-plugin/2.0.1/maven-compiler-plugin-2.0.1.jar
3/14K
5/14K
7/14K
9/14K
10/14K
13/14K
14/14K
14K downloaded
[ maven embedder INFO] No goals needed for project - skipping
[ maven embedder INFO] [eclipse:eclipse]
[ maven embedder INFO] Adding support for WTP version R7.
[ maven embedder WARNING] This plugin currently doesn't support include patterns for resources.
Adding the entire directory.
[ maven embedder WARNING] This plugin currently doesn't support exclude patterns for resources.
Adding the entire directory.
[ maven embedder WARNING] This plugin currently doesn't support include patterns for resources.
Adding the entire directory.
[ maven embedder WARNING] This plugin currently doesn't support exclude patterns for resources.
Adding the entire directory.
[ maven embedder INFO] Not writing settings - defaults suffice
[ maven embedder INFO] Wrote Eclipse project for "maven-eclipse-plugin-test-project-3" to
/home/continuum/continuum-maven/working-directory/41/target/test-classes/projects/project-3.
[ maven embedder INFO] 
       Sources for some artifacts are not available.
       Please run the same goal with the -DdownloadSources=true parameter in order to check
remote repositories for sources.
       List of artifacts without a source archive:
         o junit:junit:2.0

[ maven embedder INFO] ----------------------------------------------------------------------------
[ maven embedder INFO] Building Maven
[ maven embedder INFO]    task-segment: [org.apache.maven.plugins:maven-eclipse-plugin:clean,
org.apache.maven.plugins:maven-eclipse-plugin:eclipse]
[ maven embedder INFO] ----------------------------------------------------------------------------
[ maven embedder INFO] [eclipse:clean]
[ maven embedder INFO] Deleting .project file...
[ maven embedder INFO] Deleting .classpath file...
[ maven embedder INFO] Deleting .wtpmodules file...
[ maven embedder INFO] Deleting .component file...
[ maven embedder INFO] Deleting org.eclipse.wst.common.component file...
[ maven embedder INFO] Deleting org.eclipse.wst.common.project.facet.core.xml file...
[ maven embedder INFO] Preparing eclipse:eclipse
[ maven embedder INFO] No goals needed for project - skipping
[ maven embedder INFO] [eclipse:eclipse]
[ maven embedder INFO] Adding support for WTP version R7.
[ maven embedder INFO] Wrote settings to /home/continuum/continuum-maven/working-directory/41/target/project-4-test/maven-eclipse-plugin-test-project-4/.settings/org.eclipse.jdt.core.prefs
[ maven embedder INFO] Wrote Eclipse project for "maven-eclipse-plugin-test-project-4" to
/home/continuum/continuum-maven/working-directory/41/target/test-classes/projects/project-4/../../../../target/project-4-test/maven-eclipse-plugin-test-project-4.
[ maven embedder INFO] 
       Sources for some artifacts are not available.
       Please run the same goal with the -DdownloadSources=true parameter in order to check
remote repositories for sources.
       List of artifacts without a source archive:
         o junit:junit:2.0

[ maven embedder INFO] ----------------------------------------------------------------------------
[ maven embedder INFO] Building Maven
[ maven embedder INFO]    task-segment: [org.apache.maven.plugins:maven-eclipse-plugin:clean,
org.apache.maven.plugins:maven-eclipse-plugin:eclipse]
[ maven embedder INFO] ----------------------------------------------------------------------------
[ maven embedder INFO] [eclipse:clean]
[ maven embedder INFO] Deleting .project file...
[ maven embedder INFO] Deleting .classpath file...
[ maven embedder INFO] Deleting .wtpmodules file...
[ maven embedder INFO] Deleting .component file...
[ maven embedder INFO] Deleting org.eclipse.wst.common.component file...
[ maven embedder INFO] Deleting org.eclipse.wst.common.project.facet.core.xml file...
[ maven embedder INFO] Preparing eclipse:eclipse
[ maven embedder INFO] No goals needed for project - skipping
[ maven embedder INFO] [eclipse:eclipse]
[ maven embedder INFO] Adding support for WTP version R7.
[ maven embedder WARNING] You did specify a list of classpath containers without the base
org.eclipse.jdt.launching.JRE_CONTAINER.
       If you specify custom classpath containers you should also add org.eclipse.jdt.launching.JRE_CONTAINER
to the list
[ maven embedder INFO] Wrote settings to /home/continuum/continuum-maven/working-directory/41/target/test-classes/projects/project-5/.settings/org.eclipse.jdt.core.prefs
[ maven embedder INFO] Wrote Eclipse project for "maven-eclipse-plugin-test-project-5" to
/home/continuum/continuum-maven/working-directory/41/target/test-classes/projects/project-5.
[ maven embedder INFO] ----------------------------------------------------------------------------
[ maven embedder INFO] Building Maven
[ maven embedder INFO]    task-segment: [org.apache.maven.plugins:maven-eclipse-plugin:clean,
org.apache.maven.plugins:maven-eclipse-plugin:eclipse]
[ maven embedder INFO] ----------------------------------------------------------------------------
[ maven embedder INFO] [eclipse:clean]
[ maven embedder INFO] Deleting .project file...
[ maven embedder INFO] Deleting .classpath file...
[ maven embedder INFO] Deleting .wtpmodules file...
[ maven embedder INFO] Deleting .component file...
[ maven embedder INFO] Deleting org.eclipse.wst.common.component file...
[ maven embedder INFO] Deleting org.eclipse.wst.common.project.facet.core.xml file...
[ maven embedder INFO] Preparing eclipse:eclipse
[ maven embedder INFO] No goals needed for project - skipping
[ maven embedder INFO] [eclipse:eclipse]
[ maven embedder INFO] Adding support for WTP version R7.
[ maven embedder INFO] Not writing settings - defaults suffice
[ maven embedder INFO] Wrote Eclipse project for "maven-eclipse-plugin-test-project-6" to
/home/continuum/continuum-maven/working-directory/41/target/test-classes/projects/project-6.
[ maven embedder INFO] ----------------------------------------------------------------------------
[ maven embedder INFO] Building Maven
[ maven embedder INFO]    task-segment: [org.apache.maven.plugins:maven-eclipse-plugin:clean,
org.apache.maven.plugins:maven-eclipse-plugin:eclipse]
[ maven embedder INFO] ----------------------------------------------------------------------------
[ maven embedder INFO] [eclipse:clean]
[ maven embedder INFO] Deleting .project file...
[ maven embedder INFO] Deleting .classpath file...
[ maven embedder INFO] Deleting .wtpmodules file...
[ maven embedder INFO] Deleting .component file...
[ maven embedder INFO] Deleting org.eclipse.wst.common.component file...
[ maven embedder INFO] Deleting org.eclipse.wst.common.project.facet.core.xml file...
[ maven embedder INFO] Preparing eclipse:eclipse
[ maven embedder INFO] No goals needed for project - skipping
[ maven embedder INFO] [eclipse:eclipse]
[ maven embedder INFO] Adding support for WTP version R7.
[ maven embedder INFO] Not writing settings - defaults suffice
[ maven embedder INFO] Wrote Eclipse project for "maven-eclipse-plugin-test-project-8" to
/home/continuum/continuum-maven/working-directory/41/target/test-classes/projects/project-8.
[ maven embedder INFO] ----------------------------------------------------------------------------
[ maven embedder INFO] Building Maven
[ maven embedder INFO]    task-segment: [org.apache.maven.plugins:maven-eclipse-plugin:clean,
org.apache.maven.plugins:maven-eclipse-plugin:eclipse]
[ maven embedder INFO] ----------------------------------------------------------------------------
[ maven embedder INFO] [eclipse:clean]
[ maven embedder INFO] Deleting .project file...
[ maven embedder INFO] Deleting .classpath file...
[ maven embedder INFO] Deleting .wtpmodules file...
[ maven embedder INFO] Deleting .component file...
[ maven embedder INFO] Deleting org.eclipse.wst.common.component file...
[ maven embedder INFO] Deleting org.eclipse.wst.common.project.facet.core.xml file...
[ maven embedder INFO] Preparing eclipse:eclipse
[ maven embedder INFO] No goals needed for project - skipping
[ maven embedder INFO] [eclipse:eclipse]
[ maven embedder INFO] Adding support for WTP version R7.
[ maven embedder INFO] Not writing settings - defaults suffice
[ maven embedder INFO] Wrote Eclipse project for "maven-eclipse-plugin-test-project-9" to
/home/continuum/continuum-maven/working-directory/41/target/test-classes/projects/project-9/../../../../target/project-9-test/maven-eclipse-plugin-test-project-9.
[ maven embedder INFO] 
       Sources for some artifacts are not available.
       Please run the same goal with the -DdownloadSources=true parameter in order to check
remote repositories for sources.
       List of artifacts without a source archive:
         o junit:junit:2.0

[ maven embedder INFO] ----------------------------------------------------------------------------
[ maven embedder INFO] Building Maven
[ maven embedder INFO]    task-segment: [org.apache.maven.plugins:maven-eclipse-plugin:clean,
org.apache.maven.plugins:maven-eclipse-plugin:eclipse]
[ maven embedder INFO] ----------------------------------------------------------------------------
[ maven embedder INFO] [eclipse:clean]
[ maven embedder INFO] Deleting .project file...
[ maven embedder INFO] Deleting .classpath file...
[ maven embedder INFO] Deleting .wtpmodules file...
[ maven embedder INFO] Deleting .component file...
[ maven embedder INFO] Deleting org.eclipse.wst.common.component file...
[ maven embedder INFO] Deleting org.eclipse.wst.common.project.facet.core.xml file...
[ maven embedder INFO] Preparing eclipse:eclipse
[ maven embedder INFO] No goals needed for project - skipping
[ maven embedder INFO] [eclipse:eclipse]
[ maven embedder INFO] Adding support for WTP version R7.
[ maven embedder INFO] Wrote settings to /home/continuum/continuum-maven/working-directory/41/target/test-classes/projects/project-10/.settings/org.eclipse.jdt.core.prefs
[ maven embedder INFO] Wrote Eclipse project for "maven-eclipse-plugin-test-project-2" to
/home/continuum/continuum-maven/working-directory/41/target/test-classes/projects/project-10.
[ maven embedder INFO] 
       Sources for some artifacts are not available.
       Please run the same goal with the -DdownloadSources=true parameter in order to check
remote repositories for sources.
       List of artifacts without a source archive:
         o junit:junit:3.0

[ maven embedder INFO] ----------------------------------------------------------------------------
[ maven embedder INFO] Building Maven
[ maven embedder INFO]    task-segment: [org.apache.maven.plugins:maven-eclipse-plugin:clean,
org.apache.maven.plugins:maven-eclipse-plugin:eclipse]
[ maven embedder INFO] ----------------------------------------------------------------------------
[ maven embedder INFO] [eclipse:clean]
[ maven embedder INFO] Deleting .project file...
[ maven embedder INFO] Deleting .classpath file...
[ maven embedder INFO] Deleting .wtpmodules file...
[ maven embedder INFO] Deleting .component file...
[ maven embedder INFO] Deleting org.eclipse.wst.common.component file...
[ maven embedder INFO] Deleting org.eclipse.wst.common.project.facet.core.xml file...
[ maven embedder INFO] Preparing eclipse:eclipse
Downloading: http://repo1.maven.org/maven2/org/codehaus/modello/modello-maven-plugin/1.0-alpha-7/modello-maven-plugin-1.0-alpha-7.pom
1/2K
2/2K
2K downloaded
Downloading: http://repo1.maven.org/maven2/org/codehaus/modello/modello/1.0-alpha-7/modello-1.0-alpha-7.pom
2/8K
3/8K
5/8K
6/8K
8/8K
8K downloaded
Downloading: http://repo1.maven.org/maven2/org/codehaus/modello/modello-maven-plugin/1.0-alpha-7/modello-maven-plugin-1.0-alpha-7.jar
3/10K
5/10K
9/10K
10/10K
10K downloaded
Downloading: http://repo1.maven.org/maven2/org/codehaus/modello/modello-plugin-xsd/1.0-alpha-7/modello-plugin-xsd-1.0-alpha-7.pom
605/605b
605b downloaded
Downloading: http://repo1.maven.org/maven2/org/codehaus/modello/modello-plugins/1.0-alpha-7/modello-plugins-1.0-alpha-7.pom
1/1K
1K downloaded
Downloading: http://repo1.maven.org/maven2/org/codehaus/modello/modello-core/1.0-alpha-7/modello-core-1.0-alpha-7.pom
783/783b
783b downloaded
Downloading: http://repo1.maven.org/maven2/org/codehaus/plexus/plexus-container-default/1.0-alpha-8/plexus-container-default-1.0-alpha-8.pom
2/7K
3/7K
6/7K
7/7K
7K downloaded
Downloading: http://repo1.maven.org/maven2/org/codehaus/modello/modello-plugin-xml/1.0-alpha-7/modello-plugin-xml-1.0-alpha-7.pom
402/402b
402b downloaded
Downloading: http://repo1.maven.org/maven2/org/codehaus/modello/modello-plugin-xpp3/1.0-alpha-7/modello-plugin-xpp3-1.0-alpha-7.pom
762/762b
762b downloaded
Downloading: http://repo1.maven.org/maven2/org/codehaus/modello/modello-plugin-xdoc/1.0-alpha-7/modello-plugin-xdoc-1.0-alpha-7.pom
607/607b
607b downloaded
Downloading: http://repo1.maven.org/maven2/org/codehaus/modello/modello-plugin-jpox/1.0-alpha-7/modello-plugin-jpox-1.0-alpha-7.pom
609/609b
609b downloaded
Downloading: http://repo1.maven.org/maven2/org/codehaus/modello/modello-plugin-store/1.0-alpha-7/modello-plugin-store-1.0-alpha-7.pom
568/568b
568b downloaded
Downloading: http://repo1.maven.org/maven2/org/codehaus/plexus/plexus-velocity/1.1.2/plexus-velocity-1.1.2.pom
2/7K
5/7K
6/7K
7/7K
7K downloaded
[ maven embedder INFO] ----------------------------------------------------------------------------
[ maven embedder INFO] Building Unnamed - eclipse:maven-eclipse-plugin-test-project-12:ear:12
[ maven embedder INFO]    task-segment: [org.apache.maven.plugins:maven-eclipse-plugin:clean,
org.apache.maven.plugins:maven-eclipse-plugin:eclipse]
[ maven embedder INFO] ----------------------------------------------------------------------------
[ maven embedder INFO] [eclipse:clean]
[ maven embedder INFO] Deleting .project file...
[ maven embedder INFO] Deleting .classpath file...
[ maven embedder INFO] Deleting .wtpmodules file...
[ maven embedder INFO] Deleting .component file...
[ maven embedder INFO] Deleting org.eclipse.wst.common.component file...
[ maven embedder INFO] Deleting org.eclipse.wst.common.project.facet.core.xml file...
[ maven embedder INFO] Preparing eclipse:eclipse
[ maven embedder INFO] artifact org.apache.maven.plugins:maven-ear-plugin: checking for updates
from central
[ maven embedder WARNING] repository metadata for: 'artifact org.apache.maven.plugins:maven-ear-plugin'
could not be retrieved from repository: central due to an error: Error transferring file
[ maven embedder INFO] Repository 'central' will be blacklisted
[ maven embedder INFO] ----------------------------------------------------------------------------
[ maven embedder INFO] Building maven-eclipse-plugin-test-project-14en
[ maven embedder INFO]    task-segment: [org.apache.maven.plugins:maven-eclipse-plugin:clean,
org.apache.maven.plugins:maven-eclipse-plugin:eclipse]
[ maven embedder INFO] ----------------------------------------------------------------------------
[ maven embedder INFO] [eclipse:clean]
[ maven embedder INFO] Deleting .project file...
[ maven embedder INFO] Deleting .classpath file...
[ maven embedder INFO] Deleting .wtpmodules file...
[ maven embedder INFO] Deleting .component file...
[ maven embedder INFO] Deleting org.eclipse.wst.common.component file...
[ maven embedder INFO] Deleting org.eclipse.wst.common.project.facet.core.xml file...
[ maven embedder INFO] Preparing eclipse:eclipse
[ maven embedder INFO] No goals needed for project - skipping
[ maven embedder INFO] [eclipse:eclipse]
[ maven embedder INFO] Not writing settings - defaults suffice
[ maven embedder INFO] Wrote Eclipse project for "maven-eclipse-plugin-test-project-14" to
/home/continuum/continuum-maven/working-directory/41/target/test-classes/projects/project-14.
[ maven embedder INFO] ----------------------------------------------------------------------------
[ maven embedder INFO] Building maven-eclipse-plugin-test-project-15
[ maven embedder INFO]    task-segment: [org.apache.maven.plugins:maven-eclipse-plugin:clean,
org.apache.maven.plugins:maven-eclipse-plugin:eclipse]
[ maven embedder INFO] ----------------------------------------------------------------------------
[ maven embedder INFO] [eclipse:clean]
[ maven embedder INFO] Deleting .project file...
[ maven embedder INFO] Deleting .classpath file...
[ maven embedder INFO] Deleting .wtpmodules file...
[ maven embedder INFO] Deleting .component file...
[ maven embedder INFO] Deleting org.eclipse.wst.common.component file...
[ maven embedder INFO] Deleting org.eclipse.wst.common.project.facet.core.xml file...
[ maven embedder INFO] Preparing eclipse:eclipse
[ maven embedder INFO] No goals needed for project - skipping
[ maven embedder INFO] [eclipse:eclipse]
[ maven embedder INFO] Not writing settings - defaults suffice
[ maven embedder INFO] Wrote Eclipse project for "maven-eclipse-plugin-test-project-15" to
/home/continuum/continuum-maven/working-directory/41/target/test-classes/projects/project-15.
[ maven embedder INFO] ----------------------------------------------------------------------------
[ maven embedder INFO] Building maven-eclipse-plugin-test-project-18
[ maven embedder INFO]    task-segment: [org.apache.maven.plugins:maven-eclipse-plugin:clean,
org.apache.maven.plugins:maven-eclipse-plugin:eclipse]
[ maven embedder INFO] ----------------------------------------------------------------------------
[ maven embedder INFO] [eclipse:clean]
[ maven embedder INFO] Deleting .project file...
[ maven embedder INFO] Deleting .classpath file...
[ maven embedder INFO] Deleting .wtpmodules file...
[ maven embedder INFO] Deleting .component file...
[ maven embedder INFO] Deleting org.eclipse.wst.common.component file...
[ maven embedder INFO] Deleting org.eclipse.wst.common.project.facet.core.xml file...
[ maven embedder INFO] Preparing eclipse:eclipse
[ maven embedder INFO] No goals needed for project - skipping
[ maven embedder INFO] [eclipse:eclipse]
[ maven embedder INFO] Not writing settings - defaults suffice
[ maven embedder INFO] Wrote Eclipse project for "maven-eclipse-plugin-test-project-18" to
/home/continuum/continuum-maven/working-directory/41/target/test-classes/projects/project-18/../../../../target/project-18-test/maven-eclipse-plugin-test-project-18.
[ maven embedder INFO] ----------------------------------------------------------------------------
[ maven embedder INFO] Building maven-eclipse-plugin-test-project-19
[ maven embedder INFO]    task-segment: [org.apache.maven.plugins:maven-eclipse-plugin:clean,
org.apache.maven.plugins:maven-eclipse-plugin:eclipse]
[ maven embedder INFO] ----------------------------------------------------------------------------
[ maven embedder INFO] [eclipse:clean]
[ maven embedder INFO] Deleting .project file...
[ maven embedder INFO] Deleting .classpath file...
[ maven embedder INFO] Deleting .wtpmodules file...
[ maven embedder INFO] Deleting .component file...
[ maven embedder INFO] Deleting org.eclipse.wst.common.component file...
[ maven embedder INFO] Deleting org.eclipse.wst.common.project.facet.core.xml file...
[ maven embedder INFO] Preparing eclipse:eclipse
[ maven embedder INFO] No goals needed for project - skipping
[ maven embedder INFO] [eclipse:eclipse]
[ maven embedder INFO] Not writing settings - defaults suffice
[ maven embedder INFO] Wrote Eclipse project for "maven-eclipse-plugin-test-project-19" to
/home/continuum/continuum-maven/working-directory/41/target/test-classes/projects/project-19.
[ maven embedder INFO] ----------------------------------------------------------------------------
[ maven embedder INFO] Building maven-eclipse-plugin-test-project-20
[ maven embedder INFO]    task-segment: [org.apache.maven.plugins:maven-eclipse-plugin:clean,
org.apache.maven.plugins:maven-eclipse-plugin:eclipse]
[ maven embedder INFO] ----------------------------------------------------------------------------
[ maven embedder INFO] [eclipse:clean]
[ maven embedder INFO] Deleting .project file...
[ maven embedder INFO] Deleting .classpath file...
[ maven embedder INFO] Deleting .wtpmodules file...
[ maven embedder INFO] Deleting .component file...
[ maven embedder INFO] Deleting org.eclipse.wst.common.component file...
[ maven embedder INFO] Deleting org.eclipse.wst.common.project.facet.core.xml file...
[ maven embedder INFO] Preparing eclipse:eclipse
[ maven embedder INFO] No goals needed for project - skipping
[ maven embedder INFO] [eclipse:eclipse]
[ maven embedder INFO] Adding support for WTP version 1.5.
[ maven embedder INFO] Not writing settings - defaults suffice
[ maven embedder INFO] Wrote Eclipse project for "maven-eclipse-plugin-test-project-20" to
/home/continuum/continuum-maven/working-directory/41/target/test-classes/projects/project-20.
Tests run: 17, Failures: 0, Errors: 5, Skipped: 0, Time elapsed: 37.489 sec <<< FAILURE!

Results :
Tests run: 18, Failures: 0, Errors: 5, Skipped: 0

[INFO] ------------------------------------------------------------------------
[ERROR] BUILD FAILURE
[INFO] ------------------------------------------------------------------------
[INFO] There are test failures.
[INFO] ------------------------------------------------------------------------
[INFO] For more information, run Maven with the -e switch
[INFO] ------------------------------------------------------------------------
[INFO] Total time: 1 minute 18 seconds
[INFO] Finished at: Sun Jul 16 06:06:19 PDT 2006
[INFO] Final Memory: 13M/157M
[INFO] ------------------------------------------------------------------------

****************************************************************************



Mime
View raw message