maven-notifications mailing list archives

Site index · List index
Message view « Date » · « Thread »
Top « Date » · « Thread »
From Continuum Build Server <contin...@ci.codehaus.org>
Subject [continuum] BUILD FAILURE: Maven Repository Manager Web Application
Date Sat, 15 Jul 2006 06:14:58 GMT
Online report : http://ci.codehaus.org/continuum-maven/servlet/continuum/target/ProjectBuild.vm/view/ProjectBuild/id/114/buildId/6664
Build statistics:
  State: Failed
  Previous State: Failed
  Started at: Fri, 14 Jul 2006 23:14:41 -0700
  Finished at: Fri, 14 Jul 2006 23:14:58 -0700
  Total time: 16s
  Build Trigger: Forced
  Exit code: 1
  Building machine hostname: cheddar.simulalabs.com
  Operating system : Linux(unknown)
  Java version : 1.5.0_03(Sun Microsystems Inc.)

Changes
      No files changed
  
****************************************************************************
Output:
****************************************************************************
[INFO] Scanning for projects...
[INFO] snapshot org.apache.maven.repository:maven-repository-manager:1.0-SNAPSHOT: checking
for updates from codehaus.snapshots
[INFO] ----------------------------------------------------------------------------
[INFO] Building Maven Repository Manager Web Application
[INFO]    task-segment: [clean, install]
[INFO] ----------------------------------------------------------------------------
[INFO] artifact org.codehaus.mojo:dependency-maven-plugin: checking for updates from codehaus.snapshots
[INFO] snapshot org.codehaus.mojo:dependency-maven-plugin:1.1-SNAPSHOT: checking for updates
from codehaus.snapshots
[INFO] artifact org.mortbay.jetty:maven-jetty6-plugin: checking for updates from codehaus.snapshots
[INFO] [clean:clean]
[INFO] Deleting directory /home/continuum/continuum-maven/working-directory/114/target
[INFO] Deleting directory /home/continuum/continuum-maven/working-directory/114/target/classes
[INFO] Deleting directory /home/continuum/continuum-maven/working-directory/114/target/test-classes
[INFO] artifact org.apache.maven.plugins:maven-war-plugin: checking for updates from codehaus.snapshots
[INFO] snapshot org.apache.maven.plugins:maven-war-plugin:2.1-SNAPSHOT: checking for updates
from codehaus.snapshots
[INFO] [plexus:descriptor {execution: default}]
[INFO] [plexus:descriptor {execution: default}]
[INFO] [resources:resources]
[INFO] Using default encoding to copy filtered resources.
[INFO] [plexus:merge-descriptors {execution: merge}]
[INFO] [dependency:copy {execution: copy}]
[INFO] Configured Artifact: org.apache.maven.repository:maven-repository-artifact-applet:null:1.0-SNAPSHOT:jar
[INFO] snapshot org.apache.maven.repository:maven-repository-artifact-applet:1.0-SNAPSHOT:
checking for updates from codehaus.snapshots
[INFO] snapshot org.apache.maven.repository:maven-repository-artifact-applet:1.0-SNAPSHOT:
checking for updates from apache.snapshots
[INFO] Copying /home/continuum/.m2/repository/org/apache/maven/repository/maven-repository-artifact-applet/1.0-SNAPSHOT/maven-repository-artifact-applet-1.0-SNAPSHOT.jar
to /home/continuum/continuum-maven/working-directory/114/src/main/webapp/maven-repository-artifact-applet.jar
[INFO] [plexus:merge-descriptors {execution: merge}]
[INFO] snapshot org.apache.maven.repository:maven-repository-proxy:1.0-SNAPSHOT: checking
for updates from codehaus.snapshots
[INFO] snapshot org.apache.maven.repository:maven-repository-proxy:1.0-SNAPSHOT: checking
for updates from apache.snapshots
[INFO] snapshot org.apache.maven.repository:maven-repository-discovery:1.0-SNAPSHOT: checking
for updates from codehaus.snapshots
[INFO] snapshot org.apache.maven.repository:maven-repository-discovery:1.0-SNAPSHOT: checking
for updates from apache.snapshots
[WARNING] 
	Artifact junit:junit:jar:3.8.1:test retains local scope 'test' overriding broader scope 'compile'
	given by a dependency. If this is not intended, modify or remove the local scope.

[INFO] snapshot org.apache.maven.repository:maven-repository-configuration:1.0-SNAPSHOT: checking
for updates from codehaus.snapshots
[INFO] snapshot org.apache.maven.repository:maven-repository-configuration:1.0-SNAPSHOT: checking
for updates from apache.snapshots
[INFO] snapshot org.codehaus.plexus:plexus-xwork-integration-single:1.0-alpha-2-SNAPSHOT:
checking for updates from codehaus.snapshots
[INFO] snapshot org.codehaus.plexus:plexus-xwork-integration-single:1.0-alpha-2-SNAPSHOT:
checking for updates from apache.snapshots
[INFO] snapshot org.codehaus.plexus:plexus-components:1.1.6-SNAPSHOT: checking for updates
from codehaus.snapshots
[INFO] snapshot org.codehaus.plexus:plexus-components:1.1.6-SNAPSHOT: checking for updates
from apache.snapshots
[INFO] snapshot org.codehaus.plexus:plexus-container-default:1.0-alpha-10-SNAPSHOT: checking
for updates from codehaus.snapshots
[INFO] snapshot org.codehaus.plexus:plexus-container-default:1.0-alpha-10-SNAPSHOT: checking
for updates from apache.snapshots
[INFO] snapshot org.codehaus.plexus:plexus-containers:1.0.5-SNAPSHOT: checking for updates
from codehaus.snapshots
[INFO] snapshot org.codehaus.plexus:plexus-containers:1.0.5-SNAPSHOT: checking for updates
from apache.snapshots
[INFO] snapshot org.apache.maven.repository:maven-repository-indexer:1.0-SNAPSHOT: checking
for updates from codehaus.snapshots
[INFO] snapshot org.apache.maven.repository:maven-repository-indexer:1.0-SNAPSHOT: checking
for updates from apache.snapshots
[INFO] snapshot org.apache.maven.repository:maven-repository-core:1.0-SNAPSHOT: checking for
updates from codehaus.snapshots
[INFO] snapshot org.apache.maven.repository:maven-repository-core:1.0-SNAPSHOT: checking for
updates from apache.snapshots
[INFO] snapshot org.apache.maven.repository:maven-repository-reports-standard:1.0-SNAPSHOT:
checking for updates from codehaus.snapshots
[INFO] snapshot org.apache.maven.repository:maven-repository-reports-standard:1.0-SNAPSHOT:
checking for updates from apache.snapshots
[INFO] snapshot org.apache.maven.repository:maven-repository-converter:1.0-SNAPSHOT: checking
for updates from codehaus.snapshots
[INFO] snapshot org.apache.maven.repository:maven-repository-converter:1.0-SNAPSHOT: checking
for updates from apache.snapshots
[INFO] [compiler:compile]
Compiling 15 source files to /home/continuum/continuum-maven/working-directory/114/target/classes
[INFO] ------------------------------------------------------------------------
[ERROR] BUILD FAILURE
[INFO] ------------------------------------------------------------------------
[INFO] Compilation failure

/home/continuum/continuum-maven/working-directory/114/src/main/java/org/apache/maven/repository/manager/web/job/DiscovererScheduler.java:[21,37]
package org.codehaus.plexus.scheduler does not exist

/home/continuum/continuum-maven/working-directory/114/src/main/java/org/apache/maven/repository/manager/web/job/DiscovererScheduler.java:[22,37]
package org.codehaus.plexus.scheduler does not exist

/home/continuum/continuum-maven/working-directory/114/src/main/java/org/apache/maven/repository/manager/web/job/DiscovererScheduler.java:[23,18]
package org.quartz does not exist

/home/continuum/continuum-maven/working-directory/114/src/main/java/org/apache/maven/repository/manager/web/job/DiscovererScheduler.java:[24,18]
package org.quartz does not exist

/home/continuum/continuum-maven/working-directory/114/src/main/java/org/apache/maven/repository/manager/web/job/DiscovererScheduler.java:[25,18]
package org.quartz does not exist

/home/continuum/continuum-maven/working-directory/114/src/main/java/org/apache/maven/repository/manager/web/job/DiscovererScheduler.java:[26,18]
package org.quartz does not exist

/home/continuum/continuum-maven/working-directory/114/src/main/java/org/apache/maven/repository/manager/web/job/DiscovererScheduler.java:[41,12]
cannot find symbol
symbol  : class Scheduler
location: class org.apache.maven.repository.manager.web.job.DiscovererScheduler

/home/continuum/continuum-maven/working-directory/114/src/main/java/org/apache/maven/repository/manager/web/job/DiscovererScheduler.java:[56,31]
cannot find symbol
symbol  : class SchedulerException
location: class org.apache.maven.repository.manager.web.job.DiscovererScheduler

/home/continuum/continuum-maven/working-directory/114/src/main/java/org/apache/maven/repository/manager/web/job/DiscovererJob.java:[21,37]
package org.codehaus.plexus.scheduler does not exist

/home/continuum/continuum-maven/working-directory/114/src/main/java/org/apache/maven/repository/manager/web/job/DiscovererJob.java:[22,18]
package org.quartz does not exist

/home/continuum/continuum-maven/working-directory/114/src/main/java/org/apache/maven/repository/manager/web/job/DiscovererJob.java:[23,18]
package org.quartz does not exist

/home/continuum/continuum-maven/working-directory/114/src/main/java/org/apache/maven/repository/manager/web/job/DiscovererJob.java:[24,18]
package org.quartz does not exist

/home/continuum/continuum-maven/working-directory/114/src/main/java/org/apache/maven/repository/manager/web/job/DiscovererJob.java:[34,12]
cannot find symbol
symbol: class AbstractJob
    extends AbstractJob

/home/continuum/continuum-maven/working-directory/114/src/main/java/org/apache/maven/repository/manager/web/job/DiscovererJob.java:[47,25]
cannot find symbol
symbol  : class JobExecutionContext
location: class org.apache.maven.repository.manager.web.job.DiscovererJob

/home/continuum/continuum-maven/working-directory/114/src/main/java/org/apache/maven/repository/manager/web/job/DiscovererJob.java:[48,15]
cannot find symbol
symbol  : class JobExecutionException
location: class org.apache.maven.repository.manager.web.job.DiscovererJob

/home/continuum/continuum-maven/working-directory/114/src/main/java/org/apache/maven/repository/manager/web/job/DiscovererScheduler.java:[58,8]
cannot find symbol
symbol  : class JobDetail
location: class org.apache.maven.repository.manager.web.job.DiscovererScheduler

/home/continuum/continuum-maven/working-directory/114/src/main/java/org/apache/maven/repository/manager/web/job/DiscovererScheduler.java:[58,34]
cannot find symbol
symbol  : class JobDetail
location: class org.apache.maven.repository.manager.web.job.DiscovererScheduler

/home/continuum/continuum-maven/working-directory/114/src/main/java/org/apache/maven/repository/manager/web/job/DiscovererScheduler.java:[59,8]
cannot find symbol
symbol  : class JobDataMap
location: class org.apache.maven.repository.manager.web.job.DiscovererScheduler

/home/continuum/continuum-maven/working-directory/114/src/main/java/org/apache/maven/repository/manager/web/job/DiscovererScheduler.java:[59,33]
cannot find symbol
symbol  : class JobDataMap
location: class org.apache.maven.repository.manager.web.job.DiscovererScheduler

/home/continuum/continuum-maven/working-directory/114/src/main/java/org/apache/maven/repository/manager/web/job/DiscovererScheduler.java:[60,21]
cannot find symbol
symbol  : variable AbstractJob
location: class org.apache.maven.repository.manager.web.job.DiscovererScheduler

/home/continuum/continuum-maven/working-directory/114/src/main/java/org/apache/maven/repository/manager/web/job/DiscovererScheduler.java:[64,8]
cannot find symbol
symbol  : class CronTrigger
location: class org.apache.maven.repository.manager.web.job.DiscovererScheduler

/home/continuum/continuum-maven/working-directory/114/src/main/java/org/apache/maven/repository/manager/web/job/DiscovererScheduler.java:[64,34]
cannot find symbol
symbol  : class CronTrigger
location: class org.apache.maven.repository.manager.web.job.DiscovererScheduler

/home/continuum/continuum-maven/working-directory/114/src/main/java/org/apache/maven/repository/manager/web/job/DiscovererJob.java:[50,8]
cannot find symbol
symbol  : class JobDataMap
location: class org.apache.maven.repository.manager.web.job.DiscovererJob

/home/continuum/continuum-maven/working-directory/114/src/main/java/org/apache/maven/repository/manager/web/job/DiscovererJob.java:[52,8]
cannot find symbol
symbol  : method getLogger()
location: class org.apache.maven.repository.manager.web.job.DiscovererJob

/home/continuum/continuum-maven/working-directory/114/src/main/java/org/apache/maven/repository/manager/web/job/DiscovererJob.java:[61,12]
cannot find symbol
symbol  : method getLogger()
location: class org.apache.maven.repository.manager.web.job.DiscovererJob

/home/continuum/continuum-maven/working-directory/114/src/main/java/org/apache/maven/repository/manager/web/job/DiscovererJob.java:[65,12]
cannot find symbol
symbol  : method getLogger()
location: class org.apache.maven.repository.manager.web.job.DiscovererJob

/home/continuum/continuum-maven/working-directory/114/src/main/java/org/apache/maven/repository/manager/web/job/DiscovererJob.java:[68,8]
cannot find symbol
symbol  : method getLogger()
location: class org.apache.maven.repository.manager.web.job.DiscovererJob


[INFO] ------------------------------------------------------------------------
[INFO] For more information, run Maven with the -e switch
[INFO] ------------------------------------------------------------------------
[INFO] Total time: 15 seconds
[INFO] Finished at: Fri Jul 14 23:14:58 PDT 2006
[INFO] Final Memory: 12M/157M
[INFO] ------------------------------------------------------------------------

****************************************************************************



Mime
View raw message