maven-notifications mailing list archives

Site index · List index
Message view « Date » · « Thread »
Top « Date » · « Thread »
From Continuum Build Server <contin...@ci.codehaus.org>
Subject [continuum] BUILD SUCCESSFUL: Maven Eclipse Plugin
Date Wed, 19 Jul 2006 13:10:07 GMT
Online report : http://ci.codehaus.org/continuum-maven/servlet/continuum/target/ProjectBuild.vm/view/ProjectBuild/id/41/buildId/6779
Build statistics:
  State: Ok
  Previous State: Failed
  Started at: Wed, 19 Jul 2006 06:05:41 -0700
  Finished at: Wed, 19 Jul 2006 06:10:07 -0700
  Total time: 4m 25s
  Build Trigger: Schedule
  Exit code: 0
  Building machine hostname: cheddar.simulalabs.com
  Operating system : Linux(unknown)
  Java version : 1.5.0_03(Sun Microsystems Inc.)

Changes
         epunzalan          PR: MECLIPSE-125

Improved documentation based on Dennis Lundberg's review: http://www.nabble.com/Please-review-maven-eclipse-plugin-tf1957957.html
             /maven/plugins/trunk/maven-eclipse-plugin/src/site/apt/examples/provide-project-natures-and-build-commands.apt
            /maven/plugins/trunk/maven-eclipse-plugin/src/site/apt/index.apt
            /maven/plugins/trunk/maven-eclipse-plugin/src/site/apt/reactor.apt
            /maven/plugins/trunk/maven-eclipse-plugin/src/site/apt/usage.apt
            /maven/plugins/trunk/maven-eclipse-plugin/src/site/apt/wtp.apt
            /maven/plugins/trunk/maven-eclipse-plugin/src/site/fml/faq.fml
            /maven/plugins/trunk/maven-eclipse-plugin/src/site/site.xml
        
****************************************************************************
Output:
****************************************************************************
[INFO] Scanning for projects...
[INFO] ----------------------------------------------------------------------------
[INFO] Building Maven Eclipse Plugin
[INFO]    task-segment: [clean, install]
[INFO] ----------------------------------------------------------------------------
[INFO] [clean:clean]
[INFO] Deleting directory /home/continuum/continuum-maven/working-directory/41/target
[INFO] Deleting directory /home/continuum/continuum-maven/working-directory/41/target/classes
[INFO] Deleting directory /home/continuum/continuum-maven/working-directory/41/target/test-classes
[INFO] [plugin:descriptor]
[INFO] Using 2 extractors.
[INFO] Applying extractor for language: java
[INFO] Extractor for language: java found 3 mojo descriptors.
[INFO] Applying extractor for language: bsh
[INFO] Extractor for language: bsh found 0 mojo descriptors.
[INFO] [resources:resources]
[INFO] Using default encoding to copy filtered resources.
[INFO] [compiler:compile]
Compiling 19 source files to /home/continuum/continuum-maven/working-directory/41/target/classes
[INFO] [resources:testResources]
[INFO] Using default encoding to copy filtered resources.
[INFO] [compiler:testCompile]
Compiling 4 source files to /home/continuum/continuum-maven/working-directory/41/target/test-classes
[INFO] [surefire:test]
[INFO] Surefire report directory: /home/continuum/continuum-maven/working-directory/41/target/surefire-reports

-------------------------------------------------------
 T E S T S
-------------------------------------------------------
Running org.apache.maven.plugin.eclipse.AddMavenRepoMojoTest
Tests run: 1, Failures: 0, Errors: 0, Skipped: 0, Time elapsed: 0.659 sec
Running org.apache.maven.plugin.eclipse.EclipsePluginTest
[ maven embedder INFO] ----------------------------------------------------------------------------
[ maven embedder INFO] Building Maven
[ maven embedder INFO]    task-segment: [org.apache.maven.plugins:maven-eclipse-plugin:clean,
org.apache.maven.plugins:maven-eclipse-plugin:eclipse]
[ maven embedder INFO] ----------------------------------------------------------------------------
[ maven embedder INFO] artifact org.apache.maven.plugins:maven-eclipse-plugin: checking for
updates from central
Downloading: http://repo1.maven.org/maven2/org/apache/maven/plugins/maven-eclipse-plugin/2.2/maven-eclipse-plugin-2.2.pom
2/2K
2K downloaded
Downloading: http://repo1.maven.org/maven2/org/apache/maven/plugins/maven-plugins/1/maven-plugins-1.pom
3/3K
3K downloaded
Downloading: http://repo1.maven.org/maven2/org/apache/maven/maven-parent/1/maven-parent-1.pom
4/6K
5/6K
6/6K
6K downloaded
Downloading: http://repo1.maven.org/maven2/org/apache/apache/1/apache-1.pom
1/3K
3/3K
3K downloaded
Downloading: http://repo1.maven.org/maven2/org/apache/maven/plugins/maven-eclipse-plugin/2.2/maven-eclipse-plugin-2.2.jar
3/47K
6/47K
7/47K
10/47K
13/47K
15/47K
19/47K
21/47K
25/47K
27/47K
29/47K
30/47K
34/47K
37/47K
38/47K
41/47K
43/47K
44/47K
47/47K
47K downloaded
Downloading: http://repo1.maven.org/maven2/org/apache/maven/maven-project/2.0.1/maven-project-2.0.1.pom
1/1K
1K downloaded
Downloading: http://repo1.maven.org/maven2/org/apache/maven/maven/2.0.1/maven-2.0.1.pom
2/11K
5/11K
6/11K
8/11K
9/11K
11/11K
11/11K
11K downloaded
Downloading: http://repo1.maven.org/maven2/org/apache/maven/maven-model/2.0.1/maven-model-2.0.1.pom
2/2K
2K downloaded
Downloading: http://repo1.maven.org/maven2/org/codehaus/plexus/plexus-utils/1.0.5/plexus-utils-1.0.5.pom
918/918b
918b downloaded
Downloading: http://repo1.maven.org/maven2/org/codehaus/plexus/plexus/1.0.4/plexus-1.0.4.pom
4/5K
5/5K
5K downloaded
Downloading: http://repo1.maven.org/maven2/classworlds/classworlds/1.1-alpha-2/classworlds-1.1-alpha-2.pom
3/3K
3K downloaded
Downloading: http://repo1.maven.org/maven2/org/apache/maven/maven-profile/2.0.1/maven-profile-2.0.1.pom
1/1K
1K downloaded
Downloading: http://repo1.maven.org/maven2/org/codehaus/plexus/plexus-container-default/1.0-alpha-9/plexus-container-default-1.0-alpha-9.pom
1/1K
1K downloaded
Downloading: http://repo1.maven.org/maven2/org/codehaus/plexus/plexus-containers/1.0.3/plexus-containers-1.0.3.pom
492/492b
492b downloaded
Downloading: http://repo1.maven.org/maven2/org/codehaus/plexus/plexus-utils/1.0.4/plexus-utils-1.0.4.pom
2/6K
6/6K
6/6K
6K downloaded
Downloading: http://repo1.maven.org/maven2/junit/junit/3.8.1/junit-3.8.1.pom
145/145b
145b downloaded
Downloading: http://repo1.maven.org/maven2/org/apache/maven/maven-artifact-manager/2.0.1/maven-artifact-manager-2.0.1.pom
1/1K
1K downloaded
Downloading: http://repo1.maven.org/maven2/org/apache/maven/maven-repository-metadata/2.0.1/maven-repository-metadata-2.0.1.pom
1/1K
1K downloaded
Downloading: http://repo1.maven.org/maven2/org/apache/maven/wagon/wagon-provider-api/1.0-alpha-5/wagon-provider-api-1.0-alpha-5.pom
2/4K
4/4K
4K downloaded
Downloading: http://repo1.maven.org/maven2/org/apache/maven/maven-artifact/2.0.1/maven-artifact-2.0.1.pom
765/765b
765b downloaded
Downloading: http://repo1.maven.org/maven2/org/apache/maven/maven-plugin-api/2.0.1/maven-plugin-api-2.0.1.pom
643/643b
643b downloaded
[ maven embedder INFO] [eclipse:clean]
[ maven embedder INFO] Deleting file: .project
[ maven embedder INFO] Deleting file: .classpath
[ maven embedder INFO] Deleting file: .wtpmodules
[ maven embedder INFO] Deleting file: .component
[ maven embedder INFO] Deleting file: org.eclipse.wst.common.component
[ maven embedder INFO] Deleting file: org.eclipse.wst.common.project.facet.core.xml
[ maven embedder INFO] Preparing eclipse:eclipse
[ maven embedder INFO] No goals needed for project - skipping
[ maven embedder INFO] [eclipse:eclipse]
[ maven embedder INFO] Adding support for WTP version R7.
[ maven embedder INFO] Not writing settings - defaults suffice
[ maven embedder INFO] Wrote Eclipse project for "maven-eclipse-plugin-test-project-1" to
/home/continuum/continuum-maven/working-directory/41/target/test-classes/projects/project-1.
[ maven embedder INFO] ----------------------------------------------------------------------------
[ maven embedder INFO] Building Maven
[ maven embedder INFO]    task-segment: [org.apache.maven.plugins:maven-eclipse-plugin:clean,
org.apache.maven.plugins:maven-eclipse-plugin:eclipse]
[ maven embedder INFO] ----------------------------------------------------------------------------
[ maven embedder INFO] [eclipse:clean]
[ maven embedder INFO] Deleting file: .project
[ maven embedder INFO] Deleting file: .classpath
[ maven embedder INFO] Deleting file: .wtpmodules
[ maven embedder INFO] Deleting file: .component
[ maven embedder INFO] Deleting file: org.eclipse.wst.common.component
[ maven embedder INFO] Deleting file: org.eclipse.wst.common.project.facet.core.xml
[ maven embedder INFO] Preparing eclipse:eclipse
[ maven embedder INFO] artifact org.apache.maven.plugins:maven-compiler-plugin: checking for
updates from central
Downloading: http://repo1.maven.org/maven2/org/apache/maven/plugins/maven-compiler-plugin/2.0.1/maven-compiler-plugin-2.0.1.pom
1/1K
1K downloaded
Downloading: http://repo1.maven.org/maven2/org/apache/maven/plugins/maven-compiler-plugin/2.0.1/maven-compiler-plugin-2.0.1.jar
1/14K
3/14K
7/14K
8/14K
9/14K
11/14K
13/14K
14/14K
14K downloaded
[ maven embedder INFO] No goals needed for project - skipping
[ maven embedder INFO] [eclipse:eclipse]
[ maven embedder INFO] Adding support for WTP version R7.
[ maven embedder INFO] Wrote settings to /home/continuum/continuum-maven/working-directory/41/target/test-classes/projects/project-2/.settings/org.eclipse.jdt.core.prefs
[ maven embedder INFO] Wrote Eclipse project for "maven-eclipse-plugin-test-project-2" to
/home/continuum/continuum-maven/working-directory/41/target/test-classes/projects/project-2.
[ maven embedder INFO] 
       Sources for some artifacts are not available.
       Please run the same goal with the -DdownloadSources=true parameter in order to check
remote repositories for sources.
       List of artifacts without a source archive:
         o junit:junit:2.0

[ maven embedder INFO] ----------------------------------------------------------------------------
[ maven embedder INFO] Building Maven
[ maven embedder INFO]    task-segment: [org.apache.maven.plugins:maven-eclipse-plugin:clean,
org.apache.maven.plugins:maven-eclipse-plugin:eclipse]
[ maven embedder INFO] ----------------------------------------------------------------------------
[ maven embedder INFO] [eclipse:clean]
[ maven embedder INFO] Deleting file: .project
[ maven embedder INFO] Deleting file: .classpath
[ maven embedder INFO] Deleting file: .wtpmodules
[ maven embedder INFO] Deleting file: .component
[ maven embedder INFO] Deleting file: org.eclipse.wst.common.component
[ maven embedder INFO] Deleting file: org.eclipse.wst.common.project.facet.core.xml
[ maven embedder INFO] Preparing eclipse:eclipse
[ maven embedder INFO] No goals needed for project - skipping
[ maven embedder INFO] [eclipse:eclipse]
[ maven embedder INFO] Adding support for WTP version R7.
[ maven embedder WARNING] This plugin currently doesn't support include patterns for resources.
Adding the entire directory.
[ maven embedder WARNING] This plugin currently doesn't support exclude patterns for resources.
Adding the entire directory.
[ maven embedder WARNING] This plugin currently doesn't support include patterns for resources.
Adding the entire directory.
[ maven embedder WARNING] This plugin currently doesn't support exclude patterns for resources.
Adding the entire directory.
[ maven embedder INFO] Not writing settings - defaults suffice
[ maven embedder INFO] Wrote Eclipse project for "maven-eclipse-plugin-test-project-3" to
/home/continuum/continuum-maven/working-directory/41/target/test-classes/projects/project-3.
[ maven embedder INFO] 
       Sources for some artifacts are not available.
       Please run the same goal with the -DdownloadSources=true parameter in order to check
remote repositories for sources.
       List of artifacts without a source archive:
         o junit:junit:2.0

[ maven embedder INFO] ----------------------------------------------------------------------------
[ maven embedder INFO] Building Maven
[ maven embedder INFO]    task-segment: [org.apache.maven.plugins:maven-eclipse-plugin:clean,
org.apache.maven.plugins:maven-eclipse-plugin:eclipse]
[ maven embedder INFO] ----------------------------------------------------------------------------
[ maven embedder INFO] [eclipse:clean]
[ maven embedder INFO] Deleting file: .project
[ maven embedder INFO] Deleting file: .classpath
[ maven embedder INFO] Deleting file: .wtpmodules
[ maven embedder INFO] Deleting file: .component
[ maven embedder INFO] Deleting file: org.eclipse.wst.common.component
[ maven embedder INFO] Deleting file: org.eclipse.wst.common.project.facet.core.xml
[ maven embedder INFO] Preparing eclipse:eclipse
[ maven embedder INFO] No goals needed for project - skipping
[ maven embedder INFO] [eclipse:eclipse]
[ maven embedder INFO] Adding support for WTP version R7.
[ maven embedder INFO] Wrote settings to /home/continuum/continuum-maven/working-directory/41/target/project-4-test/maven-eclipse-plugin-test-project-4/.settings/org.eclipse.jdt.core.prefs
[ maven embedder INFO] Wrote Eclipse project for "maven-eclipse-plugin-test-project-4" to
/home/continuum/continuum-maven/working-directory/41/target/test-classes/projects/project-4/../../../../target/project-4-test/maven-eclipse-plugin-test-project-4.
[ maven embedder INFO] 
       Sources for some artifacts are not available.
       Please run the same goal with the -DdownloadSources=true parameter in order to check
remote repositories for sources.
       List of artifacts without a source archive:
         o junit:junit:2.0

[ maven embedder INFO] ----------------------------------------------------------------------------
[ maven embedder INFO] Building Maven
[ maven embedder INFO]    task-segment: [org.apache.maven.plugins:maven-eclipse-plugin:clean,
org.apache.maven.plugins:maven-eclipse-plugin:eclipse]
[ maven embedder INFO] ----------------------------------------------------------------------------
[ maven embedder INFO] [eclipse:clean]
[ maven embedder INFO] Deleting file: .project
[ maven embedder INFO] Deleting file: .classpath
[ maven embedder INFO] Deleting file: .wtpmodules
[ maven embedder INFO] Deleting file: .component
[ maven embedder INFO] Deleting file: org.eclipse.wst.common.component
[ maven embedder INFO] Deleting file: org.eclipse.wst.common.project.facet.core.xml
[ maven embedder INFO] Preparing eclipse:eclipse
[ maven embedder INFO] No goals needed for project - skipping
[ maven embedder INFO] [eclipse:eclipse]
[ maven embedder INFO] Adding support for WTP version R7.
[ maven embedder WARNING] You did specify a list of classpath containers without the base
org.eclipse.jdt.launching.JRE_CONTAINER.
       If you specify custom classpath containers you should also add org.eclipse.jdt.launching.JRE_CONTAINER
to the list
[ maven embedder INFO] Wrote settings to /home/continuum/continuum-maven/working-directory/41/target/test-classes/projects/project-5/.settings/org.eclipse.jdt.core.prefs
[ maven embedder INFO] Wrote Eclipse project for "maven-eclipse-plugin-test-project-5" to
/home/continuum/continuum-maven/working-directory/41/target/test-classes/projects/project-5.
[ maven embedder INFO] ----------------------------------------------------------------------------
[ maven embedder INFO] Building Maven
[ maven embedder INFO]    task-segment: [org.apache.maven.plugins:maven-eclipse-plugin:clean,
org.apache.maven.plugins:maven-eclipse-plugin:eclipse]
[ maven embedder INFO] ----------------------------------------------------------------------------
[ maven embedder INFO] [eclipse:clean]
[ maven embedder INFO] Deleting file: .project
[ maven embedder INFO] Deleting file: .classpath
[ maven embedder INFO] Deleting file: .wtpmodules
[ maven embedder INFO] Deleting file: .component
[ maven embedder INFO] Deleting file: org.eclipse.wst.common.component
[ maven embedder INFO] Deleting file: org.eclipse.wst.common.project.facet.core.xml
[ maven embedder INFO] Preparing eclipse:eclipse
[ maven embedder INFO] No goals needed for project - skipping
[ maven embedder INFO] [eclipse:eclipse]
[ maven embedder INFO] Adding support for WTP version R7.
[ maven embedder INFO] Not writing settings - defaults suffice
[ maven embedder INFO] Wrote Eclipse project for "maven-eclipse-plugin-test-project-6" to
/home/continuum/continuum-maven/working-directory/41/target/test-classes/projects/project-6.
[ maven embedder INFO] ----------------------------------------------------------------------------
[ maven embedder INFO] Building Maven
[ maven embedder INFO]    task-segment: [org.apache.maven.plugins:maven-eclipse-plugin:clean,
org.apache.maven.plugins:maven-eclipse-plugin:eclipse]
[ maven embedder INFO] ----------------------------------------------------------------------------
[ maven embedder INFO] [eclipse:clean]
[ maven embedder INFO] Deleting file: .project
[ maven embedder INFO] Deleting file: .classpath
[ maven embedder INFO] Deleting file: .wtpmodules
[ maven embedder INFO] Deleting file: .component
[ maven embedder INFO] Deleting file: org.eclipse.wst.common.component
[ maven embedder INFO] Deleting file: org.eclipse.wst.common.project.facet.core.xml
[ maven embedder INFO] Preparing eclipse:eclipse
[ maven embedder INFO] No goals needed for project - skipping
[ maven embedder INFO] [eclipse:eclipse]
[ maven embedder INFO] Adding support for WTP version R7.
[ maven embedder INFO] Not writing settings - defaults suffice
[ maven embedder INFO] Wrote Eclipse project for "maven-eclipse-plugin-test-project-8" to
/home/continuum/continuum-maven/working-directory/41/target/test-classes/projects/project-8.
[ maven embedder INFO] ----------------------------------------------------------------------------
[ maven embedder INFO] Building Maven
[ maven embedder INFO]    task-segment: [org.apache.maven.plugins:maven-eclipse-plugin:clean,
org.apache.maven.plugins:maven-eclipse-plugin:eclipse]
[ maven embedder INFO] ----------------------------------------------------------------------------
[ maven embedder INFO] [eclipse:clean]
[ maven embedder INFO] Deleting file: .project
[ maven embedder INFO] Deleting file: .classpath
[ maven embedder INFO] Deleting file: .wtpmodules
[ maven embedder INFO] Deleting file: .component
[ maven embedder INFO] Deleting file: org.eclipse.wst.common.component
[ maven embedder INFO] Deleting file: org.eclipse.wst.common.project.facet.core.xml
[ maven embedder INFO] Preparing eclipse:eclipse
[ maven embedder INFO] No goals needed for project - skipping
[ maven embedder INFO] [eclipse:eclipse]
[ maven embedder INFO] Adding support for WTP version R7.
[ maven embedder INFO] Not writing settings - defaults suffice
[ maven embedder INFO] Wrote Eclipse project for "maven-eclipse-plugin-test-project-9" to
/home/continuum/continuum-maven/working-directory/41/target/test-classes/projects/project-9/../../../../target/project-9-test/maven-eclipse-plugin-test-project-9.
[ maven embedder INFO] 
       Sources for some artifacts are not available.
       Please run the same goal with the -DdownloadSources=true parameter in order to check
remote repositories for sources.
       List of artifacts without a source archive:
         o junit:junit:2.0

[ maven embedder INFO] ----------------------------------------------------------------------------
[ maven embedder INFO] Building Maven
[ maven embedder INFO]    task-segment: [org.apache.maven.plugins:maven-eclipse-plugin:clean,
org.apache.maven.plugins:maven-eclipse-plugin:eclipse]
[ maven embedder INFO] ----------------------------------------------------------------------------
[ maven embedder INFO] [eclipse:clean]
[ maven embedder INFO] Deleting file: .project
[ maven embedder INFO] Deleting file: .classpath
[ maven embedder INFO] Deleting file: .wtpmodules
[ maven embedder INFO] Deleting file: .component
[ maven embedder INFO] Deleting file: org.eclipse.wst.common.component
[ maven embedder INFO] Deleting file: org.eclipse.wst.common.project.facet.core.xml
[ maven embedder INFO] Preparing eclipse:eclipse
[ maven embedder INFO] No goals needed for project - skipping
[ maven embedder INFO] [eclipse:eclipse]
[ maven embedder INFO] Adding support for WTP version R7.
[ maven embedder INFO] Wrote settings to /home/continuum/continuum-maven/working-directory/41/target/test-classes/projects/project-10/.settings/org.eclipse.jdt.core.prefs
[ maven embedder INFO] Wrote Eclipse project for "maven-eclipse-plugin-test-project-2" to
/home/continuum/continuum-maven/working-directory/41/target/test-classes/projects/project-10.
[ maven embedder INFO] 
       Sources for some artifacts are not available.
       Please run the same goal with the -DdownloadSources=true parameter in order to check
remote repositories for sources.
       List of artifacts without a source archive:
         o junit:junit:3.0

[ maven embedder INFO] ----------------------------------------------------------------------------
[ maven embedder INFO] Building Maven
[ maven embedder INFO]    task-segment: [org.apache.maven.plugins:maven-eclipse-plugin:clean,
org.apache.maven.plugins:maven-eclipse-plugin:eclipse]
[ maven embedder INFO] ----------------------------------------------------------------------------
[ maven embedder INFO] [eclipse:clean]
[ maven embedder INFO] Deleting file: .project
[ maven embedder INFO] Deleting file: .classpath
[ maven embedder INFO] Deleting file: .wtpmodules
[ maven embedder INFO] Deleting file: .component
[ maven embedder INFO] Deleting file: org.eclipse.wst.common.component
[ maven embedder INFO] Deleting file: org.eclipse.wst.common.project.facet.core.xml
[ maven embedder INFO] Preparing eclipse:eclipse
[ maven embedder INFO] artifact org.codehaus.modello:modello-maven-plugin: checking for updates
from central
Downloading: http://repo1.maven.org/maven2/org/codehaus/modello/modello-maven-plugin/1.0-alpha-10/modello-maven-plugin-1.0-alpha-10.pom
1/1K
1K downloaded
Downloading: http://repo1.maven.org/maven2/org/codehaus/modello/modello/1.0-alpha-10/modello-1.0-alpha-10.pom
3/8K
5/8K
6/8K
7/8K
8/8K
8K downloaded
Downloading: http://repo1.maven.org/maven2/org/codehaus/modello/modello-maven-plugin/1.0-alpha-10/modello-maven-plugin-1.0-alpha-10.jar
4/10K
5/10K
7/10K
9/10K
10/10K
10K downloaded
Downloading: http://repo1.maven.org/maven2/org/codehaus/modello/modello-core/1.0-alpha-10/modello-core-1.0-alpha-10.pom
824/824b
824b downloaded
Downloading: http://repo1.maven.org/maven2/org/codehaus/plexus/plexus-container-default/1.0-alpha-8/plexus-container-default-1.0-alpha-8.pom
1/7K
2/7K
3/7K
5/7K
7/7K
7K downloaded
Downloading: http://repo1.maven.org/maven2/org/codehaus/modello/modello-plugin-prevayler/1.0-alpha-10/modello-plugin-prevayler-1.0-alpha-10.pom
660/660b
660b downloaded
Downloading: http://repo1.maven.org/maven2/org/codehaus/modello/modello-plugins/1.0-alpha-10/modello-plugins-1.0-alpha-10.pom
1/1K
1K downloaded
Downloading: http://repo1.maven.org/maven2/org/codehaus/modello/modello-plugin-store/1.0-alpha-10/modello-plugin-store-1.0-alpha-10.pom
608/608b
608b downloaded
Downloading: http://repo1.maven.org/maven2/org/codehaus/plexus/plexus-velocity/1.1.2/plexus-velocity-1.1.2.pom
1/7K
2/7K
3/7K
5/7K
7/7K
7K downloaded
Downloading: http://repo1.maven.org/maven2/org/codehaus/plexus/plexus-container-default/1.0-alpha-7/plexus-container-default-1.0-alpha-7.pom
1/1K
1K downloaded
Downloading: http://repo1.maven.org/maven2/plexus/plexus-containers/1.0.2/plexus-containers-1.0.2.pom
471/471b
471b downloaded
Downloading: http://repo1.maven.org/maven2/plexus/plexus-root/1.0.3/plexus-root-1.0.3.pom
1/5K
2/5K
3/5K
5/5K
5K downloaded
Downloading: http://repo1.maven.org/maven2/commons-logging/commons-logging-api/1.0.4/commons-logging-api-1.0.4.pom
168/168b
168b downloaded
Downloading: http://repo1.maven.org/maven2/commons-collections/commons-collections/2.0/commons-collections-2.0.pom
171/171b
171b downloaded
Downloading: http://repo1.maven.org/maven2/velocity/velocity/1.4/velocity-1.4.pom
2/2K
2K downloaded
Downloading: http://repo1.maven.org/maven2/velocity/velocity-dep/1.4/velocity-dep-1.4.pom
1/1K
1K downloaded
Downloading: http://repo1.maven.org/maven2/plexus/plexus-utils/1.0.2/plexus-utils-1.0.2.pom
740/740b
740b downloaded
Downloading: http://repo1.maven.org/maven2/org/codehaus/modello/modello-plugin-xpp3/1.0-alpha-10/modello-plugin-xpp3-1.0-alpha-10.pom
803/803b
803b downloaded
Downloading: http://repo1.maven.org/maven2/org/codehaus/modello/modello-plugin-xml/1.0-alpha-10/modello-plugin-xml-1.0-alpha-10.pom
442/442b
442b downloaded
Downloading: http://repo1.maven.org/maven2/org/codehaus/modello/modello-plugin-xdoc/1.0-alpha-10/modello-plugin-xdoc-1.0-alpha-10.pom
610/610b
610b downloaded
Downloading: http://repo1.maven.org/maven2/org/codehaus/modello/modello-plugin-xsd/1.0-alpha-10/modello-plugin-xsd-1.0-alpha-10.pom
646/646b
646b downloaded
Downloading: http://repo1.maven.org/maven2/org/apache/maven/maven-project/2.0/maven-project-2.0.pom
1/1K
1K downloaded
Downloading: http://repo1.maven.org/maven2/org/apache/maven/maven/2.0/maven-2.0.pom
3/8K
5/8K
6/8K
7/8K
8/8K
8K downloaded
Downloading: http://repo1.maven.org/maven2/org/apache/maven/maven-artifact/2.0/maven-artifact-2.0.pom
723/723b
723b downloaded
Downloading: http://repo1.maven.org/maven2/org/apache/maven/maven-model/2.0/maven-model-2.0.pom
2/2K
2K downloaded
Downloading: http://repo1.maven.org/maven2/org/apache/maven/maven-artifact-manager/2.0/maven-artifact-manager-2.0.pom
1/1K
1K downloaded
Downloading: http://repo1.maven.org/maven2/org/apache/maven/maven-repository-metadata/2.0/maven-repository-metadata-2.0.pom
1/1K
1K downloaded
Downloading: http://repo1.maven.org/maven2/org/apache/maven/maven-profile/2.0/maven-profile-2.0.pom
1/1K
1K downloaded
Downloading: http://repo1.maven.org/maven2/org/apache/maven/maven-plugin-api/2.0/maven-plugin-api-2.0.pom
601/601b
601b downloaded
Downloading: http://repo1.maven.org/maven2/org/codehaus/modello/modello-plugin-jdom/1.0-alpha-10/modello-plugin-jdom-1.0-alpha-10.pom
803/803b
803b downloaded
Downloading: http://repo1.maven.org/maven2/org/codehaus/modello/modello-plugin-jpox/1.0-alpha-10/modello-plugin-jpox-1.0-alpha-10.pom
650/650b
650b downloaded
Downloading: http://repo1.maven.org/maven2/org/codehaus/modello/modello-plugin-xpp3/1.0-alpha-10/modello-plugin-xpp3-1.0-alpha-10.jar
1/22K
5/22K
9/22K
13/22K
17/22K
21/22K
22/22K
22K downloaded
Downloading: http://repo1.maven.org/maven2/commons-collections/commons-collections/2.0/commons-collections-2.0.jar
1/88K
2/88K
6/88K
6/88K
7/88K
9/88K
10/88K
12/88K
13/88K
15/88K
16/88K
17/88K
19/88K
20/88K
22/88K
23/88K
25/88K
27/88K
29/88K
31/88K
33/88K
34/88K
35/88K
37/88K
38/88K
42/88K
46/88K
47/88K
49/88K
50/88K
51/88K
53/88K
56/88K
57/88K
59/88K
61/88K
63/88K
64/88K
66/88K
67/88K
69/88K
70/88K
71/88K
73/88K
75/88K
77/88K
79/88K
81/88K
82/88K
85/88K
86/88K
88/88K
88K downloaded
Downloading: http://repo1.maven.org/maven2/org/codehaus/modello/modello-plugin-jpox/1.0-alpha-10/modello-plugin-jpox-1.0-alpha-10.jar
3/16K
5/16K
6/16K
7/16K
9/16K
10/16K
12/16K
13/16K
15/16K
16/16K
16K downloaded
Downloading: http://repo1.maven.org/maven2/org/codehaus/modello/modello-plugin-xml/1.0-alpha-10/modello-plugin-xml-1.0-alpha-10.jar
2/8K
3/8K
5/8K
6/8K
8/8K
8K downloaded
Downloading: http://repo1.maven.org/maven2/org/codehaus/modello/modello-core/1.0-alpha-10/modello-core-1.0-alpha-10.jar
1/112K
3/112K
5/112K
6/112K
7/112K
9/112K
13/112K
17/112K
21/112K
25/112K
29/112K
33/112K
37/112K
41/112K
45/112K
49/112K
53/112K
57/112K
61/112K
65/112K
69/112K
73/112K
77/112K
81/112K
85/112K
89/112K
93/112K
97/112K
101/112K
103/112K
105/112K
108/112K
109/112K
111/112K
112/112K
112K downloaded
Downloading: http://repo1.maven.org/maven2/org/codehaus/modello/modello-plugin-prevayler/1.0-alpha-10/modello-plugin-prevayler-1.0-alpha-10.jar
4/5K
5/5K
5K downloaded
Downloading: http://repo1.maven.org/maven2/velocity/velocity-dep/1.4/velocity-dep-1.4.jar
4/505K
5/505K
6/505K
7/505K
9/505K
10/505K
12/505K
13/505K
15/505K
16/505K
19/505K
21/505K
22/505K
25/505K
26/505K
27/505K
29/505K
31/505K
33/505K
34/505K
37/505K
41/505K
45/505K
48/505K
50/505K
51/505K
53/505K
57/505K
60/505K
61/505K
63/505K
64/505K
65/505K
67/505K
68/505K
70/505K
71/505K
73/505K
75/505K
77/505K
78/505K
80/505K
81/505K
83/505K
84/505K
85/505K
87/505K
88/505K
90/505K
91/505K
93/505K
94/505K
97/505K
98/505K
100/505K
104/505K
108/505K
112/505K
112/505K
114/505K
115/505K
117/505K
118/505K
121/505K
124/505K
125/505K
127/505K
131/505K
131/505K
132/505K
135/505K
137/505K
138/505K
139/505K
141/505K
145/505K
147/505K
148/505K
149/505K
151/505K
152/505K
155/505K
157/505K
159/505K
161/505K
162/505K
164/505K
165/505K
167/505K
168/505K
169/505K
171/505K
175/505K
176/505K
178/505K
179/505K
181/505K
182/505K
185/505K
186/505K
188/505K
189/505K
191/505K
192/505K
194/505K
196/505K
198/505K
199/505K
202/505K
204/505K
205/505K
206/505K
208/505K
209/505K
211/505K
212/505K
215/505K
218/505K
219/505K
221/505K
222/505K
225/505K
226/505K
228/505K
229/505K
232/505K
234/505K
235/505K
239/505K
243/505K
243/505K
247/505K
251/505K
252/505K
253/505K
255/505K
259/505K
259/505K
263/505K
263/505K
265/505K
266/505K
268/505K
269/505K
271/505K
272/505K
273/505K
275/505K
276/505K
279/505K
281/505K
282/505K
283/505K
285/505K
286/505K
288/505K
289/505K
291/505K
292/505K
293/505K
295/505K
298/505K
299/505K
301/505K
305/505K
309/505K
312/505K
313/505K
315/505K
316/505K
319/505K
320/505K
322/505K
323/505K
325/505K
326/505K
328/505K
329/505K
331/505K
333/505K
335/505K
337/505K
338/505K
340/505K
341/505K
343/505K
344/505K
345/505K
347/505K
348/505K
350/505K
351/505K
353/505K
354/505K
355/505K
357/505K
358/505K
360/505K
363/505K
364/505K
368/505K
372/505K
373/505K
376/505K
377/505K
379/505K
380/505K
381/505K
383/505K
384/505K
386/505K
387/505K
389/505K
390/505K
391/505K
393/505K
394/505K
396/505K
397/505K
399/505K
400/505K
401/505K
403/505K
405/505K
406/505K
407/505K
409/505K
411/505K
413/505K
417/505K
421/505K
421/505K
422/505K
426/505K
429/505K
430/505K
431/505K
434/505K
436/505K
437/505K
439/505K
441/505K
443/505K
444/505K
446/505K
447/505K
449/505K
450/505K
451/505K
453/505K
454/505K
456/505K
457/505K
459/505K
460/505K
461/505K
463/505K
464/505K
466/505K
469/505K
470/505K
471/505K
473/505K
474/505K
476/505K
477/505K
479/505K
480/505K
481/505K
483/505K
485/505K
486/505K
487/505K
491/505K
493/505K
495/505K
497/505K
498/505K
499/505K
501/505K
503/505K
505/505K
505K downloaded
Downloading: http://repo1.maven.org/maven2/org/codehaus/modello/modello-plugin-xsd/1.0-alpha-10/modello-plugin-xsd-1.0-alpha-10.jar
3/6K
6/6K
6K downloaded
Downloading: http://repo1.maven.org/maven2/org/codehaus/modello/modello-plugin-jdom/1.0-alpha-10/modello-plugin-jdom-1.0-alpha-10.jar
3/12K
5/12K
6/12K
7/12K
9/12K
10/12K
12/12K
12K downloaded
Downloading: http://repo1.maven.org/maven2/org/codehaus/plexus/plexus-velocity/1.1.2/plexus-velocity-1.1.2.jar
3/7K
5/7K
7/7K
7K downloaded
Downloading: http://repo1.maven.org/maven2/commons-logging/commons-logging-api/1.0.4/commons-logging-api-1.0.4.jar
3/25K
5/25K
6/25K
7/25K
9/25K
10/25K
12/25K
13/25K
15/25K
16/25K
17/25K
19/25K
20/25K
22/25K
23/25K
25/25K
25K downloaded
Downloading: http://repo1.maven.org/maven2/velocity/velocity/1.4/velocity-1.4.jar
3/352K
6/352K
7/352K
9/352K
10/352K
13/352K
15/352K
16/352K
17/352K
19/352K
20/352K
22/352K
23/352K
25/352K
27/352K
29/352K
30/352K
34/352K
36/352K
37/352K
41/352K
45/352K
46/352K
47/352K
49/352K
50/352K
52/352K
53/352K
55/352K
56/352K
57/352K
60/352K
62/352K
63/352K
64/352K
66/352K
67/352K
69/352K
70/352K
72/352K
73/352K
74/352K
76/352K
77/352K
79/352K
80/352K
82/352K
83/352K
85/352K
86/352K
89/352K
90/352K
91/352K
93/352K
94/352K
95/352K
97/352K
99/352K
101/352K
102/352K
103/352K
105/352K
106/352K
108/352K
109/352K
111/352K
113/352K
115/352K
117/352K
119/352K
121/352K
125/352K
129/352K
131/352K
133/352K
135/352K
137/352K
138/352K
139/352K
141/352K
145/352K
149/352K
151/352K
152/352K
154/352K
155/352K
157/352K
158/352K
159/352K
161/352K
162/352K
164/352K
165/352K
167/352K
168/352K
169/352K
173/352K
177/352K
179/352K
181/352K
182/352K
184/352K
187/352K
188/352K
189/352K
191/352K
192/352K
194/352K
195/352K
196/352K
198/352K
201/352K
202/352K
204/352K
205/352K
206/352K
209/352K
211/352K
212/352K
214/352K
215/352K
216/352K
219/352K
221/352K
225/352K
229/352K
231/352K
232/352K
234/352K
235/352K
236/352K
239/352K
241/352K
242/352K
245/352K
246/352K
248/352K
251/352K
252/352K
254/352K
255/352K
256/352K
258/352K
259/352K
263/352K
267/352K
271/352K
272/352K
273/352K
275/352K
279/352K
283/352K
283/352K
285/352K
286/352K
288/352K
289/352K
291/352K
292/352K
295/352K
296/352K
298/352K
301/352K
302/352K
303/352K
306/352K
308/352K
309/352K
311/352K
313/352K
316/352K
318/352K
319/352K
322/352K
325/352K
326/352K
328/352K
329/352K
331/352K
332/352K
333/352K
335/352K
336/352K
338/352K
339/352K
340/352K
343/352K
345/352K
346/352K
347/352K
351/352K
352/352K
352K downloaded
Downloading: http://repo1.maven.org/maven2/org/codehaus/modello/modello-plugin-xdoc/1.0-alpha-10/modello-plugin-xdoc-1.0-alpha-10.jar
3/6K
6/6K
6K downloaded
Downloading: http://repo1.maven.org/maven2/org/codehaus/modello/modello-plugin-store/1.0-alpha-10/modello-plugin-store-1.0-alpha-10.jar
3/14K
6/14K
9/14K
10/14K
12/14K
14/14K
14K downloaded
[ maven embedder INFO] Setting property: classpath.resource.loader.class => 'org.codehaus.plexus.velocity.ContextClassLoaderResourceLoader'.
[ maven embedder INFO] Setting property: velocimacro.messages.on => 'false'.
[ maven embedder INFO] Setting property: resource.loader => 'classpath'.
[ maven embedder INFO] Setting property: resource.manager.logwhenfound => 'false'.
[ maven embedder INFO] ************************************************************** 
[ maven embedder INFO] Starting Jakarta Velocity v1.4
[ maven embedder INFO] RuntimeInstance initializing.
[ maven embedder INFO] Default Properties File: org/apache/velocity/runtime/defaults/velocity.properties
[ maven embedder INFO] Default ResourceManager initializing. (class org.apache.velocity.runtime.resource.ResourceManagerImpl)
[ maven embedder INFO] Resource Loader Instantiated: org.codehaus.plexus.velocity.ContextClassLoaderResourceLoader
[ maven embedder INFO] ClasspathResourceLoader : initialization starting.
[ maven embedder INFO] ClasspathResourceLoader : initialization complete.
[ maven embedder INFO] ResourceCache : initialized. (class org.apache.velocity.runtime.resource.ResourceCacheImpl)
[ maven embedder INFO] Default ResourceManager initialization complete.
[ maven embedder INFO] Loaded System Directive: org.apache.velocity.runtime.directive.Literal
[ maven embedder INFO] Loaded System Directive: org.apache.velocity.runtime.directive.Macro
[ maven embedder INFO] Loaded System Directive: org.apache.velocity.runtime.directive.Parse
[ maven embedder INFO] Loaded System Directive: org.apache.velocity.runtime.directive.Include
[ maven embedder INFO] Loaded System Directive: org.apache.velocity.runtime.directive.Foreach
[ maven embedder INFO] Created: 20 parsers.
[ maven embedder INFO] Velocimacro : initialization starting.
[ maven embedder INFO] Velocimacro : adding VMs from VM library template : VM_global_library.vm
[ maven embedder ERROR] ResourceManager : unable to find resource 'VM_global_library.vm' in
any resource loader.
[ maven embedder INFO] Velocimacro : error using  VM library template VM_global_library.vm
: org.apache.velocity.exception.ResourceNotFoundException: Unable to find resource 'VM_global_library.vm'
[ maven embedder INFO] Velocimacro :  VM library template macro registration complete.
[ maven embedder INFO] Velocimacro : allowInline = true : VMs can be defined inline in templates
[ maven embedder INFO] Velocimacro : allowInlineToOverride = false : VMs defined inline may
NOT replace previous VM definitions
[ maven embedder INFO] Velocimacro : allowInlineLocal = false : VMs defined inline will be
 global in scope if allowed.
[ maven embedder INFO] Velocimacro : initialization complete.
[ maven embedder INFO] Velocity successfully started.
[ maven embedder INFO] [modello:java {execution: default}]
[ maven embedder INFO] outputDirectory: /home/continuum/continuum-maven/working-directory/41/target/test-classes/projects/project-11/target/generated-sources/modello
[ maven embedder INFO] [eclipse:eclipse]
[ maven embedder INFO] Adding support for WTP version R7.
[ maven embedder INFO] Not writing settings - defaults suffice
[ maven embedder INFO] Wrote Eclipse project for "maven-eclipse-plugin-test-project-2" to
/home/continuum/continuum-maven/working-directory/41/target/test-classes/projects/project-11.
[ maven embedder INFO] ----------------------------------------------------------------------------
[ maven embedder INFO] Building Unnamed - eclipse:maven-eclipse-plugin-test-project-12:ear:12
[ maven embedder INFO]    task-segment: [org.apache.maven.plugins:maven-eclipse-plugin:clean,
org.apache.maven.plugins:maven-eclipse-plugin:eclipse]
[ maven embedder INFO] ----------------------------------------------------------------------------
[ maven embedder INFO] [eclipse:clean]
[ maven embedder INFO] Deleting file: .project
[ maven embedder INFO] Deleting file: .classpath
[ maven embedder INFO] Deleting file: .wtpmodules
[ maven embedder INFO] Deleting file: .component
[ maven embedder INFO] Deleting file: org.eclipse.wst.common.component
[ maven embedder INFO] Deleting file: org.eclipse.wst.common.project.facet.core.xml
[ maven embedder INFO] Preparing eclipse:eclipse
[ maven embedder INFO] artifact org.apache.maven.plugins:maven-ear-plugin: checking for updates
from central
[ maven embedder WARNING] *** CHECKSUM FAILED - Checksum failed on download: local = 'e672c73f1430e99f1886bdf5bb9ae7a3cc2faf63';
remote = '5ac53c281a15f370daf30b13ebddb5ae2f6e8bdf' - RETRYING
[ maven embedder WARNING] *** CHECKSUM FAILED - Checksum failed on download: local = 'e672c73f1430e99f1886bdf5bb9ae7a3cc2faf63';
remote = '5ac53c281a15f370daf30b13ebddb5ae2f6e8bdf' - IGNORING
Downloading: http://repo1.maven.org/maven2/org/apache/maven/plugins/maven-ear-plugin/2.2/maven-ear-plugin-2.2.pom
1/1K
1K downloaded
Downloading: http://repo1.maven.org/maven2/org/apache/maven/plugins/maven-ear-plugin/2.2/maven-ear-plugin-2.2.jar
2/29K
5/29K
6/29K
8/29K
11/29K
12/29K
13/29K
15/29K
16/29K
20/29K
24/29K
28/29K
29/29K
29K downloaded
Downloading: http://repo1.maven.org/maven2/org/apache/maven/maven-archiver/2.0.1/maven-archiver-2.0.1.pom
912/912b
912b downloaded
Downloading: http://repo1.maven.org/maven2/org/codehaus/plexus/plexus-archiver/1.0-alpha-4/plexus-archiver-1.0-alpha-4.pom
439/439b
439b downloaded
Downloading: http://repo1.maven.org/maven2/org/codehaus/plexus/plexus-components/1.1.4/plexus-components-1.1.4.pom
1/2K
2/2K
2K downloaded
Downloading: http://repo1.maven.org/maven2/org/apache/maven/maven-archiver/2.0.1/maven-archiver-2.0.1.jar
1/9K
5/9K
8/9K
9/9K
9K downloaded
Downloading: http://repo1.maven.org/maven2/org/codehaus/plexus/plexus-archiver/1.0-alpha-4/plexus-archiver-1.0-alpha-4.jar
2/127K
5/127K
6/127K
8/127K
9/127K
11/127K
12/127K
13/127K
17/127K
21/127K
22/127K
23/127K
25/127K
26/127K
28/127K
32/127K
35/127K
36/127K
38/127K
39/127K
42/127K
43/127K
46/127K
48/127K
49/127K
50/127K
52/127K
53/127K
55/127K
56/127K
60/127K
64/127K
66/127K
68/127K
69/127K
73/127K
76/127K
78/127K
79/127K
80/127K
82/127K
83/127K
87/127K
90/127K
92/127K
93/127K
95/127K
96/127K
99/127K
100/127K
103/127K
105/127K
106/127K
108/127K
112/127K
112/127K
116/127K
118/127K
119/127K
120/127K
122/127K
123/127K
127/127K
127/127K
127K downloaded
[ maven embedder INFO] [ear:generate-application-xml]
[ maven embedder INFO] Generating application.xml
[ maven embedder INFO] [eclipse:eclipse]
[ maven embedder INFO] Adding support for WTP version 1.0.
[ maven embedder INFO] Not writing settings - defaults suffice
[ maven embedder INFO] Wrote Eclipse project for "maven-eclipse-plugin-test-project-12" to
/home/continuum/continuum-maven/working-directory/41/target/test-classes/projects/project-12.
[ maven embedder INFO] ----------------------------------------------------------------------------
[ maven embedder INFO] Building Unnamed - eclipse:maven-eclipse-plugin-test-project-13:jar:13
[ maven embedder INFO]    task-segment: [org.apache.maven.plugins:maven-eclipse-plugin:clean,
org.apache.maven.plugins:maven-eclipse-plugin:eclipse]
[ maven embedder INFO] ----------------------------------------------------------------------------
[ maven embedder INFO] [eclipse:clean]
[ maven embedder INFO] Deleting file: .project
[ maven embedder INFO] Deleting file: .classpath
[ maven embedder INFO] Deleting file: .wtpmodules
[ maven embedder INFO] Deleting file: .component
[ maven embedder INFO] Deleting file: org.eclipse.wst.common.component
[ maven embedder INFO] Deleting file: org.eclipse.wst.common.project.facet.core.xml
[ maven embedder INFO] Preparing eclipse:eclipse
[ maven embedder INFO] No goals needed for project - skipping
[ maven embedder INFO] [eclipse:eclipse]
[ maven embedder INFO] Not writing settings - defaults suffice
[ maven embedder INFO] Wrote Eclipse project for "maven-eclipse-plugin-test-project-13" to
/home/continuum/continuum-maven/working-directory/41/target/test-classes/projects/project-13.
[ maven embedder INFO] 
       Sources for some artifacts are not available.
       Please run the same goal with the -DdownloadSources=true parameter in order to check
remote repositories for sources.
       List of artifacts without a source archive:
         o junit:junit:3.8.1

[ maven embedder INFO] ----------------------------------------------------------------------------
[ maven embedder INFO] Building maven-eclipse-plugin-test-project-14en
[ maven embedder INFO]    task-segment: [org.apache.maven.plugins:maven-eclipse-plugin:clean,
org.apache.maven.plugins:maven-eclipse-plugin:eclipse]
[ maven embedder INFO] ----------------------------------------------------------------------------
[ maven embedder INFO] [eclipse:clean]
[ maven embedder INFO] Deleting file: .project
[ maven embedder INFO] Deleting file: .classpath
[ maven embedder INFO] Deleting file: .wtpmodules
[ maven embedder INFO] Deleting file: .component
[ maven embedder INFO] Deleting file: org.eclipse.wst.common.component
[ maven embedder INFO] Deleting file: org.eclipse.wst.common.project.facet.core.xml
[ maven embedder INFO] Preparing eclipse:eclipse
[ maven embedder INFO] No goals needed for project - skipping
[ maven embedder INFO] [eclipse:eclipse]
[ maven embedder INFO] Not writing settings - defaults suffice
[ maven embedder INFO] Wrote Eclipse project for "maven-eclipse-plugin-test-project-14" to
/home/continuum/continuum-maven/working-directory/41/target/test-classes/projects/project-14.
[ maven embedder INFO] ----------------------------------------------------------------------------
[ maven embedder INFO] Building maven-eclipse-plugin-test-project-15
[ maven embedder INFO]    task-segment: [org.apache.maven.plugins:maven-eclipse-plugin:clean,
org.apache.maven.plugins:maven-eclipse-plugin:eclipse]
[ maven embedder INFO] ----------------------------------------------------------------------------
[ maven embedder INFO] [eclipse:clean]
[ maven embedder INFO] Deleting file: .project
[ maven embedder INFO] Deleting file: .classpath
[ maven embedder INFO] Deleting file: .wtpmodules
[ maven embedder INFO] Deleting file: .component
[ maven embedder INFO] Deleting file: org.eclipse.wst.common.component
[ maven embedder INFO] Deleting file: org.eclipse.wst.common.project.facet.core.xml
[ maven embedder INFO] Preparing eclipse:eclipse
[ maven embedder INFO] No goals needed for project - skipping
[ maven embedder INFO] [eclipse:eclipse]
[ maven embedder INFO] Not writing settings - defaults suffice
[ maven embedder INFO] Wrote Eclipse project for "maven-eclipse-plugin-test-project-15" to
/home/continuum/continuum-maven/working-directory/41/target/test-classes/projects/project-15.
[ maven embedder INFO] ----------------------------------------------------------------------------
[ maven embedder INFO] Building maven-eclipse-plugin-test-project-18
[ maven embedder INFO]    task-segment: [org.apache.maven.plugins:maven-eclipse-plugin:clean,
org.apache.maven.plugins:maven-eclipse-plugin:eclipse]
[ maven embedder INFO] ----------------------------------------------------------------------------
[ maven embedder INFO] [eclipse:clean]
[ maven embedder INFO] Deleting file: .project
[ maven embedder INFO] Deleting file: .classpath
[ maven embedder INFO] Deleting file: .wtpmodules
[ maven embedder INFO] Deleting file: .component
[ maven embedder INFO] Deleting file: org.eclipse.wst.common.component
[ maven embedder INFO] Deleting file: org.eclipse.wst.common.project.facet.core.xml
[ maven embedder INFO] Preparing eclipse:eclipse
[ maven embedder INFO] No goals needed for project - skipping
[ maven embedder INFO] [eclipse:eclipse]
[ maven embedder INFO] Not writing settings - defaults suffice
[ maven embedder INFO] Wrote Eclipse project for "maven-eclipse-plugin-test-project-18" to
/home/continuum/continuum-maven/working-directory/41/target/test-classes/projects/project-18/../../../../target/project-18-test/maven-eclipse-plugin-test-project-18.
[ maven embedder INFO] ----------------------------------------------------------------------------
[ maven embedder INFO] Building maven-eclipse-plugin-test-project-19
[ maven embedder INFO]    task-segment: [org.apache.maven.plugins:maven-eclipse-plugin:clean,
org.apache.maven.plugins:maven-eclipse-plugin:eclipse]
[ maven embedder INFO] ----------------------------------------------------------------------------
[ maven embedder INFO] [eclipse:clean]
[ maven embedder INFO] Deleting file: .project
[ maven embedder INFO] Deleting file: .classpath
[ maven embedder INFO] Deleting file: .wtpmodules
[ maven embedder INFO] Deleting file: .component
[ maven embedder INFO] Deleting file: org.eclipse.wst.common.component
[ maven embedder INFO] Deleting file: org.eclipse.wst.common.project.facet.core.xml
[ maven embedder INFO] Preparing eclipse:eclipse
[ maven embedder INFO] No goals needed for project - skipping
[ maven embedder INFO] [eclipse:eclipse]
[ maven embedder INFO] Not writing settings - defaults suffice
[ maven embedder INFO] Wrote Eclipse project for "maven-eclipse-plugin-test-project-19" to
/home/continuum/continuum-maven/working-directory/41/target/test-classes/projects/project-19.
[ maven embedder INFO] ----------------------------------------------------------------------------
[ maven embedder INFO] Building maven-eclipse-plugin-test-project-20
[ maven embedder INFO]    task-segment: [org.apache.maven.plugins:maven-eclipse-plugin:clean,
org.apache.maven.plugins:maven-eclipse-plugin:eclipse]
[ maven embedder INFO] ----------------------------------------------------------------------------
[ maven embedder INFO] [eclipse:clean]
[ maven embedder INFO] Deleting file: .project
[ maven embedder INFO] Deleting file: .classpath
[ maven embedder INFO] Deleting file: .wtpmodules
[ maven embedder INFO] Deleting file: .component
[ maven embedder INFO] Deleting file: org.eclipse.wst.common.component
[ maven embedder INFO] Deleting file: org.eclipse.wst.common.project.facet.core.xml
[ maven embedder INFO] Preparing eclipse:eclipse
[ maven embedder INFO] No goals needed for project - skipping
[ maven embedder INFO] [eclipse:eclipse]
[ maven embedder INFO] Adding support for WTP version 1.5.
[ maven embedder INFO] Not writing settings - defaults suffice
[ maven embedder INFO] Wrote Eclipse project for "maven-eclipse-plugin-test-project-20" to
/home/continuum/continuum-maven/working-directory/41/target/test-classes/projects/project-20.
[ maven embedder INFO] ----------------------------------------------------------------------------
[ maven embedder INFO] Building maven-eclipse-plugin-test-project-21
[ maven embedder INFO]    task-segment: [org.apache.maven.plugins:maven-eclipse-plugin:clean,
org.apache.maven.plugins:maven-eclipse-plugin:eclipse]
[ maven embedder INFO] ----------------------------------------------------------------------------
[ maven embedder INFO] [eclipse:clean]
[ maven embedder INFO] Deleting file: .project
[ maven embedder INFO] Deleting file: .classpath
[ maven embedder INFO] Deleting file: .wtpmodules
[ maven embedder INFO] Deleting file: .component
[ maven embedder INFO] Deleting file: org.eclipse.wst.common.component
[ maven embedder INFO] Deleting file: org.eclipse.wst.common.project.facet.core.xml
[ maven embedder INFO] Preparing eclipse:eclipse
[ maven embedder INFO] No goals needed for project - skipping
[ maven embedder INFO] [eclipse:eclipse]
[ maven embedder INFO] Not writing settings - defaults suffice
[ maven embedder INFO] The Maven Eclipse plugin runs in 'pde'-mode.
[ maven embedder WARNING] The references manifest file doesn't exist, plugin dependencies
will not be updated: /home/continuum/continuum-maven/working-directory/41/target/test-classes/projects/project-21/META-INF/MANIFEST.MF
[ maven embedder INFO] Wrote Eclipse project for "maven-eclipse-plugin-test-project-21" to
/home/continuum/continuum-maven/working-directory/41/target/test-classes/projects/project-21.
Tests run: 18, Failures: 0, Errors: 0, Skipped: 0, Time elapsed: 231.94 sec

Results :
Tests run: 19, Failures: 0, Errors: 0, Skipped: 0

[INFO] [jar:jar]
[INFO] Building jar: /home/continuum/continuum-maven/working-directory/41/target/maven-eclipse-plugin-2.3-SNAPSHOT.jar
[INFO] [plugin:addPluginArtifactMetadata]
[INFO] [install:install]
[INFO] Installing /home/continuum/continuum-maven/working-directory/41/target/maven-eclipse-plugin-2.3-SNAPSHOT.jar
to /home/continuum/.m2/repository/org/apache/maven/plugins/maven-eclipse-plugin/2.3-SNAPSHOT/maven-eclipse-plugin-2.3-SNAPSHOT.jar
[INFO] [plugin:updateRegistry]
[INFO] ------------------------------------------------------------------------
[INFO] BUILD SUCCESSFUL
[INFO] ------------------------------------------------------------------------
[INFO] Total time: 4 minutes 24 seconds
[INFO] Finished at: Wed Jul 19 06:10:06 PDT 2006
[INFO] Final Memory: 13M/155M
[INFO] ------------------------------------------------------------------------

****************************************************************************



Mime
View raw message